#FIG 3.2  Produced by xfig version 3.2.5c
Landscape
Center
Metric
Letter  
100.00
Single
-2
1200 2
6 4365 2715 5430 3330
4 1 0 50 -1 16 20 0.0000 4 240 1065 4897 2955 Iterator\001
4 1 0 50 -1 16 20 0.0000 4 240 900 4897 3330 model\001
-6
6 7335 2880 8595 3600
4 1 0 50 -1 22 20 0.0000 4 165 1260 7965 3015 Implementation\001
4 1 0 50 -1 22 20 0.0000 4 165 1260 7965 3555 (JSE 1.8.0_45)\001
-6
6 1162 2715 2602 3330
4 1 0 50 -1 16 20 0.0000 4 240 1440 1882 2955 Collection\001
4 1 0 50 -1 16 20 0.0000 4 240 900 1882 3330 model\001
-6
2 2 0 2 0 7 150 -1 -1 0.000 0 0 -1 0 0 5
	 6885 2475 9000 2475 9000 4050 6885 4050 6885 2475
2 2 0 2 0 6 150 -1 20 0.000 0 0 -1 0 0 5
	 900 2490 2925 2490 2925 3600 900 3600 900 2490
2 2 0 2 0 7 150 -1 20 0.000 0 0 -1 0 0 5
	 3915 2475 5895 2475 5895 3600 3915 3600 3915 2475
2 1 0 3 4 7 150 -1 -1 0.000 0 0 -1 1 1 3
	1 1 2.00 120.00 180.00
	1 1 2.00 120.00 180.00
	 1935 3600 1935 3915 6885 3915
