digraph model {
  orientation = landscape;
  graph [ rankdir = "TB", ranksep="0.2", nodesep="0.2" ];
  "" [ shape = "point", height="0.1" ];
  edge [ fontname = "Helvetica", fontsize="12.0", margin="0.05" ];
  { rank = "same"; clabel1; clabel2 }
  clabel1 [ label = "Generate formula", fontname = "Helvetica-Bold",
	    shape = "none", fontsize = "18.0" ];
  clabel2 [ label = "Call solver", fontname = "Helvetica-Bold",
	    shape = "none", fontsize = "18.0" ];
  node [ fontname = "Helvetica", fontsize="18.0", margin="0.02" 
	 style = "filled", color = "white" ];
  "" -> cnf
  subgraph cluster_0 {
	fontname = "Helvetica-Bold";
	fontsize = "18.0"
	labelloc = "b";
	style = "filled";
	color = "lightblue";
	cnf	-> unit;
	unit	-> binary;
	unit	-> clause;
	binary	-> ternary;
	binary	-> clause;
	ternary	-> rest;
	ternary	-> clause;
	rest	-> rest;
	rest	-> clause;
	clause	-> cnf;
	clause	-> clabel1 [ style = "invis", arrowhead = "none" ];
  }
  subgraph cluster_1 {
	fontname = "Helvetica-Bold";
	fontsize = "18.0"
	labelloc = "b";
	style = "filled";
	color = "yellow";
	cnf	-> solve;
	solve	-> sat;
	solve	-> unsat;
	solve	-> inc;
	sat	-> inc;
	unsat	-> inc;
	inc	-> end;
	inc	-> cnf;
	end	-> clabel2 [ style = "invis", arrowhead = "none" ];
	sat	-> clabel2 [ style = "invis", arrowhead = "none" ];
  }
}
