[WARNING] java.lang.AssertionError: assertion failed: After set at t: 0, expected: 1, got: 0 occurred, aborting.
java.lang.AssertionError: assertion failed: After set at t: 0, expected: 1, got: 0
	at scala.Predef$.assert(Predef.scala:165)
	at modbat.tu.ListModel$class.set(ListModel.scala:142)
	at modbat.tu.ArrayListModel.set(ArrayListModel.scala:11)
	at modbat.tu.ListModel$$anonfun$instance$7.apply$mcV$sp(ListModel.scala:186)
	at modbat.tu.ListModel$$anonfun$instance$7.apply(ListModel.scala:186)
	at modbat.tu.ListModel$$anonfun$instance$7.apply(ListModel.scala:186)
[WARNING] Error found, model trace:
[WARNING] modbat/tu/ListModel.scala:185: clear
[WARNING] modbat/tu/ListModel.scala:185: clear
[WARNING] modbat/tu/ListModel.scala:184: removeEl
[WARNING] modbat/tu/ListModel.scala:185: clear
[WARNING] modbat/tu/ListModel.scala:182: size
[WARNING] modbat/tu/ListModel.scala:180: add
[WARNING] modbat/tu/ListModel.scala:186: set
