[WARNING] java.lang.AssertionError: assertion failed: Expected false, got true occurred, aborting.
java.lang.AssertionError: assertion failed: Expected false, got true
	at scala.Predef$.assert(Predef.scala:165)
	at modbat.tu.HashSetModel.add(HashSetModel.scala:31)
	at modbat.tu.HashSetModel$$anonfun$instance$1.apply$mcV$sp(HashSetModel.scala:64)
	at modbat.tu.HashSetModel$$anonfun$instance$1.apply(HashSetModel.scala:64)
	at modbat.tu.HashSetModel$$anonfun$instance$1.apply(HashSetModel.scala:64)
[WARNING] Error found, model trace:
[WARNING] modbat/tu/HashSetModel.scala:64: add
[WARNING] modbat/tu/HashSetModel.scala:66: removeEl
[WARNING] modbat/tu/HashSetModel.scala:66: removeEl
[WARNING] modbat/tu/HashSetModel.scala:64: add
