[WARNING] java.lang.AssertionError: assertion failed: Expected value: 3 with key: 8, got null. occurred, aborting.
java.lang.AssertionError: assertion failed: Expected value: 3 with key: 8, got null.
	at scala.Predef$.assert(Predef.scala:165)
	at modbat.tu.MapModel$class.put(MapModel.scala:50)
	at modbat.tu.HashMapModel.put(HashMapModel.scala:13)
	at modbat.tu.HashMapModel$$anonfun$instance$1.apply$mcV$sp(HashMapModel.scala:20)
	at modbat.tu.HashMapModel$$anonfun$instance$1.apply(HashMapModel.scala:20)
	at modbat.tu.HashMapModel$$anonfun$instance$1.apply(HashMapModel.scala:20)
[WARNING] Error found, model trace:
[WARNING] modbat/tu/HashMapModel.scala:25: get
[WARNING] modbat/tu/HashMapModel.scala:24: clear
[WARNING] modbat/tu/HashMapModel.scala:26: keySet
[WARNING] modbat/tu/HashMapModel.scala:25: get
[WARNING] modbat/tu/HashMapModel.scala:27: values
[WARNING] modbat/tu/HashMapModel.scala:26: keySet
[WARNING] modbat/tu/HashMapModel.scala:27: values
[WARNING] modbat/tu/HashMapModel.scala:23: containsKey
[WARNING] modbat/tu/HashMapModel.scala:25: get
[WARNING] modbat/tu/HashMapModel.scala:27: values
[WARNING] modbat/tu/HashMapModel.scala:26: keySet
[WARNING] modbat/tu/HashMapModel.scala:27: values
[WARNING] modbat/tu/HashMapModel.scala:21: size
[WARNING] modbat/tu/HashMapModel.scala:26: keySet
[WARNING] modbat/tu/HashMapModel.scala:21: size
[WARNING] modbat/tu/HashMapModel.scala:23: containsKey
[WARNING] modbat/tu/HashMapModel.scala:20: put
[WARNING] modbat/tu/HashMapModel.scala:27: values
[WARNING] modbat/tu/HashMapModel.scala:21: size
[WARNING] modbat/tu/HashMapModel.scala:26: keySet
[WARNING] modbat/tu/HashMapModel.scala:22: removeWithKey
[WARNING] modbat/tu/HashMapModel.scala:25: get
[WARNING] modbat/tu/HashMapModel.scala:20: put
[WARNING] modbat/tu/HashMapModel.scala:23: containsKey
[WARNING] modbat/tu/HashMapModel.scala:21: size
[WARNING] modbat/tu/HashMapModel.scala:20: put
