[WARNING] Expected exception did not occur, aborting.
[WARNING] Error found, model trace:
[WARNING] modbat/tu/ListModel.scala:181: isEmpty
[WARNING] modbat/tu/ListModel.scala:185: clear
[WARNING] modbat/tu/ListModel.scala:185: clear
[WARNING] modbat/tu/ListModel.scala:181: isEmpty
[WARNING] modbat/tu/ListModel.scala:180: add
[WARNING] modbat/tu/ListModel.scala:180: add
[WARNING] modbat/tu/ListModel.scala:180: add
[WARNING] modbat/tu/ListModel.scala:188: outOfBounds
