[WARNING] java.lang.ArrayIndexOutOfBoundsException: Index 5; size 5 occurred, aborting.
java.lang.ArrayIndexOutOfBoundsException: Index 5; size 5
	at experiment.util.ArrayList.get(ArrayList.java:46)
	at experiment.util.Stack.peek(Stack.java:56)
	at modbat.tu.StackModel.peek(StackModel.scala:38)
	at modbat.tu.StackModel$$anonfun$instance$2.apply$mcV$sp(StackModel.scala:72)
	at modbat.tu.StackModel$$anonfun$instance$2.apply(StackModel.scala:72)
	at modbat.tu.StackModel$$anonfun$instance$2.apply(StackModel.scala:72)
[WARNING] Error found, model trace:
[WARNING] modbat/tu/StackModel.scala:74: size
[WARNING] modbat/tu/StackModel.scala:75: clear
[WARNING] modbat/tu/StackModel.scala:71: push
[WARNING] modbat/tu/StackModel.scala:71: push
[WARNING] modbat/tu/StackModel.scala:76: isEmpty
[WARNING] modbat/tu/StackModel.scala:75: clear
[WARNING] modbat/tu/StackModel.scala:77: stackEmpty
[WARNING] modbat/tu/StackModel.scala:76: isEmpty
[WARNING] modbat/tu/StackModel.scala:74: size
[WARNING] modbat/tu/StackModel.scala:71: push
[WARNING] modbat/tu/StackModel.scala:75: clear
[WARNING] modbat/tu/StackModel.scala:74: size
[WARNING] modbat/tu/StackModel.scala:76: isEmpty
[WARNING] modbat/tu/StackModel.scala:74: size
[WARNING] modbat/tu/StackModel.scala:71: push
[WARNING] modbat/tu/StackModel.scala:75: clear
[WARNING] modbat/tu/StackModel.scala:76: isEmpty
[WARNING] modbat/tu/StackModel.scala:71: push
[WARNING] modbat/tu/StackModel.scala:71: push
[WARNING] modbat/tu/StackModel.scala:71: push
[WARNING] modbat/tu/StackModel.scala:71: push
[WARNING] modbat/tu/StackModel.scala:76: isEmpty
[WARNING] modbat/tu/StackModel.scala:71: push
[WARNING] modbat/tu/StackModel.scala:76: isEmpty
[WARNING] modbat/tu/StackModel.scala:73: pop
[WARNING] modbat/tu/StackModel.scala:76: isEmpty
[WARNING] modbat/tu/StackModel.scala:74: size
[WARNING] modbat/tu/StackModel.scala:71: push
[WARNING] modbat/tu/StackModel.scala:76: isEmpty
[WARNING] modbat/tu/StackModel.scala:74: size
[WARNING] modbat/tu/StackModel.scala:74: size
[WARNING] modbat/tu/StackModel.scala:72: peek
