[WARNING] java.lang.AssertionError: assertion failed occurred, aborting.
java.lang.AssertionError: assertion failed
	at scala.Predef$.assert(Predef.scala:151)
	at modbat.tu.TreeSetModel.first(TreeSetModel.scala:31)
	at modbat.tu.TreeSetModel$$anonfun$instance$6.apply$mcV$sp(TreeSetModel.scala:73)
	at modbat.tu.TreeSetModel$$anonfun$instance$6.apply(TreeSetModel.scala:73)
	at modbat.tu.TreeSetModel$$anonfun$instance$6.apply(TreeSetModel.scala:73)
[WARNING] Error found, model trace:
[WARNING] modbat/tu/TreeSetModel.scala:71: contains
[WARNING] modbat/tu/TreeSetModel.scala:68: add
[WARNING] modbat/tu/TreeSetModel.scala:71: contains
[WARNING] modbat/tu/TreeSetModel.scala:73: first
[WARNING] modbat/tu/TreeSetModel.scala:72: clear
[WARNING] modbat/tu/TreeSetModel.scala:72: clear
[WARNING] modbat/tu/TreeSetModel.scala:68: add
[WARNING] modbat/tu/TreeSetModel.scala:74: last
[WARNING] modbat/tu/TreeSetModel.scala:73: first
