[WARNING] java.lang.AssertionError: assertion failed: Expected value: 3 with key: 8, got null. occurred, aborting.
java.lang.AssertionError: assertion failed: Expected value: 3 with key: 8, got null.
	at scala.Predef$.assert(Predef.scala:165)
	at modbat.tu.MapModel$class.put(MapModel.scala:50)
	at modbat.tu.TreeMapModel.put(TreeMapModel.scala:13)
	at modbat.tu.TreeMapModel$$anonfun$instance$1.apply$mcV$sp(TreeMapModel.scala:20)
	at modbat.tu.TreeMapModel$$anonfun$instance$1.apply(TreeMapModel.scala:20)
	at modbat.tu.TreeMapModel$$anonfun$instance$1.apply(TreeMapModel.scala:20)
[WARNING] Error found, model trace:
[WARNING] modbat/tu/TreeMapModel.scala:25: get
[WARNING] modbat/tu/TreeMapModel.scala:20: put
[WARNING] modbat/tu/TreeMapModel.scala:23: containsKey
[WARNING] modbat/tu/TreeMapModel.scala:21: size
[WARNING] modbat/tu/TreeMapModel.scala:20: put
