[WARNING] java.lang.NullPointerException occurred, aborting.
java.lang.NullPointerException
	at experiment.util.LinkedList.findPos(LinkedList.java:64)
	at experiment.util.LinkedList.remove(LinkedList.java:172)
	at modbat.tu.ListModel$class.remove(ListModel.scala:148)
	at modbat.tu.LinkedListModel.remove(LinkedListModel.scala:11)
	at modbat.tu.ListModel$$anonfun$instance$5.apply$mcZ$sp(ListModel.scala:184)
	at modbat.tu.ListModel$$anonfun$instance$5.apply(ListModel.scala:184)
	at modbat.tu.ListModel$$anonfun$instance$5.apply(ListModel.scala:184)
[WARNING] Error found, model trace:
[WARNING] modbat/tu/ListModel.scala:181: isEmpty
[WARNING] modbat/tu/ListModel.scala:184: removeEl
