%!PS-Adobe-3.0 EPSF-3.0
%%Creator: Adobe Illustrator(TM) 3.2
%%AI8_CreatorVersion: 11.0.0
%%For: (Yutaka OIWA) (976681352715829623420767)
%%Title: (AIST-signature-canon.eps)
%%CreationDate: 5/12/2005 9:56 AM
%%BoundingBox: 33 252 565 574
%%DocumentProcessColors: Magenta Yellow Black
%%DocumentSuppliedResources: procset Adobe_packedarray 2.0 0
%%+ procset Adobe_cmykcolor 1.1 0
%%+ procset Adobe_cshow 1.1 0
%%+ procset Adobe_customcolor 1.0 0
%%+ procset Adobe_pattern_AI3 1.0 0
%%+ procset Adobe_Illustrator_AI3 1.0 1
%AI3_ColorUsage: Color
%AI3_IncludePlacedImages
%AI3_TemplateBox: 298.5 420.3896 298.5 420.3896
%AI3_TileBox: 16.7998 12.9297 576.7198 829.8896
%AI3_DocumentPreview: Header
%%PageOrigin:14 16
%AI7_GridSettings: 72 8 72 8 1 0 0.8 0.8 0.8 0.9 0.9 0.9
%AI9_Flatten: 1
%%EndComments
%%BeginProlog
%%BeginResource: procset Adobe_packedarray 2.0 0
%%Title: (Packed Array Operators)
%%Version: 2.0 0
%%CreationDate: (8/2/90) ()
%%Copyright: ((C) 1987-1996 Adobe Systems Incorporated All Rights Reserved)
userdict /Adobe_packedarray 5 dict dup begin put
/initialize
{
/packedarray where
	{
	pop
	}
	{
	Adobe_packedarray begin
	Adobe_packedarray
		{
		dup xcheck
			{
			bind
			} if
		userdict 3 1 roll put
		} forall
 end
	} ifelse
} def
/terminate
{
} def
/packedarray
{
array astore readonly
} def
/setpacking
{
pop
} def
/currentpacking
{
false
} def
currentdict readonly pop end
%%EndResource
Adobe_packedarray /initialize get exec
%%BeginResource: procset Adobe_cmykcolor 1.1 0
%%Title: (CMYK Color Operators)
%%Version: 1.1 0
%%CreationDate: (1/23/89) ()
%%Copyright: ((C) 1987-1996 Adobe Systems Incorporated All Rights Reserved)
currentpacking true setpacking
userdict /Adobe_cmykcolor 4 dict dup begin put
/initialize
{
/setcmykcolor where
	{
	pop
	}
	{
	userdict /Adobe_cmykcolor_vars 2 dict dup begin put
	/_setrgbcolor
		/setrgbcolor load def
	/_currentrgbcolor
		/currentrgbcolor load def
	Adobe_cmykcolor begin
	Adobe_cmykcolor
		{
		dup xcheck
			{
			bind
			} if
		pop pop
		} forall
 end
 end
	Adobe_cmykcolor begin
	} ifelse
} def
/terminate
{
currentdict Adobe_cmykcolor eq
	{
 end
	} if
} def
/setcmykcolor
{
1 sub 4 1 roll
3
	{
	3 index add neg dup 0 lt
		{
		pop 0
		} if
	3 1 roll
	} repeat
Adobe_cmykcolor_vars /_setrgbcolor get exec
pop
} def 
/currentcmykcolor
{
Adobe_cmykcolor_vars /_currentrgbcolor get exec
3
	{
	1 sub neg 3 1 roll
	} repeat
0
} def
currentdict readonly pop end
setpacking
%%EndResource
%%BeginResource: procset Adobe_cshow 1.1 0
%%Title: (cshow Operator)
%%Version: 1.1 0
%%CreationDate: (1/23/89) ()
%%Copyright: ((C) 1987-1996 Adobe Systems Incorporated All Rights Reserved)
currentpacking true setpacking
userdict /Adobe_cshow 3 dict dup begin put
/initialize
{
/cshow where
	{
	pop
	}
	{
	userdict /Adobe_cshow_vars 1 dict dup begin put
	/_cshow
		{} def
	Adobe_cshow begin
	Adobe_cshow
		{
		dup xcheck
			{
			bind
			} if
		userdict 3 1 roll put
		} forall
 end
 end
	} ifelse
} def
/terminate
{
} def
/cshow
{
exch
Adobe_cshow_vars
	exch /_cshow
	exch put
	{
	0 0 Adobe_cshow_vars /_cshow get exec
	} forall
} def
currentdict readonly pop end
setpacking
%%EndResource
%%BeginResource: procset Adobe_customcolor 1.0 0
%%Title: (Custom Color Operators)
%%Version: 1.0 0
%%CreationDate: (5/9/88) ()
%%Copyright: ((C) 1987-1996 Adobe Systems Incorporated All Rights Reserved)
currentpacking true setpacking
userdict /Adobe_customcolor 5 dict dup begin put
/initialize
{
/setcustomcolor where
	{
	pop
	}
	{
	Adobe_customcolor begin
	Adobe_customcolor
		{
		dup xcheck
			{
			bind
			} if
		pop pop
		} forall
 end
	Adobe_customcolor begin
	} ifelse
} def
/terminate
{
currentdict Adobe_customcolor eq
	{
 end
	} if
} def
/findcmykcustomcolor
{
5 packedarray
}  def
/setcustomcolor
{
exch
aload pop pop
4
	{
	4 index mul 4 1 roll
	} repeat
5 -1 roll pop
setcmykcolor
} def
/setoverprint
{
pop
} def
currentdict readonly pop end
setpacking
%%EndResource
%%BeginResource: procset Adobe_pattern_AI3 1.1 0
%%Title: (Adobe Illustrator (R) Version 3.0 Pattern Operators)
%%Version: 1.1 0
%%CreationDate: (7/21/89) ()
%%Copyright: ((C) 1987-1996 Adobe Systems Incorporated All Rights Reserved)
currentpacking true setpacking
userdict /Adobe_pattern_AI3 16 dict dup begin put
/initialize
{
/definepattern where
	{
	pop
	}
	{
	Adobe_pattern_AI3 begin
	Adobe_pattern_AI3
		{
		dup xcheck
			{
			bind
			} if
		pop pop
		} forall
	mark
	cachestatus 7 1 roll pop pop pop pop exch pop exch
		{
		{
		10000 add
		dup 2 index gt
			{
			exit
			} if
		dup setcachelimit
		} loop
		} stopped
	cleartomark
	} ifelse
} def
/terminate
{
currentdict Adobe_pattern_AI3 eq
	{
 end
	} if
} def
errordict
/nocurrentpoint
{
pop
stop
} put
errordict
/invalidaccess
{
pop
stop
} put
/patternencoding
256 array def
0 1 255
{
patternencoding exch ( ) 2 copy exch 0 exch put cvn put
} for
/definepattern
{
17 dict begin
/uniform exch def
/cache exch def
/key exch def
/procarray exch def
/mtx exch matrix invertmatrix def
/height exch def
/width exch def
/ctm matrix currentmatrix def
/ptm matrix def
/str 32 string def
/slice 9 dict def
slice /s 1 put
slice /q 256 procarray length div sqrt floor cvi put
slice /b 0 put
/FontBBox [0 0 0 0] def
/FontMatrix mtx matrix copy def
/Encoding patternencoding def
/FontType 3 def
/BuildChar
	{
	exch
 begin
	/setstrokeadjust where {pop true setstrokeadjust} if
	slice begin
	dup q dup mul mod s idiv /i exch def
	dup q dup mul mod s mod /j exch def
	q dup mul idiv procarray exch get
	/xl j width s div mul def
	/xg j 1 add width s div mul def
	/yl i height s div mul def
	/yg i 1 add height s div mul def
	uniform
		{
		1 1
		}
		{
		width 0 dtransform
		dup mul exch dup mul add sqrt dup 1 add exch div
		0 height dtransform
		dup mul exch dup mul add sqrt dup 1 add exch div
		} ifelse
	width 0 cache
		{
		xl 4 index mul yl 4 index mul xg 6 index mul yg 6 index mul
		setcachedevice
		}
		{
		setcharwidth
		} ifelse
	gsave
	scale
	newpath
	xl yl moveto
	xg yl lineto
	xg yg lineto
	xl yg lineto
	closepath
	clip
	newpath
 end
 end
	exec
	grestore
	} def
key currentdict definefont
end
} def
/patterncachesize
{
gsave
newpath
0 0 moveto
width 0 lineto
width height lineto
0 height lineto
closepath
patternmatrix setmatrix
pathbbox
exch ceiling 4 -1 roll floor sub 3 1 roll
ceiling exch floor sub
mul 1 add
grestore
} def
/patterncachelimit
{
cachestatus 7 1 roll 6 npop 8 mul
} def
/patternpath
{
exch dup begin setfont
ctm setmatrix
concat
slice exch /b exch slice /q get dup mul mul put
FontMatrix concat
uniform
	{
	width 0 dtransform round width div exch round width div exch
	0 height dtransform round height div exch height div exch
	0 0 transform round exch round exch
	ptm astore setmatrix
	}
	{
	ptm currentmatrix pop
	} ifelse
{currentpoint} stopped not
	{
	2 npop
	pathbbox
	true
	4 index 3 index eq
	4 index 3 index eq
	and
		{
		pop false
			{
			{2 npop}
			{3 npop true}
			{7 npop true}
			{pop true}
			pathforall
			} stopped
			{
			5 npop true
			} if
		} if
		{
		height div ceiling height mul 4 1 roll
		width div ceiling width mul 4 1 roll
		height div floor height mul 4 1 roll
		width div floor width mul 4 1 roll
		2 index sub height div ceiling cvi exch
		3 index sub width div ceiling cvi exch
		4 2 roll moveto
		FontMatrix mtx invertmatrix
		dup dup 4 get exch 5 get rmoveto
		ptm ptm concatmatrix pop
		slice /s
		patterncachesize patterncachelimit div ceiling sqrt ceiling cvi
		dup slice /q get gt
			{
			pop slice /q get
			} if
		put
		0 1 slice /s get dup mul 1 sub
			{
			slice /b get add
			gsave
			0 1 str length 1 sub
				{
				str exch 2 index put
				} for
			pop
			dup
				{
				gsave
				ptm setmatrix
				1 index str length idiv {str show} repeat
				1 index str length mod str exch 0 exch getinterval show
				grestore
				0 height rmoveto
				} repeat
			grestore
			} for
		2 npop
		}
		{
		4 npop
		} ifelse
	} if
end
} def
/patternclip
{
clip
} def
/patternstrokepath
{
strokepath
} def
/patternmatrix
matrix def
/patternfill
{
dup type /dicttype eq
	{
	Adobe_pattern_AI3 /patternmatrix get
	} if
gsave
patternclip
Adobe_pattern_AI3 /patternpath get exec
grestore
newpath
} def
/patternstroke
{
dup type /dicttype eq
	{
	Adobe_pattern_AI3 /patternmatrix get
	} if
gsave
patternstrokepath
true
	{
		{
			{
			newpath 
			moveto
			}
			{
			lineto
			}
			{
			curveto
			}
			{
			closepath
			3 copy
			Adobe_pattern_AI3 /patternfill get exec
			} pathforall
		3 npop
		} stopped
			{
			5 npop
			patternclip
			Adobe_pattern_AI3 /patternfill get exec
			} if
	}
	{
	patternclip
	Adobe_pattern_AI3 /patternfill get exec
	} ifelse
grestore
newpath
} def
/patternashow
{
3 index type /dicttype eq
	{
	Adobe_pattern_AI3 /patternmatrix get 4 1 roll
	} if
	{
	2 npop (0) exch
	2 copy 0 exch put pop
	gsave
	false charpath currentpoint
	6 index 6 index 6 index
	Adobe_pattern_AI3 /patternfill get exec
	grestore
	newpath moveto
	2 copy rmoveto
	} exch cshow
5 npop
} def
/patternawidthshow
{
6 index type /dicttype eq
	{
	Adobe_pattern_AI3 /patternmatrix get 7 1 roll
	} if
	{
	2 npop (0) exch
	2 copy 0 exch put 
	gsave
	_sp eq {5 index 5 index rmoveto} if
	false charpath currentpoint
	9 index 9 index 9 index
	Adobe_pattern_AI3 /patternfill get exec
	grestore
	newpath moveto
	2 copy rmoveto
	} exch cshow
8 npop
} def
/patternashowstroke
{
4 index type /dicttype eq
	{
	patternmatrix /patternmatrix get 5 1 roll
	} if
4 1 roll
	{
	2 npop (0) exch
	2 copy 0 exch put pop
	gsave
	false charpath
	currentpoint
	4 index setmatrix
	7 index 7 index 7 index
	Adobe_pattern_AI3 /patternstroke get exec
	grestore
	newpath moveto
	2 copy rmoveto
	} exch cshow
6 npop
} def
/patternawidthshowstroke
{
7 index type /dicttype eq
	{
	patternmatrix /patternmatrix get 8 1 roll
	} if
7 1 roll
	{
	2 npop (0) exch
	2 copy 0 exch put
	gsave
	_sp eq {5 index 5 index rmoveto} if
	false charpath currentpoint
	7 index setmatrix
	10 index 10 index 10 index
	Adobe_pattern_AI3 /patternstroke get exec
	grestore
	newpath moveto
	2 copy rmoveto
	} exch cshow
9 npop
} def
currentdict readonly pop end
setpacking
%%EndResource
%%BeginResource: procset Adobe_Illustrator_AI3 1.1 0
%%Title: (Adobe Illustrator (R) Version 3.0 Full Prolog)
%%Version: 1.1 0
%%CreationDate: (3/7/1994) ()
%%Copyright: ((C) 1987-1996 Adobe Systems Incorporated All Rights Reserved)
currentpacking true setpacking
userdict /Adobe_Illustrator_AI3 71 dict dup begin put
/initialize
{
userdict /Adobe_Illustrator_AI3_vars 67 dict dup begin put
/_lp /none def
/_pf {} def
/_ps {} def
/_psf {} def
/_pss {} def
/_pjsf {} def
/_pjss {} def
/_pola 0 def
/_doClip 0 def
/cf	currentflat def
/_tm matrix def
/_renderStart [/e0 /r0 /a0 /o0 /e1 /r1 /a1 /i0] def 
/_renderEnd [null null null null /i1 /i1 /i1 /i1] def
/_render -1 def
/_rise 0 def
/_ax 0 def
/_ay 0 def
/_cx 0 def
/_cy 0 def
/_leading [0 0] def
/_ctm matrix def
/_mtx matrix def
/_sp 16#020 def
/_hyphen (-) def
/_fScl 0 def
/_cnt 0 def
/_hs 1 def
/_nativeEncoding 0 def
/_useNativeEncoding 0 def
/_tempEncode 0 def
/_pntr 0 def
/_tDict 2 dict def
/_wv 0 def
/Tx {} def
/Tj {} def
/CRender {} def
/_AI3_savepage {} def
/_gf null def
/_cf 4 array def
/_if null def
/_of false def
/_fc {} def
/_gs null def
/_cs 4 array def
/_is null def
/_os false def
/_sc {} def
/_pd 1 dict def
/_ed 15 dict def
/_pm matrix def
/_fm null def
/_fd null def
/_fdd null def
/_sm null def
/_sd null def
/_sdd null def
/_i null def
Adobe_Illustrator_AI3 begin
Adobe_Illustrator_AI3 dup /nc get begin
	{
	dup xcheck
		{
		bind
		} if
	pop pop
	} forall
end
end
end
Adobe_Illustrator_AI3 begin
Adobe_Illustrator_AI3_vars begin
newpath
} def
/terminate
{
end
end
} def
/_
null def
/ddef
{
Adobe_Illustrator_AI3_vars 3 1 roll put
} def
/xput
{
dup load dup length exch maxlength eq
	{
	dup dup load dup
	length 2 mul dict copy def
	} if
load begin def end
} def
/npop
{
	{
	pop
	} repeat
} def
/sw
{
dup length exch stringwidth
exch 5 -1 roll 3 index mul add
4 1 roll 3 1 roll mul add
} def
/swj
{
dup 4 1 roll
dup length exch stringwidth 
exch 5 -1 roll 3 index mul add
4 1 roll 3 1 roll mul add 
6 2 roll /_cnt 0 ddef
{1 index eq {/_cnt _cnt 1 add ddef} if} forall pop
exch _cnt mul exch _cnt mul 2 index add 4 1 roll 2 index add 4 1 roll pop pop
} def
/ss
{
4 1 roll
	{
	2 npop 
	(0) exch 2 copy 0 exch put pop
	gsave
	false charpath currentpoint
	4 index setmatrix
	stroke
	grestore
	moveto
	2 copy rmoveto
	} exch cshow
3 npop
} def
/jss
{
4 1 roll
	{
	2 npop 
	(0) exch 2 copy 0 exch put 
	gsave
	_sp eq 
		{
		exch 6 index 6 index 6 index 5 -1 roll widthshow  
		currentpoint
		}
		{
		false charpath currentpoint
		4 index setmatrix stroke
		}ifelse
	grestore
	moveto
	2 copy rmoveto
	} exch cshow
6 npop
} def
/sp
{
	{
	2 npop (0) exch
	2 copy 0 exch put pop
	false charpath
	2 copy rmoveto
	} exch cshow
2 npop
} def
/jsp
{
	{
	2 npop 
	(0) exch 2 copy 0 exch put 
	_sp eq 
		{
		exch 5 index 5 index 5 index 5 -1 roll widthshow  
		}
		{
		false charpath
		}ifelse
	2 copy rmoveto
	} exch cshow
5 npop
} def
/pl
{
transform
0.25 sub round 0.25 add exch
0.25 sub round 0.25 add exch
itransform
} def
/setstrokeadjust where
	{
	pop true setstrokeadjust
	/c
	{
	curveto
	} def
	/C
	/c load def
	/v
	{
	currentpoint 6 2 roll curveto
	} def
	/V
	/v load def
	/y
	{
	2 copy curveto
	} def
	/Y
	/y load def
	/l
	{
	lineto
	} def
	/L
	/l load def
	/m
	{
	moveto
	} def
	}
	{
	/c
	{
	pl curveto
	} def
	/C
	/c load def
	/v
	{
	currentpoint 6 2 roll pl curveto
	} def
	/V
	/v load def
	/y
	{
	pl 2 copy curveto
	} def
	/Y
	/y load def
	/l
	{
	pl lineto
	} def
	/L
	/l load def
	/m
	{
	pl moveto
	} def
	} ifelse
/d
{
setdash
} def
/cf	{} def
/i
{
dup 0 eq
	{
	pop cf
	} if
setflat
} def
/j
{
setlinejoin
} def
/J
{
setlinecap
} def
/M
{
setmiterlimit
} def
/w
{
setlinewidth
} def
/H
{} def
/h
{
closepath
} def
/N
{
_pola 0 eq 
	{
	_doClip 1 eq {clip /_doClip 0 ddef} if 
	newpath
	} 
	{
	/CRender {N} ddef
	}ifelse
} def
/n
{N} def
/F
{
_pola 0 eq 
	{
	_doClip 1 eq 
		{
		gsave _pf grestore clip newpath /_lp /none ddef _fc 
		/_doClip 0 ddef
		}
		{
		_pf
		}ifelse
	} 
	{
	/CRender {F} ddef
	}ifelse
} def
/f
{
closepath
F
} def
/S
{
_pola 0 eq 
	{
	_doClip 1 eq 
		{
		gsave _ps grestore clip newpath /_lp /none ddef _sc 
		/_doClip 0 ddef
		}
		{
		_ps
		}ifelse
	} 
	{
	/CRender {S} ddef
	}ifelse
} def
/s
{
closepath
S
} def
/B
{
_pola 0 eq 
	{
	_doClip 1 eq
	gsave F grestore 
		{
		gsave S grestore clip newpath /_lp /none ddef _sc
		/_doClip 0 ddef
		} 
		{
		S
		}ifelse
	}
	{
	/CRender {B} ddef
	}ifelse
} def
/b
{
closepath
B
} def
/W
{
/_doClip 1 ddef
} def
/*
{
count 0 ne 
	{
	dup type (stringtype) eq {pop} if
	} if 
_pola 0 eq {newpath} if
} def
/u
{} def
/U
{} def
/q
{
_pola 0 eq {gsave} if
} def
/Q
{
_pola 0 eq {grestore} if
} def
/*u
{
_pola 1 add /_pola exch ddef
} def
/*U
{
_pola 1 sub /_pola exch ddef 
_pola 0 eq {CRender} if
} def
/D
{pop} def
/*w
{} def
/*W
{} def
/`
{
/_i save ddef
6 1 roll 4 npop
concat pop
userdict begin
/showpage {} def
0 setgray
0 setlinecap
1 setlinewidth
0 setlinejoin
10 setmiterlimit
[] 0 setdash
/setstrokeadjust where {pop false setstrokeadjust} if
newpath
0 setgray
false setoverprint
} def
/~
{
end
_i restore
} def
/@
{} def
/&
{} def
/O
{
0 ne
/_of exch ddef
/_lp /none ddef
} def
/R
{
0 ne
/_os exch ddef
/_lp /none ddef
} def
/g
{
/_gf exch ddef
/_fc
{
_lp /fill ne
	{
	_of setoverprint
	_gf setgray
	/_lp /fill ddef
	} if
} ddef
/_pf
{
_fc
fill
} ddef
/_psf
{
_fc
ashow
} ddef
/_pjsf
{
_fc
awidthshow
} ddef
/_lp /none ddef
} def
/G
{
/_gs exch ddef
/_sc
{
_lp /stroke ne
	{
	_os setoverprint
	_gs setgray
	/_lp /stroke ddef
	} if
} ddef
/_ps
{
_sc
stroke
} ddef
/_pss
{
_sc
ss
} ddef
/_pjss
{
_sc
jss
} ddef
/_lp /none ddef
} def
/k
{
_cf astore pop
/_fc
{
_lp /fill ne
	{
	_of setoverprint
	_cf aload pop setcmykcolor
	/_lp /fill ddef
	} if
} ddef
/_pf
{
_fc
fill
} ddef
/_psf
{
_fc
ashow
} ddef
/_pjsf
{
_fc
awidthshow
} ddef
/_lp /none ddef
} def
/K
{
_cs astore pop
/_sc
{
_lp /stroke ne
	{
	_os setoverprint
	_cs aload pop setcmykcolor
	/_lp /stroke ddef
	} if
} ddef
/_ps
{
_sc
stroke
} ddef
/_pss
{
_sc
ss
} ddef
/_pjss
{
_sc
jss
} ddef
/_lp /none ddef
} def
/x
{
/_gf exch ddef
findcmykcustomcolor
/_if exch ddef
/_fc
{
_lp /fill ne
	{
	_of setoverprint
	_if _gf 1 exch sub setcustomcolor
	/_lp /fill ddef
	} if
} ddef
/_pf
{
_fc
fill
} ddef
/_psf
{
_fc
ashow
} ddef
/_pjsf
{
_fc
awidthshow
} ddef
/_lp /none ddef
} def
/X
{
/_gs exch ddef
findcmykcustomcolor
/_is exch ddef
/_sc
{
_lp /stroke ne
	{
	_os setoverprint
	_is _gs 1 exch sub setcustomcolor
	/_lp /stroke ddef
	} if
} ddef
/_ps
{
_sc
stroke
} ddef
/_pss
{
_sc
ss
} ddef
/_pjss
{
_sc
jss
} ddef
/_lp /none ddef
} def
/dp
{
dup null eq
{
pop
_dp 0 ne
	{
	0 1 _dp 1 sub _dl mod
		{
		_da exch get 3 get
		} for
	_dp 1 sub _dl mod 1 add packedarray
	_da 0 get aload pop 8 -1 roll 5 -1 roll pop 4 1 roll
	definepattern pop
	} if
}
{
_dp 0 ne _dp _dl mod 0 eq and
	{
	null dp
	} if
7 packedarray _da exch _dp _dl mod exch put
_dp _dl mod _da 0 get 4 get 2 packedarray
/_dp _dp 1 add def
} ifelse
} def
/E
{
_ed begin
dup 0 get type /arraytype ne
	{
	0
		{
		dup 1 add index type /arraytype eq
			{
			1 add
			}
			{
			exit
			} ifelse
		} loop
	array astore
	} if
/_dd exch def
/_ury exch def
/_urx exch def
/_lly exch def
/_llx exch def
/_n exch def
/_y 0 def
/_dl 4 def
/_dp 0 def
/_da _dl array def
0 1 _dd length 1 sub
	{
	/_d exch _dd exch get def
	0 2 _d length 2 sub
		{
		/_x exch def
		/_c _d _x get _ ne def
		/_r _d _x 1 add get cvlit def
		_r _ ne
			{
			_urx _llx sub _ury _lly sub [1 0 0 1 0 0] 
				[
				/save cvx
				_llx neg _lly neg /translate cvx
				_c
					{
					nc /begin cvx
					} if
				_r dup type /stringtype eq
					{
					cvx
					}
					{
					{exec} /forall cvx
					} ifelse
				_c
					{
					/end cvx
					} if
				/restore cvx
				] cvx
			/_fn 12 _n length add string def
			_y _fn cvs pop
			/_y _y 1 add def
			_fn 12 _n putinterval
			_fn _c false dp
			_d exch _x 1 add exch put
			} if
		} for
	} for
null dp
_n _dd /_pd
end xput
} def
/fc
{
_fm dup concatmatrix pop
} def
/p
{
/_fm exch ddef
9 -2 roll _pm translate fc
7 -2 roll _pm scale fc
5 -1 roll _pm rotate fc
4 -2 roll exch 0 ne
	{
	dup _pm rotate fc
	1 -1 _pm scale fc
	neg _pm rotate fc
	}
	{
	pop
	} ifelse
dup _pm rotate fc
exch dup sin exch cos div 1 0 0 1 0 6 2 roll
_pm astore fc
neg _pm rotate fc
_pd exch get /_fdd exch ddef
/_pf
{
save
/_doClip 0 ddef
0 1 _fdd length 1 sub
	{
	/_fd exch _fdd exch get ddef
	_fd
	0 2 _fd length 2 sub
		{
		gsave
		2 copy get dup _ ne
			{
			cvx exec _fc
			}
			{
			pop
			} ifelse
		2 copy 1 add get dup _ ne
			{
			aload pop findfont _fm
			patternfill
			}
			{
			pop
			fill
			} ifelse
		grestore
		pop
		} for
	pop
	} for
restore
newpath
} ddef
/_psf
{
save
/_doClip 0 ddef
0 1 _fdd length 1 sub
	{
	/_fd exch _fdd exch get ddef
	_fd
	0 2 _fd length 2 sub
		{
		gsave
		2 copy get dup _ ne
			{
			cvx exec _fc
			}
			{
			pop
			} ifelse
		2 copy 1 add get dup _ ne
			{
			aload pop findfont _fm
			9 copy 6 npop patternashow
			}
			{
			pop
			6 copy 3 npop ashow
			} ifelse
		grestore
		pop
		} for
	pop
	} for
restore
%3 npop newpath
sw rmoveto
} ddef
/_pjsf
{
save
/_doClip 0 ddef
0 1 _fdd length 1 sub
	{
	/_fd exch _fdd exch get ddef
	_fd
	0 2 _fd length 2 sub
		{
		gsave
		2 copy get dup _ ne
			{
			cvx exec _fc
			}
			{
			pop
			} ifelse
		2 copy 1 add get dup _ ne
			{
			aload pop findfont _fm
			12 copy 6 npop patternawidthshow
			}
			{
			pop 9 copy 3 npop awidthshow
			} ifelse
		grestore
		pop
		} for
	pop
	} for
restore
swj rmoveto
} ddef
/_lp /none ddef
} def
/sc
{
_sm dup concatmatrix pop
} def
/P
{
/_sm exch ddef
9 -2 roll _pm translate sc
7 -2 roll _pm scale sc
5 -1 roll _pm rotate sc
4 -2 roll exch 0 ne
	{
	dup _pm rotate sc
	1 -1 _pm scale sc
	neg _pm rotate sc
	}
	{
	pop
	} ifelse
dup _pm rotate sc
exch dup sin exch cos div 1 0 0 1 0 6 2 roll
_pm astore sc
neg _pm rotate sc
_pd exch get /_sdd exch ddef
/_ps
{
save
/_doClip 0 ddef
0 1 _sdd length 1 sub
	{
	/_sd exch _sdd exch get ddef
	_sd
	0 2 _sd length 2 sub
		{
		gsave
		2 copy get dup _ ne
			{
			cvx exec _sc
			}
			{
			pop
			} ifelse
		2 copy 1 add get dup _ ne
			{
			aload pop findfont _sm
			patternstroke
			}
			{
			pop stroke
			} ifelse
		grestore
		pop
		} for
	pop
	} for
restore
newpath
} ddef
/_pss
{
save
/_doClip 0 ddef
0 1 _sdd length 1 sub
	{
	/_sd exch _sdd exch get ddef
	_sd
	0 2 _sd length 2 sub
		{
		gsave
		2 copy get dup _ ne
			{
			cvx exec _sc
			}
			{
			pop
			} ifelse
		2 copy 1 add get dup _ ne
			{
			aload pop findfont _sm
			10 copy 6 npop patternashowstroke
			}
			{
			pop 7 copy 3 npop ss
			} ifelse
		grestore
		pop
		} for
	pop
	} for
restore
pop sw rmoveto
} ddef
/_pjss
{
save
/_doClip 0 ddef
0 1 _sdd length 1 sub
	{
	/_sd exch _sdd exch get ddef
	_sd
	0 2 _sd length 2 sub
		{
		gsave
		2 copy get dup _ ne
			{
			cvx exec _sc
			}
			{
			pop
			} ifelse
		2 copy 1 add get dup _ ne
			{
			aload pop findfont _sm
			13 copy 6 npop patternawidthshowstroke
			}
			{
			pop 10 copy 3 npop jss
			} ifelse
		grestore
		pop
		} for
	pop
	} for
restore
pop swj rmoveto
} ddef
/_lp /none ddef
} def
/A
{
pop
} def
/nc 3 dict def
nc begin
/setgray
{
pop
} bind def
/setcmykcolor
{
4 npop
} bind def
/setcustomcolor
{
2 npop
} bind def
currentdict readonly pop end
currentdict readonly pop end
setpacking
/annotatepage
{
} def
%%EndResource
%%EndProlog
%%BeginSetup
Adobe_cmykcolor /initialize get exec
Adobe_cshow /initialize get exec
Adobe_customcolor /initialize get exec
Adobe_pattern_AI3 /initialize get exec
Adobe_Illustrator_AI3 /initialize get exec
%AI3_BeginPattern: (\203A\203W\203\205\201[\203\213\203\212\203\223\203O)
(\203A\203W\203\205\201[\203\213\203\212\203\223\203O) 22.5 22.5 58.5 58.5 [
%AI3_Tile
(0 O 0 R 0.9412 0.9333 0.0235 0.0039 k
 0.9412 0.9333 0.0235 0.0039 K
) @
(
%AI6_BeginPatternLayer
0 J 0 j 1.75 w 4 M []0 d40.5 58.5 m
40.5 48.5586 32.4409 40.5 22.5 40.5 c
12.5591 40.5 4.5 48.5586 4.5 58.5 c
4.5 68.4414 12.5591 76.5 22.5 76.5 c
32.4409 76.5 40.5 68.4414 40.5 58.5 c
s
40.5 22.5 m
40.5 12.5586 32.4409 4.5 22.5 4.5 c
12.5591 4.5 4.5 12.5586 4.5 22.5 c
4.5 32.4414 12.5591 40.5 22.5 40.5 c
32.4409 40.5 40.5 32.4414 40.5 22.5 c
s
40.5 40.5 m
40.5 30.5586 32.4409 22.5 22.5 22.5 c
12.5591 22.5 4.5 30.5586 4.5 40.5 c
4.5 50.4414 12.5591 58.5 22.5 58.5 c
32.4409 58.5 40.5 50.4414 40.5 40.5 c
s
58.5 58.5 m
58.5 48.5586 50.4409 40.5 40.5 40.5 c
30.5591 40.5 22.5 48.5586 22.5 58.5 c
22.5 68.4414 30.5591 76.5 40.5 76.5 c
50.4409 76.5 58.5 68.4414 58.5 58.5 c
s
58.5 22.5 m
58.5 12.5586 50.4409 4.5 40.5 4.5 c
30.5591 4.5 22.5 12.5586 22.5 22.5 c
22.5 32.4414 30.5591 40.5 40.5 40.5 c
50.4409 40.5 58.5 32.4414 58.5 22.5 c
s
58.5 40.5 m
58.5 30.5586 50.4409 22.5 40.5 22.5 c
30.5591 22.5 22.5 30.5586 22.5 40.5 c
22.5 50.4414 30.5591 58.5 40.5 58.5 c
50.4409 58.5 58.5 50.4414 58.5 40.5 c
s
76.5 58.5 m
76.5 48.5586 68.4409 40.5 58.5 40.5 c
48.5591 40.5 40.5 48.5586 40.5 58.5 c
40.5 68.4414 48.5591 76.5 58.5 76.5 c
68.4409 76.5 76.5 68.4414 76.5 58.5 c
s
76.5 22.5 m
76.5 12.5586 68.4409 4.5 58.5 4.5 c
48.5591 4.5 40.5 12.5586 40.5 22.5 c
40.5 32.4414 48.5591 40.5 58.5 40.5 c
68.4409 40.5 76.5 32.4414 76.5 22.5 c
s
76.5 40.5 m
76.5 30.5586 68.4409 22.5 58.5 22.5 c
48.5591 22.5 40.5 30.5586 40.5 40.5 c
40.5 50.4414 48.5591 58.5 58.5 58.5 c
68.4409 58.5 76.5 50.4414 76.5 40.5 c
s
%AI6_EndPatternLayer
) &
] E
%AI3_EndPattern
%AI3_BeginPattern: (\203J\203\200\203t\203\211\201[\203W\203\205)
(\203J\203\200\203t\203\211\201[\203W\203\205) 1 1 73 73 [
%AI3_Tile
(0 O 0 R 0.6039 0.1412 0.9294 0.0275 k
 0.6039 0.1412 0.9294 0.0275 K
) @
(
%AI6_BeginPatternLayer
0 J 0 j 1 w 4 M []0 d1 73 m
1 1 L
73 1 L
73 73 L
1 73 L
f
%AI6_EndPatternLayer
) &
(0 O 0 R 0.4941 0.3529 0.9373 0.2 k
 0.4941 0.3529 0.9373 0.2 K
) @
(
%AI6_BeginPatternLayer
0 J 0 j 1 w 4 M []0 d18.5449 73 m
18.5449 1 L
46.7832 1 L
46.7832 73 L
18.5449 73 L
f
%AI6_EndPatternLayer
) &
(0 O 0 R 0.1882 0.1098 0.8902 0.0157 k
 0.1882 0.1098 0.8902 0.0157 K
) @
(
%AI6_BeginPatternLayer
0 J 0 j 1 w 4 M []0 d11.9512 1 m
11.9512 4.7129 9.2314 2.8813 9.2314 6.5938 c
9.2314 10.2334 4.25 10.2334 4.25 13.8735 c
4.25 17.4858 10.0313 17.4858 10.0313 21.0991 c
10.0313 24.832 10.208 24.832 10.208 28.5654 c
10.208 32.3071 5.5205 32.3071 5.5205 36.0469 c
5.5205 39.7021 11.8838 39.7021 11.8838 43.356 c
11.8838 47.0566 7.4609 47.0566 7.4609 50.7568 c
7.4609 54.4043 5.7959 54.4043 5.7959 58.0542 c
5.7959 61.7686 4.6631 61.7686 4.6631 65.4805 c
4.6631 69.1636 11.9512 69.3184 11.9512 73 C
27.9268 73 L
27.9268 69.3184 22.0635 69.1636 22.0635 65.4805 c
22.0635 61.7686 28.6631 61.7686 28.6631 58.0542 c
28.6631 54.4043 25.1553 54.4043 25.1553 50.7568 c
25.1553 47.0566 28.8145 47.0566 28.8145 43.356 c
28.8145 39.7021 22.1191 39.7021 22.1191 36.0469 c
22.1191 32.3071 26.3945 32.3071 26.3945 28.5654 c
26.3945 24.832 24.4248 24.832 24.4248 21.0991 c
24.4248 17.4858 20.3838 17.4858 20.3838 13.8735 c
20.3838 10.2334 24.6055 10.2334 24.6055 6.5938 c
24.6055 2.8813 27.9268 4.7129 27.9268 1 C
11.9512 1 L
f
%AI6_EndPatternLayer
) &
(0 O 0 R 0.9216 0.2118 0.9216 0.0745 k
 0.9216 0.2118 0.9216 0.0745 K
) @
(
%AI6_BeginPatternLayer
0 J 0 j 1 w 4 M []0 d41.875 1 m
41.875 4.7134 42.3867 2.8818 42.3867 6.5938 c
42.3867 10.2334 40.5947 10.2334 40.5947 13.8735 c
40.5947 17.4858 41.5742 17.4858 41.5742 21.0991 c
41.5742 24.832 43.6484 24.832 43.6484 28.5659 c
43.6484 32.3076 39.1709 32.3076 39.1709 36.0469 c
39.1709 39.7026 39.7549 39.7026 39.7549 43.356 c
39.7549 47.0566 45.3896 47.0566 45.3896 50.7568 c
45.3896 54.4043 40.1055 54.4043 40.1055 58.0542 c
40.1055 61.7686 40.6289 61.7686 40.6289 65.4805 c
40.6289 69.1636 41.875 69.3184 41.875 73 C
59.0752 73 L
59.0752 69.4219 53.4805 70.1934 53.4805 66.6143 c
53.4805 62.9136 55.8945 62.9136 55.8945 59.2153 c
55.8945 55.502 61.0059 55.502 61.0059 51.7886 c
61.0059 48.1489 60.5635 48.1489 60.5635 44.5103 c
60.5635 40.897 59.9277 40.897 59.9277 37.2842 c
59.9277 33.5508 56.3662 33.5508 56.3662 29.8169 c
56.3662 26.0762 61.0908 26.0762 61.0908 22.3354 c
61.0908 18.6812 52.6025 18.6812 52.6025 15.0264 c
52.6025 11.3262 55.7461 11.3262 55.7461 7.6265 c
55.7461 3.978 59.0752 4.6484 59.0752 1 C
41.875 1 L
f
%AI6_EndPatternLayer
) &
] E
%AI3_EndPattern
%AI3_BeginPattern: (\203W\203\203\203\223\203O\203\213\203X\203g\203\211\203C\203v)
(\203W\203\203\203\223\203O\203\213\203X\203g\203\211\203C\203v) 37 19 73 55 [
%AI3_Tile
(0 O 0 R 0.898 0.098 0.9137 0.0157 k
 0.898 0.098 0.9137 0.0157 K
) @
(
%AI6_BeginPatternLayer
0 J 0 j 18 w 4 M []0 d37 37 m
73 37 l
S
%AI6_EndPatternLayer
) &
(0 O 0 R 0.3451 0.0196 0.6902 0 k
 0.3451 0.0196 0.6902 0 K
) @
(
%AI6_BeginPatternLayer
0 J 0 j 9 w 4 M []0 d37 37 m
73 37 l
S
%AI6_EndPatternLayer
) &
] E
%AI3_EndPattern
%AI3_BeginPattern: (\203n\203j\203J\203\200)
(\203n\203j\203J\203\200) 12.9819 14.6548 65.8066 60.6758 [
%AI3_Tile
(0 O 0 R 0.3686 0.9255 0.8863 0.349 k
 0.3686 0.9255 0.8863 0.349 K
) @
(
%AI6_BeginPatternLayer
0 J 0 j 2 w 4 M []0 d52.3345 28.1372 m
40.6475 21.3906 L
40.6475 7.9009 L
52.3345 1.1543 L
64.0161 7.9009 L
64.0161 21.3906 L
52.3345 28.1372 L
s
%AI6_EndPatternLayer
) &
(0 O 0 R 0.0353 0.6941 0.8941 0.0039 k
 0.0353 0.6941 0.8941 0.0039 K
) @
(
%AI6_BeginPatternLayer
0 J 0 j 0.5 w 4 M []0 d43.9536 19.4839 m
43.9536 9.8081 L
52.3345 4.9702 L
60.7153 9.8081 L
60.7153 19.4839 L
52.3345 24.3218 L
43.9536 19.4839 L
s
%AI6_EndPatternLayer
) &
(0 O 0 R 0.3686 0.9255 0.8863 0.349 k
 0.3686 0.9255 0.8863 0.349 K
) @
(
%AI6_BeginPatternLayer
0 J 0 j 2 w 4 M []0 d25.7944 28.1406 m
14.1099 21.3911 L
14.1099 7.9014 L
25.7944 1.1548 L
37.479 7.9014 L
37.479 21.394 L
25.7944 28.1406 L
s
%AI6_EndPatternLayer
) &
(0 O 0 R 0.0353 0.6941 0.8941 0.0039 k
 0.0353 0.6941 0.8941 0.0039 K
) @
(
%AI6_BeginPatternLayer
0 J 0 j 0.5 w 4 M []0 d17.4126 19.4839 m
17.4126 9.8081 L
25.7944 4.9702 L
34.1743 9.8081 L
34.1743 19.4839 L
25.7944 24.3218 L
17.4126 19.4839 L
s
%AI6_EndPatternLayer
) &
(0 O 0 R 0.3686 0.9255 0.8863 0.349 k
 0.3686 0.9255 0.8863 0.349 K
) @
(
%AI6_BeginPatternLayer
0 J 0 j 2 w 4 M []0 d12.6846 50.7852 m
1 44.0356 L
1 30.5459 L
12.6846 23.7993 L
24.3691 30.5459 L
24.3691 44.0386 L
12.6846 50.7852 L
s
%AI6_EndPatternLayer
) &
(0 O 0 R 0.0353 0.6941 0.8941 0.0039 k
 0.0353 0.6941 0.8941 0.0039 K
) @
(
%AI6_BeginPatternLayer
0 J 0 j 0.5 w 4 M []0 d4.3027 42.1284 m
4.3027 32.4526 L
12.6846 27.6147 L
21.0645 32.4526 L
21.0645 42.1284 L
12.6846 46.9663 L
4.3027 42.1284 L
s
%AI6_EndPatternLayer
) &
(0 O 0 R 0.3686 0.9255 0.8863 0.349 k
 0.3686 0.9255 0.8863 0.349 K
) @
(
%AI6_BeginPatternLayer
0 J 0 j 2 w 4 M []0 d65.603 51.1226 m
53.9185 44.3765 L
53.9185 30.8843 L
65.603 24.1382 L
77.2871 30.8843 L
77.2871 44.3774 L
65.603 51.1226 L
s
%AI6_EndPatternLayer
) &
(0 O 0 R 0.0353 0.6941 0.8941 0.0039 k
 0.0353 0.6941 0.8941 0.0039 K
) @
(
%AI6_BeginPatternLayer
0 J 0 j 0.5 w 4 M []0 d57.2202 42.4692 m
57.2202 32.7915 L
65.603 27.9536 L
73.9819 32.7915 L
73.9819 42.4692 L
65.603 47.3081 L
57.2202 42.4692 L
s
%AI6_EndPatternLayer
) &
(0 O 0 R 0.3686 0.9255 0.8863 0.349 k
 0.3686 0.9255 0.8863 0.349 K
) @
(
%AI6_BeginPatternLayer
0 J 0 j 2 w 4 M []0 d39.0649 51.1235 m
27.3774 44.3765 L
27.3774 30.8843 L
39.0649 24.1382 L
50.7471 30.8843 L
50.7471 44.3774 L
39.0649 51.1235 L
s
%AI6_EndPatternLayer
) &
(0 O 0 R 0.0353 0.6941 0.8941 0.0039 k
 0.0353 0.6941 0.8941 0.0039 K
) @
(
%AI6_BeginPatternLayer
0 J 0 j 0.5 w 4 M []0 d30.6821 42.4692 m
30.6821 32.7915 L
39.0649 27.9517 L
47.4438 32.7915 L
47.4438 42.4702 L
39.0649 47.3091 L
30.6821 42.4692 L
s
%AI6_EndPatternLayer
) &
(0 O 0 R 0.3686 0.9255 0.8863 0.349 k
 0.3686 0.9255 0.8863 0.349 K
) @
(
%AI6_BeginPatternLayer
0 J 0 j 2 w 4 M []0 d25.7944 74.1074 m
14.1099 67.3599 L
14.1099 53.8682 L
25.7944 47.1221 L
37.479 53.8682 L
37.479 67.3599 L
25.7944 74.1074 L
s
%AI6_EndPatternLayer
) &
(0 O 0 R 0.0353 0.6941 0.8941 0.0039 k
 0.0353 0.6941 0.8941 0.0039 K
) @
(
%AI6_BeginPatternLayer
0 J 0 j 0.5 w 4 M []0 d17.4126 65.4526 m
17.4126 55.7749 L
25.7944 50.937 L
34.1743 55.7749 L
34.1772 65.4526 L
25.7944 70.2905 L
17.4126 65.4526 L
s
%AI6_EndPatternLayer
) &
(0 O 0 R 0.3686 0.9255 0.8863 0.349 k
 0.3686 0.9255 0.8863 0.349 K
) @
(
%AI6_BeginPatternLayer
0 J 0 j 2 w 4 M []0 d52.3345 74.1074 m
40.6475 67.3599 L
40.6475 53.8682 L
52.3345 47.1221 L
64.0161 53.8682 L
64.0161 67.3599 L
52.3345 74.1074 L
s
%AI6_EndPatternLayer
) &
(0 O 0 R 0.0353 0.6941 0.8941 0.0039 k
 0.0353 0.6941 0.8941 0.0039 K
) @
(
%AI6_BeginPatternLayer
0 J 0 j 0.5 w 4 M []0 d43.9536 65.4526 m
43.9536 55.7749 L
52.3345 50.937 L
60.7153 55.7749 L
60.7153 65.4526 L
52.3345 70.2905 L
43.9536 65.4526 L
s
%AI6_EndPatternLayer
) &
] E
%AI3_EndPattern
%AI3_BeginPattern: (\203s\203\211\203~\203b\203h)
(\203s\203\211\203~\203b\203h) 1 1 19.5 19.5 [
%AI3_Tile
(0 O 0 R 0.1882 0.1294 0.102 0.0118 k
 0.1882 0.1294 0.102 0.0118 K
) @
(
%AI6_BeginPatternLayer
0 J 0 j 1 w 4 M []0 d1 19.5 m
10.25 10.25 l
19.5 19.5 l
1 19.5 l
f
%AI6_EndPatternLayer
) &
(0 O 0 R 0.6235 0.4863 0.4863 0.4784 k
 0.6235 0.4863 0.4863 0.4784 K
) @
(
%AI6_BeginPatternLayer
0 J 0 j 1 w 4 M []0 d19.5 1 m
10.25 10.25 l
1 1 l
19.5 1 l
f
%AI6_EndPatternLayer
) &
(0 O 0 R 0.3451 0.2588 0.2235 0.0667 k
 0.3451 0.2588 0.2235 0.0667 K
) @
(
%AI6_BeginPatternLayer
0 J 0 j 1 w 4 M []0 d1 1 m
10.25 10.25 l
1 19.5 l
1 1 l
f
%AI6_EndPatternLayer
) &
(0 O 0 R 0.4902 0.3647 0.3451 0.2196 k
 0.4902 0.3647 0.3451 0.2196 K
) @
(
%AI6_BeginPatternLayer
0 J 0 j 1 w 4 M []0 d19.5 19.5 m
10.25 10.25 l
19.5 1 l
19.5 19.5 l
f
%AI6_EndPatternLayer
) &
] E
%AI3_EndPattern
%AI3_BeginPattern: (\222n\222\206\212C\203^\203C\203\213)
(\222n\222\206\212C\203^\203C\203\213) 4.9482 11.5332 39.291 45.8818 [
%AI3_Tile
(0 O 0 R 0 0 0 0 k
 0 0 0 0 K
) @
(
%AI6_BeginPatternLayer
0 J 0 j 0.3 w 4 M []0 d0.1499 40.748 m
10.0083 40.749 L
16.9673 33.79 L
16.9702 23.9297 L
10.0093 16.9697 L
0.1509 16.9688 L
0.1499 40.748 L
f
%AI6_EndPatternLayer
) &
(0 O 0 R 0.9412 0.9333 0.0235 0.0039 k
 0.9412 0.9333 0.0235 0.0039 K
) @
(
%AI6_BeginPatternLayer
0 J 0 j 0.3 w 4 M []0 d0.1499 40.748 m
10.0083 40.749 L
16.9673 33.79 L
16.9702 23.9297 L
10.0093 16.9697 L
0.1509 16.9688 L
0.1499 40.748 L
s
%AI6_EndPatternLayer
) &
(0 O 0 R 0 0 0 0 k
 0 0 0 0 K
) @
(
%AI6_BeginPatternLayer
0 J 0 j 0.3 w 4 M []0 d16.9712 0.1504 m
10.0122 7.1094 L
10.0093 16.9697 L
16.9702 23.9297 L
26.8296 23.9307 L
33.7915 16.9727 L
33.7915 7.1123 L
26.8335 0.1514 L
16.9712 0.1504 L
f
%AI6_EndPatternLayer
) &
(0 O 0 R 0.9412 0.9333 0.0235 0.0039 k
 0.9412 0.9333 0.0235 0.0039 K
) @
(
%AI6_BeginPatternLayer
0 J 0 j 0.3 w 4 M []0 d16.9712 0.1504 m
10.0122 7.1094 L
10.0093 16.9697 L
16.9702 23.9297 L
26.8296 23.9307 L
33.7915 16.9727 L
33.7915 7.1123 L
26.8335 0.1514 L
16.9712 0.1504 L
s
%AI6_EndPatternLayer
) &
(0 O 0 R 0 0 0 0 k
 0 0 0 0 K
) @
(
%AI6_BeginPatternLayer
0 J 0 j 0.3 w 4 M []0 d16.9673 33.79 m
10.0083 40.749 L
10.0054 50.6084 L
16.9663 57.5693 L
26.8257 57.5703 L
33.7876 50.6113 L
33.7876 40.752 L
26.8296 33.791 L
16.9673 33.79 L
f
%AI6_EndPatternLayer
) &
(0 O 0 R 0.9412 0.9333 0.0235 0.0039 k
 0.9412 0.9333 0.0235 0.0039 K
) @
(
%AI6_BeginPatternLayer
0 J 0 j 0.3 w 4 M []0 d16.9673 33.79 m
10.0083 40.749 L
10.0054 50.6084 L
16.9663 57.5693 L
26.8257 57.5703 L
33.7876 50.6113 L
33.7876 40.752 L
26.8296 33.791 L
16.9673 33.79 L
s
%AI6_EndPatternLayer
) &
(0 O 0 R 0 0 0 0 k
 0 0 0 0 K
) @
(
%AI6_BeginPatternLayer
0 J 0 j 0.3 w 4 M []0 d33.7915 16.9727 m
26.8296 23.9307 L
26.8296 33.791 L
33.7876 40.752 L
43.6475 40.7529 L
50.6094 33.7939 L
50.6094 23.9336 L
43.6494 16.9736 L
33.7915 16.9727 L
f
%AI6_EndPatternLayer
) &
(0 O 0 R 0.9412 0.9333 0.0235 0.0039 k
 0.9412 0.9333 0.0235 0.0039 K
) @
(
%AI6_BeginPatternLayer
0 J 0 j 0.3 w 4 M []0 d33.7915 16.9727 m
26.8296 23.9307 L
26.8296 33.791 L
33.7876 40.752 L
43.6475 40.7529 L
50.6094 33.7939 L
50.6094 23.9336 L
43.6494 16.9736 L
33.7915 16.9727 L
s
%AI6_EndPatternLayer
) &
(0 O 0 R 0.9373 0.8235 0.0392 0.0078 k
 0.9373 0.8235 0.0392 0.0078 K
) @
(
%AI6_BeginPatternLayer
0 J 0 j 1 w 4 M []0 d43.6514 7.1123 m
43.6514 16.9727 L
33.7915 16.9727 L
33.7915 7.1123 L
43.6514 7.1123 L
f
26.8296 23.9307 m
26.8296 33.791 L
16.9702 33.791 L
16.9702 23.9307 L
26.8296 23.9307 L
f
10.0093 7.1094 m
10.0093 16.9697 L
0.1538 16.9697 L
0.1538 7.1094 L
10.0093 7.1094 L
f
43.6494 40.752 m
43.6494 50.6113 L
33.7876 50.6113 L
33.7876 40.752 L
43.6494 40.752 L
f
10.0083 40.749 m
10.0083 50.6084 L
0.1499 50.6084 L
0.1499 40.749 L
10.0083 40.749 L
f
%AI6_EndPatternLayer
) &
] E
%AI3_EndPattern
%%EndSetup
0 A
*u
0 O
0 0 0 1 k
0 J 0 j 1 w 4 M []0 d149.0303 439.7754 m
153.0029 439.7754 L
144.1104 409.4268 L
139.5034 409.4268 L
131.2593 433.9424 L
131.1748 433.9424 L
123.9912 409.4268 L
120.0181 409.4268 L
128.9111 439.7754 L
133.7715 439.7754 L
141.7622 415.2598 L
141.8467 415.2598 L
149.0303 439.7754 l
f
*U
*u
164.1035 417.0771 m
163.2368 414.1201 159.1992 411.8789 155.7334 411.8789 c
152.9434 411.8789 152.1387 413.3154 152.8447 415.7256 c
153.6621 418.5146 156.7393 419.0654 158.6313 419.3174 c
163.4121 419.9092 164.4409 420.249 165.168 420.7119 c
164.1035 417.0771 L
f
1 D
156.1836 424.8125 m
156.9326 426.5039 158.2798 429.082 162.5068 429.082 c
166.0146 429.082 167.334 427.8145 166.6528 425.4893 c
166.0083 423.2915 164.8525 422.9531 163.9404 422.8682 C
157.5889 422.1079 l
151.1953 421.3477 149.3823 417.0352 148.8374 415.1748 c
147.7227 411.3721 149.8418 408.7939 153.8994 408.7939 c
158.21 408.7939 161.0449 410.8213 162.9404 412.3857 c
162.5718 410.6953 162.5835 409.0049 165.8799 409.0049 c
166.7256 409.0049 167.3496 409.2588 168.0327 409.4268 C
168.8252 412.1318 l
168.3779 412.0488 167.8887 411.9639 167.5498 411.9639 c
166.7891 411.9639 166.436 412.3447 166.7085 413.2734 C
170.4355 425.9961 l
172.0957 431.6602 165.8203 432.168 164.0449 432.168 c
158.5928 432.168 154.4771 430.0967 152.7603 424.8125 c
156.1836 424.8125 L
f
*U
*u
0 D
181.1719 428.4478 m
176.9609 414.0762 L
176.4531 412.3447 177.9321 412.3447 178.6934 412.3447 c
180.0034 412.3447 L
179.1484 409.4268 L
177.7593 409.3008 176.6533 409.1309 176.2725 409.1309 c
172.5957 409.1309 172.3994 411.2021 173.1797 413.8652 c
177.4521 428.4478 L
174.4517 428.4478 L
175.3555 431.5332 L
178.3564 431.5332 L
180.1646 437.7051 L
183.8838 437.7051 L
182.0762 431.5332 L
185.626 431.5332 L
184.7227 428.4478 L
181.1719 428.4478 l
f
*U
*u
186.5879 409.4268 m
182.8687 409.4268 L
189.3457 431.5332 L
193.0654 431.5332 L
186.5879 409.4268 l
f
190.5225 435.5488 m
191.7607 439.7754 L
195.4805 439.7754 L
194.2417 435.5488 L
190.5225 435.5488 l
f
*U
*u
198.835 420.501 m
199.7021 423.46 202.4111 428.9551 207.7363 428.9551 c
213.062 428.9551 212.5508 423.46 211.6836 420.501 c
210.8174 417.542 208.1079 412.0488 202.7822 412.0488 c
197.457 412.0488 197.9683 417.542 198.835 420.501 c
f
1 D
194.9888 420.501 m
193.3164 414.7959 194.7832 408.835 201.8413 408.835 c
208.8994 408.835 213.8584 414.7959 215.5303 420.501 c
217.2021 426.208 215.7363 432.168 208.6777 432.168 c
201.6191 432.168 196.6611 426.208 194.9888 420.501 c
f
*U
*u
0 D
233.6724 409.4268 m
229.9531 409.4268 L
233.9414 423.0381 L
235.0674 426.8838 234.5391 428.8286 230.9038 428.8286 c
228.79 428.8286 224.6748 427.4756 222.916 421.4736 c
219.3867 409.4268 L
215.6665 409.4268 L
222.144 431.5332 L
225.6523 431.5332 L
224.7363 428.4053 L
224.8203 428.4053 L
225.9702 429.5889 228.7969 432.168 232.6006 432.168 c
236.0244 432.168 239.9268 430.7725 238.0815 424.4751 C
233.6724 409.4268 l
f
*U
*u
254.0459 417.0771 m
253.1797 414.1201 249.1416 411.8789 245.6758 411.8789 c
242.8862 411.8789 242.0811 413.3154 242.7871 415.7256 c
243.6045 418.5146 246.6826 419.0654 248.5742 419.3174 c
253.3545 419.9092 254.3838 420.249 255.1118 420.7119 c
254.0459 417.0771 L
f
1 D
246.1265 424.8125 m
246.876 426.5039 248.2227 429.082 252.4492 429.082 c
255.958 429.082 257.2769 427.8145 256.5957 425.4893 c
255.9521 423.2915 254.7959 422.9531 253.8838 422.8682 C
247.5322 422.1079 l
241.1377 421.3477 239.3252 417.0352 238.7803 415.1748 c
237.6655 411.3721 239.7842 408.7939 243.8418 408.7939 c
248.1533 408.7939 250.9873 410.8213 252.8828 412.3857 c
252.5146 410.6953 252.5264 409.0049 255.8232 409.0049 c
256.668 409.0049 257.292 409.2588 257.9756 409.4268 C
258.7681 412.1318 l
258.3203 412.0488 257.8311 411.9639 257.4932 411.9639 c
256.7319 411.9639 256.3789 412.3447 256.6514 413.2734 C
260.3794 425.9961 l
262.0391 431.6602 255.7627 432.168 253.9873 432.168 c
248.5352 432.168 244.4199 430.0967 242.7031 424.8125 c
246.1265 424.8125 L
f
*U
*u
0 D
265.626 409.4268 m
261.9063 409.4268 L
270.7988 439.7754 L
274.5186 439.7754 L
265.626 409.4268 l
f
*U
*u
288.1528 409.4268 m
284.0542 409.4268 L
292.9458 439.7754 L
297.0459 439.7754 L
288.1528 409.4268 l
f
*U
*u
311.8652 409.4268 m
308.1445 409.4268 L
312.1338 423.0381 L
313.2598 426.8838 312.7314 428.8286 309.0977 428.8286 c
306.9834 428.8286 302.8672 427.4756 301.1094 421.4736 c
297.5791 409.4268 L
293.8599 409.4268 L
300.3379 431.5332 L
303.8457 431.5332 L
302.9287 428.4053 L
303.0137 428.4053 L
304.1641 429.5889 306.9893 432.168 310.793 432.168 c
314.2168 432.168 318.1191 430.7725 316.2754 424.4751 C
311.8652 409.4268 l
f
*U
*u
333.6992 425.2354 m
334.0664 426.6309 334.2402 428.9551 329.5479 428.9551 c
328.4063 428.9551 325.042 428.5742 324.2363 425.8271 c
323.7031 424.0098 324.7207 423.5874 327.3848 422.8682 c
330.8311 421.9395 L
335.1035 420.7969 336.2148 419.1064 335.3359 416.1064 c
333.998 411.54 329.4316 408.7939 324.4443 408.7939 c
315.6953 408.7939 316.5469 413.8652 317.2012 416.5283 c
320.793 416.5283 L
320.4121 414.7959 320.1025 412.0049 325.3418 412.0049 c
328.0059 412.0049 330.7246 413.0625 331.4434 415.5146 c
331.9629 417.29 330.9102 417.8818 327.9766 418.6846 c
323.9746 419.7412 L
321.1113 420.501 319.541 422.0654 320.4336 425.1084 c
321.8574 429.9697 326.5176 432.168 330.8711 432.168 c
338.7734 432.168 337.6152 426.335 337.293 425.2354 C
333.6992 425.2354 l
f
*U
*u
347.7871 428.4478 m
343.5752 414.0762 L
343.0664 412.3447 344.5469 412.3447 345.3086 412.3447 c
346.6172 412.3447 L
345.7637 409.4268 L
344.373 409.3008 343.2676 409.1309 342.8867 409.1309 c
339.21 409.1309 339.0137 411.2021 339.793 413.8652 c
344.0664 428.4478 L
341.0664 428.4478 L
341.9697 431.5332 L
344.9707 431.5332 L
346.7793 437.7051 L
350.498 437.7051 L
348.6904 431.5332 L
352.2412 431.5332 L
351.3359 428.4478 L
347.7871 428.4478 l
f
*U
*u
353.2021 409.4268 m
349.4824 409.4268 L
355.9609 431.5332 L
359.6797 431.5332 L
353.2021 409.4268 l
f
357.1367 435.5488 m
358.375 439.7754 L
362.0957 439.7754 L
360.8555 435.5488 L
357.1367 435.5488 l
f
*U
*u
368.918 428.4478 m
364.709 414.0762 L
364.2002 412.3447 365.6797 412.3447 366.4395 412.3447 c
367.751 412.3447 L
366.8955 409.4268 L
365.5068 409.3008 364.3994 409.1309 364.0195 409.1309 c
360.3418 409.1309 360.1455 411.2021 360.9258 413.8652 c
365.1992 428.4478 L
362.1973 428.4478 L
363.1035 431.5332 L
366.1035 431.5332 L
367.9121 437.7051 L
371.6309 437.7051 L
369.8223 431.5332 L
373.373 431.5332 L
372.4688 428.4478 L
368.918 428.4478 l
f
*U
*u
384.9434 409.4268 m
385.8848 412.6406 L
385.8262 412.7236 L
383.5059 410.1455 381.207 408.7939 377.6582 408.7939 c
374.4023 408.7939 370.9297 410.3584 372.4785 415.6406 c
377.1348 431.5332 L
380.8535 431.5332 L
376.5566 416.8662 L
375.4912 413.2324 376.9922 412.0049 379.4004 412.0049 c
384.0928 412.0049 386.7012 416.1475 387.6436 419.3613 c
391.2109 431.5332 L
394.9297 431.5332 L
388.4521 409.4268 L
384.9434 409.4268 l
f
*U
*u
403.3232 428.4478 m
399.1133 414.0762 L
398.6055 412.3447 400.084 412.3447 400.8447 412.3447 c
402.1563 412.3447 L
401.3008 409.4268 L
399.9121 409.3008 398.8057 409.1309 398.4248 409.1309 c
394.748 409.1309 394.5518 411.2021 395.3311 413.8652 c
399.6035 428.4478 L
396.6035 428.4478 L
397.5078 431.5332 L
400.5078 431.5332 L
402.3164 437.7051 L
406.0361 437.7051 L
404.2285 431.5332 L
407.7773 431.5332 L
406.874 428.4478 L
403.3232 428.4478 l
f
*U
*u
411.6055 422.2354 m
412.6094 425.6582 416.2422 428.8286 419.665 428.8286 c
424.1885 428.8286 424.6973 425.6582 423.9043 422.2354 c
411.6055 422.2354 L
f
1 D
422.0146 416.3584 m
421.4043 414.7119 418.54 412.0049 415.0313 412.0049 c
410.7637 412.0049 409.3877 414.668 410.7383 419.2764 C
426.8838 419.2764 l
429.1748 427.0947 427.5342 432.168 421.1523 432.168 c
413.8398 432.168 408.9453 426.7148 406.9385 419.8682 c
405.0684 413.4844 407.3711 408.7939 413.584 408.7939 c
417.1338 408.7939 418.8184 409.6396 420.0313 410.3145 c
423.3672 412.1748 425.2969 415.3037 425.7344 416.3584 c
422.0146 416.3584 L
f
*U
*u
0 D
443.4727 420.501 m
444.3398 423.46 447.0488 428.9551 452.375 428.9551 c
457.7012 428.9551 457.1895 423.46 456.3223 420.501 c
455.4551 417.542 452.7471 412.0488 447.4209 412.0488 c
442.0947 412.0488 442.6055 417.542 443.4727 420.501 c
f
1 D
439.6279 420.501 m
437.9551 414.7959 439.4219 408.835 446.4805 408.835 c
453.5381 408.835 458.4961 414.7959 460.1699 420.501 c
461.8408 426.208 460.375 432.168 453.3164 432.168 c
446.2578 432.168 441.2988 426.208 439.6279 420.501 c
f
*U
*u
0 D
470.4863 428.4478 m
464.9121 409.4268 L
461.1934 409.4268 L
466.7656 428.4478 L
463.7227 428.4478 L
464.627 431.5332 L
467.6709 431.5332 L
468.7852 435.3379 L
469.7637 438.6768 472.3232 440.1982 475.957 440.1982 c
476.5068 440.1982 477.0449 440.1563 477.623 440.1138 c
476.6445 436.7744 L
476.1914 436.8174 475.6133 436.8589 475.1484 436.8589 c
473.542 436.8589 472.7148 436.0562 472.1943 434.2808 c
471.3906 431.5332 L
475.1094 431.5332 L
474.2051 428.4478 L
470.4863 428.4478 l
f
*U
*u
45.4111 376.1484 m
54.1855 389.5049 L
54.2705 389.5049 L
54.8369 376.1484 l
45.4111 376.1484 L
f
1 D
55.2515 372.5146 m
55.6641 363.6797 L
60.144 363.6797 L
58.0469 394.0283 L
53.3975 394.0283 L
33.0938 363.6797 L
37.3203 363.6797 L
43.0786 372.5146 l
55.2515 372.5146 L
f
*U
*u
0 D
68.4307 374.7959 m
69.2607 377.6279 71.1538 383.0801 76.9023 383.0801 c
82.2705 383.0801 81.165 377.291 80.1128 373.6963 c
78.3906 367.8223 74.2559 366.2578 71.8887 366.2578 c
67.8311 366.2578 67.0068 369.9346 68.4307 374.7959 c
f
1 D
89.8311 394.0283 m
86.1123 394.0283 L
82.7803 382.6582 L
82.6963 382.6582 l
82.1797 383.9268 81.2202 386.4199 77.2041 386.4199 c
71.3296 386.4199 66.5781 381.6006 64.7578 375.3877 c
63.21 370.1045 63.3398 363.0469 70.8633 363.0469 c
73.0186 363.0469 75.7529 363.7217 78.2378 366.7236 C
78.3228 366.7236 L
77.4307 363.6797 L
80.939 363.6797 l
89.8311 394.0283 L
f
*U
*u
0 D
106.5635 385.7861 m
110.6211 385.7861 L
95.7324 363.6797 L
91.7588 363.6797 L
90.1641 385.7861 L
94.4746 385.7861 L
94.9473 367.7803 L
95.0313 367.7803 L
106.5635 385.7861 l
f
*U
*u
122.9536 371.3311 m
122.0864 368.3721 118.0493 366.1318 114.5835 366.1318 c
111.7939 366.1318 110.9888 367.5693 111.6948 369.9785 c
112.5122 372.7676 115.5898 373.3174 117.4814 373.5703 c
122.2622 374.1621 123.2905 374.501 124.0186 374.9648 c
122.9536 371.3311 L
f
1 D
115.0342 379.0654 m
115.7832 380.7568 117.1299 383.335 121.3569 383.335 c
124.8652 383.335 126.1846 382.0664 125.5029 379.7412 c
124.8584 377.543 123.7031 377.2061 122.791 377.1211 C
116.4395 376.3594 l
110.0454 375.5986 108.2324 371.2881 107.6875 369.4277 c
106.5732 365.625 108.6919 363.0469 112.7495 363.0469 c
117.0605 363.0469 119.895 365.0742 121.7905 366.6387 c
121.4214 364.9482 121.4331 363.2578 124.7305 363.2578 c
125.5757 363.2578 126.1997 363.5098 126.8828 363.6797 C
127.6758 366.3857 l
127.228 366.2998 126.7388 366.2168 126.4004 366.2168 c
125.6396 366.2168 125.2861 366.5967 125.5586 367.5264 C
129.2861 380.249 l
130.9458 385.9131 124.6704 386.4199 122.895 386.4199 c
117.4424 386.4199 113.3271 384.3486 111.6104 379.0654 c
115.0342 379.0654 L
f
*U
*u
0 D
148.7349 363.6797 m
145.0156 363.6797 L
149.0039 377.291 L
150.1299 381.1357 149.6016 383.0801 145.9663 383.0801 c
143.8535 383.0801 139.7373 381.7275 137.9785 375.7266 c
134.4492 363.6797 L
130.729 363.6797 L
137.2065 385.7861 L
140.7148 385.7861 L
139.7988 382.6582 L
139.8828 382.6582 L
141.0327 383.8418 143.8594 386.4199 147.6631 386.4199 c
151.0869 386.4199 154.9893 385.0254 153.144 378.7266 C
148.7349 363.6797 l
f
*U
*u
172.3481 378.3457 m
172.75 381.3047 171.6221 383.0801 168.4941 383.0801 c
163.8872 383.0801 161.1201 378.6855 159.9678 374.7539 c
158.8535 370.9502 158.4087 366.2578 163.5234 366.2578 c
166.0166 366.2578 168.7178 368.1182 170.3418 371.499 c
173.9346 371.499 L
172.5264 367.9922 168.9219 363.0469 162.4546 363.0469 c
156.2412 363.0469 153.9395 367.7373 155.8096 374.1211 c
157.8154 380.9678 162.71 386.4199 170.022 386.4199 c
175.8125 386.4199 176.772 382.1924 175.9404 378.3457 C
172.3481 378.3457 l
f
*U
*u
182.0322 376.4873 m
183.0352 379.9102 186.6689 383.0801 190.0928 383.0801 c
194.6152 383.0801 195.1235 379.9102 194.332 376.4873 c
182.0322 376.4873 L
f
1 D
192.4404 370.6113 m
191.8311 368.9639 188.9678 366.2578 185.459 366.2578 c
181.1904 366.2578 179.8154 368.9209 181.165 373.5293 C
197.3105 373.5293 l
199.6025 381.3486 197.9609 386.4199 191.5786 386.4199 c
184.2661 386.4199 179.3721 380.9678 177.3652 374.1211 c
175.4951 367.7373 177.7974 363.0469 184.0112 363.0469 c
187.5615 363.0469 189.2461 363.8906 190.459 364.5674 c
193.7935 366.4277 195.7241 369.5557 196.1606 370.6113 c
192.4404 370.6113 L
f
*U
*u
0 D
204.6982 374.7959 m
205.5283 377.6279 207.4224 383.0801 213.1704 383.0801 c
218.5381 383.0801 217.4331 377.291 216.3809 373.6963 c
214.6587 367.8223 210.5234 366.2578 208.1563 366.2578 c
204.0996 366.2578 203.2744 369.9346 204.6982 374.7959 c
f
1 D
226.0991 394.0283 m
222.3799 394.0283 L
219.0479 382.6582 L
218.9639 382.6582 l
218.4473 383.9268 217.4883 386.4199 213.4727 386.4199 c
207.5977 386.4199 202.8462 381.6006 201.0264 375.3877 c
199.4775 370.1045 199.6074 363.0469 207.1309 363.0469 c
209.2861 363.0469 212.0205 363.7217 214.5063 366.7236 C
214.5908 366.7236 L
213.6992 363.6797 L
217.207 363.6797 l
226.0991 394.0283 L
f
*U
*u
0 D
237.6216 363.6797 m
233.5225 363.6797 L
242.4146 394.0283 L
246.5146 394.0283 L
237.6216 363.6797 l
f
*U
*u
262.1787 363.6797 m
258.459 363.6797 L
262.4473 377.291 L
263.5742 381.1357 263.0454 383.0801 259.4102 383.0801 c
257.2969 383.0801 253.1812 381.7275 251.4229 375.7266 c
247.8926 363.6797 L
244.1729 363.6797 L
250.6504 385.7861 L
254.1592 385.7861 L
253.2422 382.6582 L
253.3271 382.6582 L
254.4766 383.8418 257.3032 386.4199 261.1074 386.4199 c
264.5308 386.4199 268.4331 385.0254 266.5879 378.7266 C
262.1787 363.6797 l
f
*U
*u
273.5088 374.7959 m
274.3389 377.6279 276.2324 383.0801 281.98 383.0801 c
287.3486 383.0801 286.2441 377.291 285.1909 373.6963 c
283.4697 367.8223 279.3345 366.2578 276.9668 366.2578 c
272.9092 366.2578 272.085 369.9346 273.5088 374.7959 c
f
1 D
294.9102 394.0283 m
291.1909 394.0283 L
287.8584 382.6582 L
287.7734 382.6582 l
287.2578 383.9268 286.2983 386.4199 282.2832 386.4199 c
276.4077 386.4199 271.6563 381.6006 269.8364 375.3877 c
268.2881 370.1045 268.418 363.0469 275.9414 363.0469 c
278.0967 363.0469 280.8315 363.7217 283.3159 366.7236 C
283.4009 366.7236 L
282.5088 363.6797 L
286.0171 363.6797 l
294.9102 394.0283 L
f
*U
*u
0 D
305.5879 363.6797 m
306.5273 366.8916 L
306.4678 366.9775 L
304.1484 364.3975 301.8506 363.0469 298.2998 363.0469 c
295.0449 363.0469 291.5732 364.6104 293.1216 369.8936 c
297.7783 385.7861 L
301.498 385.7861 L
297.1997 371.1182 L
296.1348 367.4834 297.6348 366.2578 300.0449 366.2578 c
304.7363 366.2578 307.3457 370.4004 308.2852 373.6123 c
311.8525 385.7861 L
315.5723 385.7861 L
309.0938 363.6797 L
305.5879 363.6797 l
f
*U
*u
331.8594 379.4883 m
332.2256 380.8828 332.4004 383.208 327.708 383.208 c
326.5664 383.208 323.2012 382.8281 322.3965 380.0801 c
321.8633 378.2627 322.8809 377.8389 325.5449 377.1211 c
328.9912 376.1904 L
333.2637 375.0498 334.375 373.3594 333.4961 370.3584 c
332.1582 365.7939 327.5908 363.0469 322.6035 363.0469 c
313.8555 363.0469 314.7061 368.1182 315.3594 370.7813 c
318.9531 370.7813 L
318.5723 369.0469 318.2617 366.2578 323.502 366.2578 c
326.166 366.2578 328.8848 367.3154 329.6016 369.7666 c
330.1221 371.542 329.0703 372.1338 326.1367 372.9375 c
322.1348 373.9922 L
319.2715 374.7539 317.7012 376.3184 318.5918 379.3604 c
320.0176 384.2227 324.6758 386.4199 329.0293 386.4199 c
336.9336 386.4199 335.7734 380.5869 335.4531 379.4883 C
331.8594 379.4883 l
f
*U
*u
345.9453 382.6992 m
341.7354 368.3291 L
341.2266 366.5967 342.707 366.5967 343.4668 366.5967 c
344.7773 366.5967 L
343.9219 363.6797 L
342.5332 363.5537 341.4258 363.3838 341.0469 363.3838 c
337.3691 363.3838 337.1719 365.4551 337.9531 368.1182 c
342.2266 382.6992 L
339.2246 382.6992 L
340.1299 385.7861 L
343.1299 385.7861 L
344.9395 391.957 L
348.6582 391.957 L
346.8496 385.7861 L
350.4004 385.7861 L
349.4961 382.6992 L
345.9453 382.6992 l
f
*U
*u
351.7842 363.6797 m
348.0645 363.6797 L
354.543 385.7861 L
358.0508 385.7861 L
356.9727 382.1084 L
357.0576 382.1084 L
359.293 384.6865 361.7441 386.4199 364.5342 386.4199 c
364.998 386.4199 365.1973 386.3779 365.4688 386.2939 c
364.3418 382.4473 L
362.9473 382.4473 L
359.4805 382.4473 356.4902 379.7412 355.5488 376.5293 C
351.7842 363.6797 l
f
*U
*u
365.4365 363.6797 m
361.7168 363.6797 L
368.1953 385.7861 L
371.9141 385.7861 L
365.4365 363.6797 l
f
369.3711 389.8008 m
370.6094 394.0283 L
374.3281 394.0283 L
373.0898 389.8008 L
369.3711 389.8008 l
f
*U
*u
386.7402 371.3311 m
385.873 368.3721 381.8359 366.1318 378.3691 366.1318 c
375.5791 366.1318 374.7754 367.5693 375.4805 369.9785 c
376.2988 372.7676 379.376 373.3174 381.2676 373.5703 c
386.0488 374.1621 387.0762 374.501 387.8047 374.9648 c
386.7402 371.3311 L
f
1 D
378.8193 379.0654 m
379.5693 380.7568 380.916 383.335 385.1426 383.335 c
388.6514 383.335 389.9697 382.0664 389.2891 379.7412 c
388.6445 377.543 387.4883 377.2061 386.5771 377.1211 C
380.2256 376.3594 l
373.832 375.5986 372.0176 371.2881 371.4727 369.4277 c
370.3584 365.625 372.4785 363.0469 376.5352 363.0469 c
380.8467 363.0469 383.6816 365.0742 385.5762 366.6387 c
385.207 364.9482 385.2188 363.2578 388.5166 363.2578 c
389.3613 363.2578 389.9863 363.5098 390.668 363.6797 C
391.4609 366.3857 l
391.0137 366.2998 390.5254 366.2168 390.1865 366.2168 c
389.4248 366.2168 389.0723 366.5967 389.3438 367.5264 C
393.0723 380.249 l
394.7324 385.9131 388.457 386.4199 386.6816 386.4199 c
381.2285 386.4199 377.1133 384.3486 375.3965 379.0654 c
378.8193 379.0654 L
f
*U
*u
0 D
398.3193 363.6797 m
394.5996 363.6797 L
403.4922 394.0283 L
407.2109 394.0283 L
398.3193 363.6797 l
f
*U
*u
439.8613 385.1514 m
441.0234 389.8428 437.5684 391.3232 434.1445 391.3232 c
431.5664 391.3232 427.002 390.6035 425.6533 385.998 c
424.8975 383.4199 426.4678 382.5732 428.1191 382.1514 c
436.2012 380.165 L
439.8594 379.2334 442.124 376.8682 440.7129 372.0498 c
438.6074 364.8633 431.3477 362.877 426.1484 362.877 c
420.5264 362.877 418.8242 364.5674 417.8311 365.7939 c
415.9336 368.1182 416.1699 370.6533 416.999 373.4854 c
420.8457 373.4854 L
419.2363 367.9922 423.2451 366.3857 427.1348 366.3857 c
430.0938 366.3857 435.3027 367.1455 436.5781 371.499 c
437.5068 374.6689 436.3242 375.6846 431.6836 376.8682 c
425.8926 378.3047 L
424.042 378.7705 419.9707 380.165 421.5195 385.4473 c
422.9063 390.1816 427.3535 394.8311 434.707 394.8311 c
445.3174 394.8311 444.5156 388.4912 443.7061 385.1514 C
439.8613 385.1514 l
f
*U
*u
461.1133 378.3457 m
461.5137 381.3047 460.3867 383.0801 457.2588 383.0801 c
452.6523 383.0801 449.8848 378.6855 448.7334 374.7539 c
447.6191 370.9502 447.1738 366.2578 452.2871 366.2578 c
454.7813 366.2578 457.4814 368.1182 459.1055 371.499 c
462.6992 371.499 L
461.291 367.9922 457.6865 363.0469 451.2188 363.0469 c
445.0068 363.0469 442.7041 367.7373 444.5732 374.1211 c
446.5801 380.9678 451.4746 386.4199 458.7871 386.4199 c
464.5771 386.4199 465.5371 382.1924 464.7061 378.3457 C
461.1133 378.3457 l
f
*U
*u
467.9316 363.6797 m
464.2129 363.6797 L
470.6895 385.7861 L
474.4092 385.7861 L
467.9316 363.6797 l
f
471.8662 389.8008 m
473.1035 394.0283 L
476.8232 394.0283 L
475.5859 389.8008 L
471.8662 389.8008 l
f
*U
*u
480.1797 376.4873 m
481.1826 379.9102 484.8164 383.0801 488.2402 383.0801 c
492.7617 383.0801 493.2705 379.9102 492.4785 376.4873 c
480.1797 376.4873 L
f
1 D
490.5879 370.6113 m
489.9785 368.9639 487.1152 366.2578 483.6074 366.2578 c
479.3369 366.2578 477.9629 368.9209 479.3125 373.5293 C
495.457 373.5293 l
497.748 381.3486 496.1074 386.4199 489.7256 386.4199 c
482.4131 386.4199 477.5195 380.9678 475.5117 374.1211 c
473.6426 367.7373 475.9443 363.0469 482.1582 363.0469 c
485.709 363.0469 487.3936 363.8906 488.6055 364.5674 c
491.9404 366.4277 493.8711 369.5557 494.3076 370.6113 c
490.5879 370.6113 L
f
*U
*u
0 D
515.0156 363.6797 m
511.2969 363.6797 L
515.2842 377.291 L
516.4121 381.1357 515.8818 383.0801 512.248 383.0801 c
510.1338 383.0801 506.0176 381.7275 504.2598 375.7266 c
500.7295 363.6797 L
497.0098 363.6797 L
503.4883 385.7861 L
506.9961 385.7861 L
506.0791 382.6582 L
506.1641 382.6582 L
507.3145 383.8418 510.1396 386.4199 513.9434 386.4199 c
517.3691 386.4199 521.2715 385.0254 519.4258 378.7266 C
515.0156 363.6797 l
f
*U
*u
538.6289 378.3457 m
539.0313 381.3047 537.9023 383.0801 534.7754 383.0801 c
530.168 383.0801 527.4014 378.6855 526.248 374.7539 c
525.1348 370.9502 524.6895 366.2578 529.8037 366.2578 c
532.2988 366.2578 534.998 368.1182 536.623 371.499 c
540.2158 371.499 L
538.8086 367.9922 535.2031 363.0469 528.7363 363.0469 c
522.5234 363.0469 520.2207 367.7373 522.0898 374.1211 c
524.0967 380.9678 528.9902 386.4199 536.3027 386.4199 c
542.0938 386.4199 543.0527 382.1924 542.2227 378.3457 C
538.6289 378.3457 l
f
*U
*u
548.3135 376.4873 m
549.3164 379.9102 552.9492 383.0801 556.375 383.0801 c
560.8965 383.0801 561.4043 379.9102 560.6123 376.4873 c
548.3135 376.4873 L
f
1 D
558.7227 370.6113 m
558.1113 368.9639 555.248 366.2578 551.7402 366.2578 c
547.4707 366.2578 546.0957 368.9209 547.4463 373.5293 C
563.5918 373.5293 l
565.8828 381.3486 564.2422 386.4199 557.8594 386.4199 c
550.5469 386.4199 545.6533 380.9678 543.6465 374.1211 c
541.7754 367.7373 544.0781 363.0469 550.293 363.0469 c
553.8418 363.0469 555.5273 363.8906 556.7393 364.5674 c
560.0742 366.4277 562.0059 369.5557 562.4414 370.6113 c
558.7227 370.6113 L
f
*U
*u
0 D
164.8359 325.582 m
163.9692 322.623 159.9316 320.3848 156.4658 320.3848 c
153.6758 320.3848 152.8711 321.8203 153.5771 324.2295 c
154.3945 327.0205 157.4717 327.5684 159.3638 327.8232 c
164.1445 328.415 165.1733 328.752 165.9004 329.2178 c
164.8359 325.582 L
f
1 D
156.916 333.3174 m
157.665 335.0088 159.0122 337.5869 163.2393 337.5869 c
166.7471 337.5869 168.0664 336.3193 167.3853 333.9932 c
166.7407 331.7959 165.585 331.459 164.6729 331.374 C
158.3213 330.6123 l
151.9277 329.8525 150.1147 325.541 149.5698 323.6807 c
148.4551 319.876 150.5742 317.2979 154.6318 317.2979 c
158.9424 317.2979 161.7773 319.3271 163.6729 320.8916 c
163.3042 319.2012 163.3159 317.5107 166.6123 317.5107 c
167.458 317.5107 168.082 317.7627 168.7651 317.9326 C
169.5576 320.6367 l
169.1104 320.5537 168.6211 320.4678 168.2822 320.4678 c
167.5215 320.4678 167.1685 320.8486 167.4409 321.7793 C
171.1689 334.501 l
172.8281 340.166 166.5527 340.6729 164.7773 340.6729 c
159.3252 340.6729 155.2095 338.6016 153.4927 333.3174 c
156.916 333.3174 L
f
*U
*u
0 D
190.6172 317.9326 m
186.8975 317.9326 L
190.8857 331.542 L
192.0122 335.3896 191.4834 337.333 187.8486 337.333 c
185.7354 337.333 181.6191 335.9795 179.8604 329.9795 c
176.3311 317.9326 L
172.6113 317.9326 L
179.0889 340.0381 L
182.5967 340.0381 L
181.6807 336.9111 L
181.7646 336.9111 L
182.915 338.0947 185.7412 340.6729 189.5454 340.6729 c
192.9688 340.6729 196.8711 339.2783 195.0264 332.9795 C
190.6172 317.9326 l
f
*U
*u
201.9473 329.0479 m
202.7773 331.8809 204.6709 337.333 210.4189 337.333 c
215.7866 337.333 214.6816 331.542 213.6289 327.9492 c
211.9077 322.0752 207.7715 320.5107 205.4053 320.5107 c
201.3477 320.5107 200.5229 324.1875 201.9473 329.0479 c
f
1 D
223.3481 348.2813 m
219.6279 348.2813 L
216.2969 336.9111 L
216.2119 336.9111 l
215.6963 338.1787 214.7363 340.6729 210.7212 340.6729 c
204.8457 340.6729 200.0952 335.8535 198.2744 329.6396 c
196.7261 324.3574 196.8555 317.2979 204.3789 317.2979 c
206.5347 317.2979 209.2686 317.9736 211.7549 320.9766 C
211.8389 320.9766 L
210.9473 317.9326 L
214.4561 317.9326 l
223.3481 348.2813 L
f
*U
*u
0 D
238.9443 348.2813 m
263.5859 348.2813 L
262.521 344.6455 L
252.25 344.6455 L
244.4229 317.9326 L
240.3228 317.9326 L
248.1504 344.6455 L
237.8794 344.6455 L
238.9443 348.2813 l
f
*U
*u
259.1641 330.7393 m
260.168 334.1631 263.8013 337.333 267.2256 337.333 c
271.7471 337.333 272.2559 334.1631 271.4639 330.7393 c
259.1641 330.7393 L
f
1 D
269.5732 324.8643 m
268.9634 323.2148 266.0996 320.5107 262.5918 320.5107 c
258.3228 320.5107 256.9473 323.1738 258.2969 327.7803 C
274.4434 327.7803 l
276.7344 335.6006 275.0928 340.6729 268.7109 340.6729 c
261.3989 340.6729 256.5039 335.2207 254.498 328.3721 c
252.6274 321.9902 254.9302 317.2979 261.1436 317.2979 c
264.6934 317.2979 266.3789 318.1436 267.5908 318.8203 c
270.9258 320.6807 272.8564 323.8066 273.293 324.8643 c
269.5732 324.8643 L
f
*U
*u
0 D
294.1147 332.5986 m
294.5161 335.5576 293.3882 337.333 290.2607 337.333 c
285.6538 337.333 282.8867 332.9365 281.7339 329.0068 c
280.6191 325.2021 280.1753 320.5107 285.2891 320.5107 c
287.7822 320.5107 290.4834 322.3711 292.1079 325.752 c
295.7012 325.752 L
294.292 322.2432 290.687 317.2979 284.2212 317.2979 c
278.0073 317.2979 275.7051 321.9902 277.5752 328.3721 c
279.582 335.2207 284.4761 340.6729 291.7886 340.6729 c
297.5791 340.6729 298.5386 336.4453 297.7065 332.5986 C
294.1147 332.5986 l
f
*U
*u
315.1348 317.9326 m
311.4141 317.9326 L
315.6504 332.3877 L
316.5293 335.3896 316.2539 337.333 312.7031 337.333 c
309.6611 337.333 306.0137 335.5576 304.377 329.9795 c
300.8486 317.9326 L
297.1294 317.9326 L
306.0215 348.2813 L
309.7402 348.2813 L
306.459 337.0791 L
306.5439 337.0791 L
308.0088 338.4736 310.5117 340.6729 314.0625 340.6729 c
317.4863 340.6729 321.3887 339.2783 319.543 332.9795 C
315.1348 317.9326 l
f
*U
*u
337.7891 317.9326 m
334.0703 317.9326 L
338.0586 331.542 L
339.1855 335.3896 338.6563 337.333 335.0205 337.333 c
332.9082 337.333 328.792 335.9795 327.0332 329.9795 c
323.5039 317.9326 L
319.7852 317.9326 L
326.2607 340.0381 L
329.7695 340.0381 L
328.8535 336.9111 L
328.9375 336.9111 L
330.0869 338.0947 332.9141 340.6729 336.7188 340.6729 c
340.1416 340.6729 344.0439 339.2783 342.1982 332.9795 C
337.7891 317.9326 l
f
*U
*u
349.1074 329.0068 m
349.9746 331.9658 352.6836 337.459 358.0078 337.459 c
363.334 337.459 362.8232 331.9658 361.9561 329.0068 c
361.0889 326.0479 358.3809 320.5537 353.0547 320.5537 c
347.7295 320.5537 348.2402 326.0479 349.1074 329.0068 c
f
1 D
345.2617 329.0068 m
343.5898 323.2998 345.0547 317.3408 352.1133 317.3408 c
359.1729 317.3408 364.1309 323.2998 365.8027 329.0068 c
367.4746 334.7119 366.0098 340.6729 358.9502 340.6729 c
351.8906 340.6729 346.9326 334.7119 345.2617 329.0068 c
f
*U
*u
0 D
370.5879 317.9326 m
366.8691 317.9326 L
375.7617 348.2813 L
379.4814 348.2813 L
370.5879 317.9326 l
f
*U
*u
381.9902 329.0068 m
382.8574 331.9658 385.5664 337.459 390.8906 337.459 c
396.2168 337.459 395.7061 331.9658 394.8389 329.0068 c
393.9717 326.0479 391.2637 320.5537 385.9385 320.5537 c
380.6123 320.5537 381.123 326.0479 381.9902 329.0068 c
f
1 D
378.1445 329.0068 m
376.4727 323.2998 377.9375 317.3408 384.9961 317.3408 c
392.0557 317.3408 397.0137 323.2998 398.6855 329.0068 c
400.3574 334.7119 398.8926 340.6729 391.833 340.6729 c
384.7734 340.6729 379.8154 334.7119 378.1445 329.0068 c
f
*U
*u
0 D
405.7139 329.0479 m
406.5449 331.8809 408.4375 337.333 414.1865 337.333 c
419.5537 337.333 418.4492 331.542 417.3965 327.9492 c
415.6748 322.0752 411.5391 320.5107 409.1719 320.5107 c
405.1152 320.5107 404.29 324.1875 405.7139 329.0479 c
f
1 D
424.4883 340.0381 m
420.9805 340.0381 L
420.0273 336.7842 l
419.4941 338.1357 418.5039 340.6729 414.4883 340.6729 c
408.6133 340.6729 403.8623 335.8535 402.041 329.6396 c
400.4932 324.3574 400.623 317.2979 408.1465 317.2979 c
411.1045 317.2979 413.4453 318.6504 415.0234 320.4258 C
414.75 319.4971 l
413.9814 316.875 412.5977 311.7188 406.1738 311.7188 c
405.2861 311.7188 401.8633 311.7188 402.2148 315.2275 C
398.4951 315.2275 l
397.4922 309.3516 402.3945 308.6338 405.0156 308.6338 c
415.2441 308.6338 417.6143 316.5791 418.5449 319.749 c
424.4883 340.0381 L
f
*U
*u
0 D
444.3105 340.0381 m
448.4111 340.0381 L
443.7148 332.8096 439.0605 325.582 434.1113 318.3545 c
427.9785 309.3936 427.4492 308.8877 422.6719 308.8877 c
422.123 308.8877 421.751 309.0557 421.207 309.2256 c
422.1992 312.6064 L
422.6133 312.4365 423.3145 312.2256 424.3281 312.2256 c
426.2715 312.2256 426.6436 312.7764 429.7559 317.3408 c
428.208 340.0381 L
432.4336 340.0381 L
433.0332 322.0313 L
433.1182 322.0313 L
444.3105 340.0381 l
f
*U
u
*u
1 O
253.1367 268.3623 m
243.4346 268.3623 L
253.502 286.7725 L
253.6514 286.7725 l
253.1367 268.3623 L
f
1 D
221.1924 252.9639 m
235.0391 252.9639 L
239.3296 260.833 L
252.9287 260.833 L
252.6826 252.9639 L
266.5347 252.9639 L
264.4502 294.2842 L
247.7471 294.2842 l
221.1924 252.9639 L
f
*U
*u
0 D
282.2056 294.2842 m
295.5649 294.2842 L
283.4961 252.9639 L
270.1426 252.9639 L
282.2056 294.2842 l
f
*U
*u
304.2246 265.585 m
303.8008 264.1201 L
302.8789 261.0059 303.3828 258.6328 308 258.6328 c
312.6855 258.6328 314.8008 261.1758 315.4844 263.5488 c
318.0928 272.4668 292.2324 267.4834 296.7441 282.9434 c
298.6602 289.5381 305.1377 295.0986 318.8955 295.0986 c
332.252 295.0986 335.5781 290.1855 333.7314 283.8193 c
333.4453 282.8291 L
320.5654 282.8291 L
321.1455 284.8008 321.248 286.2422 320.7236 287.1709 c
320.2031 288.1611 319.0742 288.6182 317.0859 288.6182 c
313.7217 288.6182 311.3242 287.1709 310.4395 284.1621 c
307.915 275.5459 333.6143 279.873 329.3486 265.292 c
326.6348 255.9199 318.3535 252.1436 306.1055 252.1436 c
296.4277 252.1436 288.0576 254.2969 290.5771 262.916 c
291.3652 265.585 L
304.2246 265.585 l
f
*U
*u
348.8887 286.415 m
336.9434 286.415 L
339.2402 294.2842 L
376.458 294.2842 L
374.1729 286.415 L
362.2383 286.415 L
352.4707 252.9639 L
339.0986 252.9639 L
348.8887 286.415 l
f
*U
U
*u
1 D
0 O
0 0.9 0.9 0 k
420.6436 567.0439 m
374.4131 594.2334 245.0278 525.2334 162.7476 462.583 C
163.6611 461.2764 L
266.8013 530.7871 354.4707 552.4497 376.8926 532.8789 c
377.4082 532.4312 377.8828 531.9658 378.3242 531.4863 C
363.1074 529.2803 345.959 525.7471 328.0156 520.9414 c
270.3398 505.4873 226.3276 482.7188 229.7119 470.0918 c
233.0967 457.4639 282.5938 459.751 340.2676 475.2051 c
349.8066 477.7607 358.9678 480.5171 367.6045 483.3916 C
361.2471 474.2803 354.4268 466.3809 350.4434 461.8867 C
420.4209 461.8867 L
438.1191 502.2788 451.2109 549.0703 420.6436 567.0439 c
f
0 D
370.377 485.501 m
376.2031 494.2197 380.2109 502.0967 382.2754 508.9268 c
383.3896 512.6118 383.9414 516.0059 383.9414 519.104 c
383.9414 523.5981 382.7627 527.4561 380.4248 530.6553 C
396.3271 532.8652 410.0234 533.5986 420.1094 532.7563 c
430.334 531.9014 436.5049 529.4194 437.4824 525.7632 c
437.5781 525.4121 437.625 525.0479 437.625 524.666 c
437.625 516.3359 415.1895 500.7881 370.377 485.501 C
f
*U
%%PageTrailer
gsave annotatepage grestore showpage
%%Trailer
Adobe_Illustrator_AI3 /terminate get exec
Adobe_pattern_AI3 /terminate get exec
Adobe_customcolor /terminate get exec
Adobe_cshow /terminate get exec
Adobe_cmykcolor /terminate get exec
Adobe_packedarray /terminate get exec
%%EOF
