digraph ext_dsl {
  graph [ orientation = "portrait", rankdir = "LR",
	  ranksep="0.5", nodesep="0.3" ];
  node [ fontname = "Helvetica", fontsize="12.0", margin="0.07", shape = "box" ];
  edge [ fontname = "Helvetica", fontsize="12.0", margin="0.06" ];
  code [ label="Compiled\ncode"  shape="folder" style="filled" fillcolor="lightblue" ];
  tool [ label =<
<table border="0" cellborder="1" cellpadding="4" cellspacing="0">
  <tr><td bgcolor = "white" port="p">Host run-time</td></tr>
  <tr><td bgcolor = "yellow">AST generator</td></tr>
  <tr><td bgcolor = "yellow">Tool</td></tr>
</table>> shape = "plaintext" ];
  code -> tool:p;
}
