digraph model {
  graph [ orientation = "portrait", rankdir = "LR",
	  sep="0.2", nodesep="0.2", ranksep="0.2" ];
  node [ fontname = "Helvetica", fontsize="14.0", margin="0.09" ];
  edge [ fontname = "Helvetica", fontsize="14.0", margin="0.08" ];
  "open" [ peripheries = "2.0" ];
  open	-> open [ label="confBl." ];
  open	-> connected [ label="bl. connect" ];
  open	-> connected [ label="non-bl. conn.\n(successful)" style = "dashed", weight = "2.0" ];
  open	-> pending [ label="non-bl. connect\n(failed)" ];
  pending	-> pending [ label="confBl.      " ];
  pending	-> connected [ label="bl. connect" ];
  pending	-> connected [ label="    finishConnect\l  (successful)" style = "dashed" ];
  pending	-> pending [ label="finishConn.     \n(failed)    " ];
  pending	-> pending [ label="connect:\lConnPendingExc.\lread:\lNotYetConnExc.        " color = "red" ];
  open	-> open [ label="finishConnect:\nNoConnectionPendingExc.\nread: NotYetConnExc." color = "red", weight="1.0" ];
  connected	-> connected [ label="confBl." ];
  connected	-> connected [ label="read" ];
  connected	-> connected [ label="connect:\nAlreadyConnExc." color = "red" ];
  closed	-> closed [ label="close" ];
  pending	-> closed [ label="close" ];
  connected	-> closed [ label="close\n\n" ];
  open	-> closed [ label="close", weight="1.0" ];
  closed	-> closed [ label="read, confBl.,\lconnect,\lfinishConn.:\lClosedChExc." color = "red", weight = "1.0" ];
}
