%!PS-Adobe-2.0 EPSF-2.0
%%Title: model.fig
%%Creator: fig2dev Version 3.2 Patchlevel 5
%%CreationDate: Thu Apr  5 12:35:36 2012
%%For: paddy@localhost.localdomain (paddy)
%%BoundingBox: 0 0 794 578
%Magnification: 1.0000
%%EndComments
/$F2psDict 200 dict def
$F2psDict begin
$F2psDict /mtrx matrix put
/col-1 {0 setgray} bind def
/col0 {0.000 0.000 0.000 srgb} bind def
/col1 {0.000 0.000 1.000 srgb} bind def
/col2 {0.000 1.000 0.000 srgb} bind def
/col3 {0.000 1.000 1.000 srgb} bind def
/col4 {1.000 0.000 0.000 srgb} bind def
/col5 {1.000 0.000 1.000 srgb} bind def
/col6 {1.000 1.000 0.000 srgb} bind def
/col7 {1.000 1.000 1.000 srgb} bind def
/col8 {0.000 0.000 0.560 srgb} bind def
/col9 {0.000 0.000 0.690 srgb} bind def
/col10 {0.000 0.000 0.820 srgb} bind def
/col11 {0.530 0.810 1.000 srgb} bind def
/col12 {0.000 0.560 0.000 srgb} bind def
/col13 {0.000 0.690 0.000 srgb} bind def
/col14 {0.000 0.820 0.000 srgb} bind def
/col15 {0.000 0.560 0.560 srgb} bind def
/col16 {0.000 0.690 0.690 srgb} bind def
/col17 {0.000 0.820 0.820 srgb} bind def
/col18 {0.560 0.000 0.000 srgb} bind def
/col19 {0.690 0.000 0.000 srgb} bind def
/col20 {0.820 0.000 0.000 srgb} bind def
/col21 {0.560 0.000 0.560 srgb} bind def
/col22 {0.690 0.000 0.690 srgb} bind def
/col23 {0.820 0.000 0.820 srgb} bind def
/col24 {0.500 0.190 0.000 srgb} bind def
/col25 {0.630 0.250 0.000 srgb} bind def
/col26 {0.750 0.380 0.000 srgb} bind def
/col27 {1.000 0.500 0.500 srgb} bind def
/col28 {1.000 0.630 0.630 srgb} bind def
/col29 {1.000 0.750 0.750 srgb} bind def
/col30 {1.000 0.880 0.880 srgb} bind def
/col31 {1.000 0.840 0.000 srgb} bind def

end
save
newpath 0 578 moveto 0 0 lineto 794 0 lineto 794 578 lineto closepath clip newpath
-35.3 648.7 translate
1 -1 scale

/cp {closepath} bind def
/ef {eofill} bind def
/gr {grestore} bind def
/gs {gsave} bind def
/sa {save} bind def
/rs {restore} bind def
/l {lineto} bind def
/m {moveto} bind def
/rm {rmoveto} bind def
/n {newpath} bind def
/s {stroke} bind def
/sh {show} bind def
/slc {setlinecap} bind def
/slj {setlinejoin} bind def
/slw {setlinewidth} bind def
/srgb {setrgbcolor} bind def
/rot {rotate} bind def
/sc {scale} bind def
/sd {setdash} bind def
/ff {findfont} bind def
/sf {setfont} bind def
/scf {scalefont} bind def
/sw {stringwidth} bind def
/tr {translate} bind def
/tnt {dup dup currentrgbcolor
  4 -2 roll dup 1 exch sub 3 -1 roll mul add
  4 -2 roll dup 1 exch sub 3 -1 roll mul add
  4 -2 roll dup 1 exch sub 3 -1 roll mul add srgb}
  bind def
/shd {dup dup currentrgbcolor 4 -2 roll mul 4 -2 roll mul
  4 -2 roll mul srgb} bind def
/reencdict 12 dict def /ReEncode { reencdict begin
/newcodesandnames exch def /newfontname exch def /basefontname exch def
/basefontdict basefontname findfont def /newfont basefontdict maxlength dict def
basefontdict { exch dup /FID ne { dup /Encoding eq
{ exch dup length array copy newfont 3 1 roll put }
{ exch newfont 3 1 roll put } ifelse } { pop pop } ifelse } forall
newfont /FontName newfontname put newcodesandnames aload pop
128 1 255 { newfont /Encoding get exch /.notdef put } for
newcodesandnames length 2 idiv { newfont /Encoding get 3 1 roll put } repeat
newfontname newfont definefont pop end } def
/isovec [
8#055 /minus 8#200 /grave 8#201 /acute 8#202 /circumflex 8#203 /tilde
8#204 /macron 8#205 /breve 8#206 /dotaccent 8#207 /dieresis
8#210 /ring 8#211 /cedilla 8#212 /hungarumlaut 8#213 /ogonek 8#214 /caron
8#220 /dotlessi 8#230 /oe 8#231 /OE
8#240 /space 8#241 /exclamdown 8#242 /cent 8#243 /sterling
8#244 /currency 8#245 /yen 8#246 /brokenbar 8#247 /section 8#250 /dieresis
8#251 /copyright 8#252 /ordfeminine 8#253 /guillemotleft 8#254 /logicalnot
8#255 /hyphen 8#256 /registered 8#257 /macron 8#260 /degree 8#261 /plusminus
8#262 /twosuperior 8#263 /threesuperior 8#264 /acute 8#265 /mu 8#266 /paragraph
8#267 /periodcentered 8#270 /cedilla 8#271 /onesuperior 8#272 /ordmasculine
8#273 /guillemotright 8#274 /onequarter 8#275 /onehalf
8#276 /threequarters 8#277 /questiondown 8#300 /Agrave 8#301 /Aacute
8#302 /Acircumflex 8#303 /Atilde 8#304 /Adieresis 8#305 /Aring
8#306 /AE 8#307 /Ccedilla 8#310 /Egrave 8#311 /Eacute
8#312 /Ecircumflex 8#313 /Edieresis 8#314 /Igrave 8#315 /Iacute
8#316 /Icircumflex 8#317 /Idieresis 8#320 /Eth 8#321 /Ntilde 8#322 /Ograve
8#323 /Oacute 8#324 /Ocircumflex 8#325 /Otilde 8#326 /Odieresis 8#327 /multiply
8#330 /Oslash 8#331 /Ugrave 8#332 /Uacute 8#333 /Ucircumflex
8#334 /Udieresis 8#335 /Yacute 8#336 /Thorn 8#337 /germandbls 8#340 /agrave
8#341 /aacute 8#342 /acircumflex 8#343 /atilde 8#344 /adieresis 8#345 /aring
8#346 /ae 8#347 /ccedilla 8#350 /egrave 8#351 /eacute
8#352 /ecircumflex 8#353 /edieresis 8#354 /igrave 8#355 /iacute
8#356 /icircumflex 8#357 /idieresis 8#360 /eth 8#361 /ntilde 8#362 /ograve
8#363 /oacute 8#364 /ocircumflex 8#365 /otilde 8#366 /odieresis 8#367 /divide
8#370 /oslash 8#371 /ugrave 8#372 /uacute 8#373 /ucircumflex
8#374 /udieresis 8#375 /yacute 8#376 /thorn 8#377 /ydieresis] def
/Times-Bold /Times-Bold-iso isovec ReEncode
/Times-Roman /Times-Roman-iso isovec ReEncode
/$F2psBegin {$F2psDict begin /$F2psEnteredState save def} def
/$F2psEnd {$F2psEnteredState restore end} def

$F2psBegin
10 setmiterlimit
0 slj 0 slc
 0.06000 0.06000 sc
%
% Fig objects follow
%
% 
% here starts figure with depth 50
% Polyline
0 slj
0 slc
7.500 slw
n 705 1200 m 600 1200 600 4695 105 arcto 4 {pop} repeat
  600 4800 5295 4800 105 arcto 4 {pop} repeat
  5400 4800 5400 1305 105 arcto 4 {pop} repeat
  5400 1200 705 1200 105 arcto 4 {pop} repeat
 cp gs col0 s gr 
% Polyline
n 5505 3000 m 5400 3000 5400 4695 105 arcto 4 {pop} repeat
  5400 4800 7095 4800 105 arcto 4 {pop} repeat
  7200 4800 7200 3105 105 arcto 4 {pop} repeat
  7200 3000 5505 3000 105 arcto 4 {pop} repeat
 cp gs col0 s gr 
% Polyline
n 9105 1215 m 9000 1215 9000 4710 105 arcto 4 {pop} repeat
  9000 4815 13695 4815 105 arcto 4 {pop} repeat
  13800 4815 13800 1320 105 arcto 4 {pop} repeat
  13800 1215 9105 1215 105 arcto 4 {pop} repeat
 cp gs col0 s gr 
% Polyline
n 9105 3000 m 9000 3000 9000 4695 105 arcto 4 {pop} repeat
  9000 4800 11295 4800 105 arcto 4 {pop} repeat
  11400 4800 11400 3105 105 arcto 4 {pop} repeat
  11400 3000 9105 3000 105 arcto 4 {pop} repeat
 cp gs col0 s gr 
% Polyline
n 11505 3000 m 11400 3000 11400 4695 105 arcto 4 {pop} repeat
  11400 4800 13695 4800 105 arcto 4 {pop} repeat
  13800 4800 13800 3105 105 arcto 4 {pop} repeat
  13800 3000 11505 3000 105 arcto 4 {pop} repeat
 cp gs col0 s gr 
% Polyline
n 4905 7200 m 4800 7200 4800 10695 105 arcto 4 {pop} repeat
  4800 10800 9495 10800 105 arcto 4 {pop} repeat
  9600 10800 9600 7305 105 arcto 4 {pop} repeat
  9600 7200 4905 7200 105 arcto 4 {pop} repeat
 cp gs col0 s gr 
% Polyline
105.000 slw
gs  clippath
10165 5004 m 10265 4805 l 10156 4751 l 10056 4950 l 10057 4950 l 10165 4870 l 10165 5004 l cp
eoclip
n 9004 7192 m
 10204 4792 l gs col0 s gr gr

% arrowhead
75.000 slw
n 10165 5004 m 10165 4870 l 10057 4950 l 10165 5004 l  cp gs col7 1.00 shd ef gr  col0 s
% Polyline
105.000 slw
gs  clippath
4347 4958 m 4247 4759 l 4138 4813 l 4238 5012 l 4239 5012 l 4239 4878 l 4346 4958 l cp
eoclip
n 5400 7200 m
 4200 4800 l gs col0 s gr gr

% arrowhead
75.000 slw
n 4346 4958 m 4239 4878 l 4239 5012 l 4346 4958 l  cp gs col7 1.00 shd ef gr  col0 s
% Polyline
105.000 slw
gs  clippath
5607 1739 m 5385 1739 l 5385 1861 l 5607 1861 l 5607 1860 l 5487 1800 l 5607 1740 l cp
eoclip
n 9000 1800 m
 5400 1800 l gs col0 s gr gr

% arrowhead
75.000 slw
n 5607 1740 m 5487 1800 l 5607 1860 l 5607 1740 l  cp gs col7 1.00 shd ef gr  col0 s
% Polyline
105.000 slw
gs  clippath
7339 3434 m 7153 3557 l 7221 3659 l 7406 3536 l 7406 3535 l 7273 3552 l 7339 3435 l cp
eoclip
n 9000 2400 m
 7200 3600 l gs col0 s gr gr

% arrowhead
75.000 slw
n 7339 3435 m 7273 3552 l 7406 3535 l 7339 3435 l  cp gs col7 1.00 shd ef gr  col0 s
/Times-Bold-iso ff 200.00 scf sf
1800 1800 m
gs 1 -1 sc (System Model) col0 sh gr
/Times-Roman-iso ff 200.00 scf sf
1200 3225 m
gs 1 -1 sc (brake\(\)) col0 sh gr
/Times-Roman-iso ff 200.00 scf sf
1200 3675 m
gs 1 -1 sc (currentSpeed) col0 sh gr
/Times-Roman-iso ff 200.00 scf sf
1200 3900 m
gs 1 -1 sc (safeStoppingDistance) col0 sh gr
/Times-Roman-iso ff 200.00 scf sf
1200 3000 m
gs 1 -1 sc (accelerate\(\)) col0 sh gr
/Times-Bold-iso ff 200.00 scf sf
5730 3585 m
gs 1 -1 sc (Control Loop) col0 sh gr
/Times-Roman-iso ff 200.00 scf sf
5700 4170 m
gs 1 -1 sc (override\(\)) col0 sh gr
/Times-Bold-iso ff 200.00 scf sf
10200 1800 m
gs 1 -1 sc (Behaviour Model) col0 sh gr
/Times-Bold-iso ff 200.00 scf sf
9600 3600 m
gs 1 -1 sc (Submodel-1) col0 sh gr
/Times-Bold-iso ff 200.00 scf sf
12000 3600 m
gs 1 -1 sc (Submodel-2) col0 sh gr
/Times-Roman-iso ff 200.00 scf sf
9600 4200 m
gs 1 -1 sc (fatigue) col0 sh gr
/Times-Roman-iso ff 200.00 scf sf
9600 4425 m
gs 1 -1 sc (hazardPerception) col0 sh gr
/Times-Roman-iso ff 200.00 scf sf
12000 4200 m
gs 1 -1 sc (reactionTime) col0 sh gr
/Times-Roman-iso ff 200.00 scf sf
1200 4200 m
gs 1 -1 sc (feedbackMode = {voice, haptic, text, mixed}) col0 sh gr
/Times-Roman-iso ff 200.00 scf sf
1200 4425 m
gs 1 -1 sc (commandMode = {joystick, text}) col0 sh gr
/Times-Bold-iso ff 200.00 scf sf
6000 7800 m
gs 1 -1 sc (Environment Model) col0 sh gr
/Times-Roman-iso ff 200.00 scf sf
5400 9000 m
gs 1 -1 sc (terrain = {offRoad, onRoad}) col0 sh gr
/Times-Roman-iso ff 200.00 scf sf
5400 9225 m
gs 1 -1 sc (curvature = [0..360]) col0 sh gr
/Times-Roman-iso ff 200.00 scf sf
5400 9600 m
gs 1 -1 sc (drivingConditions = {wet, dry}) col0 sh gr
/Times-Roman-iso ff 200.00 scf sf
5385 9885 m
gs 1 -1 sc (visibility = [0..10]) col0 sh gr
/Times-Bold-iso ff 200.00 scf sf
4050 6255 m
gs 1 -1 sc (Sensing) col0 sh gr
/Times-Bold-iso ff 200.00 scf sf
9645 6570 m
gs 1 -1 sc (Awareness) col0 sh gr
/Times-Bold-iso ff 200.00 scf sf
7500 4050 m
gs 1 -1 sc  35.0 rot (IndirectCommands) col0 sh gr
/Times-Bold-iso ff 200.00 scf sf
6300 1650 m
gs 1 -1 sc (DirectCommands) col0 sh gr
% here ends figure;
$F2psEnd
rs
showpage
%%Trailer
%EOF
