# 1	2	3	4	5	6	A
0	0	0	-0.001	0	0	0
-0.005	0.029	0.006	0.029	-0.006	0.001	0.036
0	0	0	0	0	0	0
0.113	0.754	0.373	-0.415	-0.040	-0.165	0.736
0.004	0.104	0.056	-0.069	-0.116	-0.002	0.104
0	0	0	0	0	0	0
0.4	1.0	0.4	-0.1	-0.2	0	1.0
0	0	0	0	0	0	0
0	0	0	0	0	0	0
0	0	0	0	0	0	0
0	0	0	0	0	0	0
0.016	0.059	0.042	0.04	-0.04	-0.36	0.67
0	0	0	0	0	0	0
0	0	0	0	0	0	0
-0.003	0.009	0.008	0.003	-0.008	-0.005	0.008
0	0	0	0	0	0	0
0	0	0	0	0	0	0
0	0	0	0	0	0	0
0	0	0	0	0	0	0
0	0	0	0	0	0	0
0	0	0	0	0	0	0
0	0	0	0	0	0	0
0.083	0.319	0.191	0.056	0.052	0.022	0.407
0	0	0	0	0	0	0
0.166	0.412	0.212	-0.084	0.029	0.142	0.45
