%!PS-Adobe-3.0 EPSF-3.0 
%%BoundingBox: 0 0 558 805
%%Pages: 0
%%Creator: Sun Microsystems, Inc.
%%Title: none
%%CreationDate: none
%%LanguageLevel: 2
%%EndComments
%%BeginProlog
%%BeginResource: SDRes
/b4_inc_state save def
/dict_count countdictstack def
/op_count count 1 sub def
userdict begin
0 setgray 0 setlinecap 1 setlinewidth 0 setlinejoin 10 setmiterlimit[] 0 setdash newpath
/languagelevel where {pop languagelevel 1 ne {false setstrokeadjust false setoverprint} if} if
/bdef {bind def} bind def
/c {setrgbcolor} bdef
/l {neg lineto} bdef
/rl {neg rlineto} bdef
/cl {currentlinewidth currentdash currentlinecap 2 setlinecap} bdef
/lc {setlinecap} bdef
/lw {setlinewidth} bdef
/ld {setdash} bdef
/m {neg moveto} bdef
/ct {6 2 roll neg 6 2 roll neg 6 2 roll neg curveto} bdef
/r {rotate} bdef
/t {neg translate} bdef
/s {scale} bdef
/gs {gsave} bdef
/gr {grestore} bdef
/f {findfont dup length dict begin
{1 index /FID ne {def} {pop pop} ifelse} forall /Encoding ISOLatin1Encoding def
currentdict end /NFont exch definefont pop /NFont findfont} bdef
/p {closepath} bdef
/sf {scalefont setfont} bdef
/ef {eofill}bdef
/pc {closepath stroke}bdef
/ps {stroke}bdef
/pum {matrix currentmatrix}bdef
/pom {setmatrix}bdef
/bs {/aString exch def /nXOfs exch def /nWidth exch def currentpoint nXOfs 0 rmoveto pum nWidth aString stringwidth pop div 1 scale aString show pom moveto} bdef
%%EndResource
%%EndProlog
%%BeginSetup
%%EndSetup
%%Page: 1 1
%%BeginPageSetup
%%EndPageSetup
pum
0.2834 0.28344 s 
0 -2840.1 t 
gs
-63.5 -63.5 t 
63.5 63.5 m 2032.3 63.5 l 2032.3 2903.5 l 63.5 2903.5 l 63.5 63.5 l
eoclip newpath
0.800 0.800 0.800 c 89.4 89.4 m  1840.9 89.4 l  1840.9 782.6 l 
1486.5 782.6 l  1486.5 454.6 l  89.4 454.6 l 
89.4 89.4 l  p ef
0.003 0.003 0.003 c 89.4 89.4 m  1840.9 89.4 l  1840.9 782.6 l 
1486.5 782.6 l  1486.5 454.6 l  89.4 454.6 l 
89.4 89.4 l  ps
0.800 0.800 0.800 c 92.8 477 m  1462.7 477 l  1462.7 782.6 l 
92.8 782.6 l  92.8 477 l  p ef
0.003 0.003 0.003 c 777.7 782.6 m  92.8 782.6 l  92.8 477 l 
1462.7 477 l  1462.7 782.6 l  777.7 782.6 l  ps
0.902 0.902 0.902 c 92.8 812.4 m  1837.5 812.4 l  1837.5 1319.2 l 
92.8 1319.2 l  92.8 812.4 l  p ef
0.003 0.003 0.003 c 965.1 1319.2 m  92.8 1319.2 l  92.8 812.4 l 
1837.5 812.4 l  1837.5 1319.2 l  965.1 1319.2 l 
ps
0.800 0.800 0.800 c 92.8 1352.4 m  1837.5 1352.4 l 
1837.5 1859.2 l  92.8 1859.2 l  92.8 1352.4 l 
p ef
0.003 0.003 0.003 c 965.1 1859.2 m  92.8 1859.2 l  92.8 1352.4 l 
1837.5 1352.4 l  1837.5 1859.2 l  965.1 1859.2 l 
ps
0.902 0.902 0.902 c 92.8 1892.4 m  1837.5 1892.4 l 
1837.5 2399.2 l  92.8 2399.2 l  92.8 1892.4 l 
p ef
0.003 0.003 0.003 c 965.1 2399.2 m  92.8 2399.2 l  92.8 1892.4 l 
1837.5 1892.4 l  1837.5 2399.2 l  965.1 2399.2 l 
ps
0.800 0.800 0.800 c 92.8 2437.2 m  1837.5 2437.2 l 
1837.5 2879.2 l  92.8 2879.2 l  92.8 2437.2 l 
p ef
0.003 0.003 0.003 c 965.1 2879.2 m  92.8 2879.2 l  92.8 2437.2 l 
1837.5 2437.2 l  1837.5 2879.2 l  965.1 2879.2 l 
ps
gs
pum
529.2 184.9 t 
43.1 57.4 m  43.1 46.2 44.6 44.3 57.4 43.4 ct 
57.4 40.6 l  12.7 40.6 l  12.7 43.4 l  25.4 44.3 27.3 46.2 27.3 57.4 ct 
27.3 129.4 l  27.3 136.2 25.4 139.59999 21.4 139.59999 ct 
19.2 139.59999 18.3 138.4 17 134.4 ct 15.5 129.09999 13 126.6 9 126.6 ct 
4.9 126.6 1.5 130 1.5 134.4 ct 1.5 140.9 7.7 145.5 16.69999 145.5 ct 
33.5 145.5 43.1 134.4 43.1 114.8 ct p ef
pom
pum
589.3 184.9 t 
68.5 133.09999 m  65.79999 135.3 63.9 135.9 61.7 135.9 ct 
58 135.9 57.1 133.7 57.1 126.9 ct 57.1 96.8 l 
57.1 88.7 56.1 84.1 54 80.3 ct 50.5 74.79999 43.7 72 34.7 72 ct 
20.1 72 8.59999 79.4 8.59999 89.3 ct 8.59999 92.8 11.7 95.9 15.2 95.9 ct 
18.9 95.9 22.3 92.8 22.3 89.3 ct 22.3 88.7 22 88.1 22 86.9 ct 
21.7 85.6 21.4 84.4 21.4 83.1 ct 21.4 79.1 26.3 75.7 32.5 75.7 ct 
40.3 75.7 44.3 80 44.3 88.4 ct 44.3 98 l  20.4 107.7 18 108.9 11.1 114.8 ct 
7.7 117.9 5.5 123.2 5.5 128.09999 ct 5.5 138.09999 12.4 144.9 22 144.9 ct 
28.8 144.9 35 141.5 44.6 133.4 ct 45.3 141.5 48.1 144.9 54.6 144.9 ct 
59.9 144.9 63 143 68.5 137.09999 ct p
44.3 124.1 m  44.3 129.09999 43.7 130.3 40.3 132.2 ct 
36.6 134.4 32.2 135.9 29.1 135.9 ct 23.5 135.9 19.2 130.59999 19.2 123.8 ct 
19.2 123.2 l  19.2 114.2 25.7 108.6 44.3 101.8 ct 
p ef
pom
pum
657.9 184.9 t 
73.79999 73.5 m  52.4 73.5 l  52.4 75.7 l  57.4 76.29999 59.5 77.9 59.5 80.7 ct 
59.5 82.2 59.2 83.8 58.6 85.3 ct 43.4 125.7 l 
27.6 85.9 l  26.6 83.8 26 81.6 26 80 ct 26 77.2 27.9 76.29999 33.2 75.7 ct 
33.2 73.5 l  2.7 73.5 l  2.7 75.7 l  8.59999 76 9.9 77.6 17 93.7 ct 
35.6 138.09999 l  36 139 36.3 140.3 36.89999 141.5 ct 
37.8 144.3 38.8 145.5 39.7 145.5 ct 40.6 145.5 41.5 143.4 44 137.8 ct 
63.9 87.8 l  68.2 77.2 69.2 76.29999 73.79999 75.7 ct 
p ef
pom
pum
734.9 184.9 t 
68.5 133.09999 m  65.79999 135.3 63.9 135.9 61.7 135.9 ct 
58 135.9 57.1 133.7 57.1 126.9 ct 57.1 96.8 l 
57.1 88.7 56.1 84.1 54 80.3 ct 50.5 74.79999 43.7 72 34.7 72 ct 
20.1 72 8.59999 79.4 8.59999 89.3 ct 8.59999 92.8 11.7 95.9 15.2 95.9 ct 
18.9 95.9 22.3 92.8 22.3 89.3 ct 22.3 88.7 22 88.1 22 86.9 ct 
21.7 85.6 21.4 84.4 21.4 83.1 ct 21.4 79.1 26.3 75.7 32.5 75.7 ct 
40.3 75.7 44.3 80 44.3 88.4 ct 44.3 98 l  20.4 107.7 18 108.9 11.1 114.8 ct 
7.7 117.9 5.5 123.2 5.5 128.09999 ct 5.5 138.09999 12.4 144.9 22 144.9 ct 
28.8 144.9 35 141.5 44.6 133.4 ct 45.3 141.5 48.1 144.9 54.6 144.9 ct 
59.9 144.9 63 143 68.5 137.09999 ct p
44.3 124.1 m  44.3 129.09999 43.7 130.3 40.3 132.2 ct 
36.6 134.4 32.2 135.9 29.1 135.9 ct 23.5 135.9 19.2 130.59999 19.2 123.8 ct 
19.2 123.2 l  19.2 114.2 25.7 108.6 44.3 101.8 ct 
p ef
pom
pum
804.4 184.9 t 
pom
pum
842.5 184.9 t 
31.3 98 m  35.3 98.3 37.8 98.7 41.9 98.7 ct 
54 98.7 62.3 97.1 69.2 93.4 ct 78.5 88.4 84.1 78.8 84.1 68.5 ct 
84.1 62 81.9 56.1 77.6 51.8 ct 71.29999 45 58 40.6 43.4 40.6 ct 
2.4 40.6 l  2.4 43.4 l  13.9 44.6 15.5 46.2 15.5 57.4 ct 
15.5 124.7 l  15.5 137.8 14.2 139.3 2.4 140.3 ct 
2.4 143.4 l  45.9 143.4 l  45.9 140.3 l 
33.5 139.9 31.3 137.8 31.3 126.3 ct p
31.3 51.5 m  31.3 47.4 32.2 46.2 36.6 46.2 ct 
57.4 46.2 67 53.6 67 69.5 ct 67 84.7 58 92.4 40 92.4 ct 
36.89999 92.4 34.7 92.1 31.3 91.8 ct p ef
pom
pum
928.8 184.9 t 
0.9 82.8 m  3.1 82.2 4.6 82.2 6.5 82.2 ct 
10.2 82.2 11.7 84.7 11.7 91.5 ct 11.7 130.3 l 
11.7 138.09999 10.5 139 0.6 140.9 ct 0.6 143.4 l 
37.8 143.4 l  37.8 140.9 l  27.3 140.59999 24.8 138.09999 24.8 129.4 ct 
24.8 94.3 l  24.8 89.3 31.3 81.6 35.6 81.6 ct 
36.6 81.6 37.8 82.5 39.7 84.1 ct 42.2 86.2 43.7 87.2 45.9 87.2 ct 
49.6 87.2 51.8 84.4 51.8 80 ct 51.8 75.1 48.7 72 43.4 72 ct 
36.89999 72 32.2 75.4 24.8 86.6 ct 24.8 72.29999 l 
23.9 72 l  15.8 75.4 10.2 77.2 0.9 80.3 ct 
p ef
pom
pum
980.5 184.9 t 
38.8 72 m  18.6 72 4.29999 86.9 4.29999 108.3 ct 4.29999 129.09999 18.9 144.9 38.4 144.9 ct 
58 144.9 72.9 128.5 72.9 107 ct 72.9 86.6 l 
58.6 72 l  p
36.6 76.29999 m  49.6 76.29999 58.9 91.2 58.9 112.3 ct 
58.9 130 51.8 140.59999 40.3 140.59999 ct 34.1 140.59999 28.5 136.8 25.1 130.59999 ct 
20.7 122.6 18.3 111.7 18.3 100.5 ct 18.3 85.9 l 
25.7 76.29999 l  p ef
pom
pum
1058.4 184.9 t 
72.9 83.1 m  72.9 76.9 l  60.8 76.9 l  57.7 76.9 55.5 76.6 52.4 75.4 ct 
49 74.1 l  44.6 72.6 40.6 72 36.6 72 ct 22 72 10.5 83.1 10.5 97.1 ct 
10.5 107 14.8 112.9 25.1 117.9 ct 22 120.7 19.2 123.5 18.3 124.1 ct 
13.3 128.8 11.1 131.9 11.1 135 ct 11.1 138.09999 13 139.9 19.5 143 ct 
8.3 151.09999 4.29999 156.4 4.29999 162 ct 4.29999 170.4 16.4 177.2 31 177.2 ct 
42.8 177.2 54.9 173.2 63 166.6 ct 68.9 161.7 71.29999 156.7 71.29999 150.8 ct 
71.29999 141.2 64.2 134.7 52.7 134.4 ct 32.5 133.4 l 
24.5 133.09999 20.4 131.59999 20.4 129.09999 ct 20.4 126 25.7 120.7 29.7 119.5 ct 
31.3 119.5 32.2 119.8 32.89999 119.8 ct 35.6 120.1 37.8 120.1 38.8 120.1 ct 
44.3 120.1 50.5 117.9 55.5 113.6 ct 60.5 109.2 63 103.9 63 96.2 ct 
63 91.5 62 88.1 59.9 83.1 ct p
22.6 143.7 m  27.9 144.59999 40.3 145.5 47.8 145.5 ct 
62 145.5 67 147.7 67 153.3 ct 67 162.3 55.2 168.2 37.8 168.2 ct 
24.2 168.2 15.2 163.8 15.2 157 ct 15.2 153.3 l 
16.1 151.4 l  p
23.5 90.9 m  23.5 81.6 27.9 76.29999 35 76.29999 ct 
39.7 76.29999 43.7 78.8 46.2 83.4 ct 49 89 50.9 96.2 50.9 102.1 ct 
50.9 110.8 46.5 116.4 39.4 116.4 ct 30.1 116.4 23.5 106.1 23.5 91.2 ct 
p ef
pom
pum
1135.4 184.9 t 
0.9 82.8 m  3.1 82.2 4.6 82.2 6.5 82.2 ct 
10.2 82.2 11.7 84.7 11.7 91.5 ct 11.7 130.3 l 
11.7 138.09999 10.5 139 0.6 140.9 ct 0.6 143.4 l 
37.8 143.4 l  37.8 140.9 l  27.3 140.59999 24.8 138.09999 24.8 129.4 ct 
24.8 94.3 l  24.8 89.3 31.3 81.6 35.6 81.6 ct 
36.6 81.6 37.8 82.5 39.7 84.1 ct 42.2 86.2 43.7 87.2 45.9 87.2 ct 
49.6 87.2 51.8 84.4 51.8 80 ct 51.8 75.1 48.7 72 43.4 72 ct 
36.89999 72 32.2 75.4 24.8 86.6 ct 24.8 72.29999 l 
23.9 72 l  15.8 75.4 10.2 77.2 0.9 80.3 ct 
p ef
pom
pum
1187.1 184.9 t 
68.5 133.09999 m  65.79999 135.3 63.9 135.9 61.7 135.9 ct 
58 135.9 57.1 133.7 57.1 126.9 ct 57.1 96.8 l 
57.1 88.7 56.1 84.1 54 80.3 ct 50.5 74.79999 43.7 72 34.7 72 ct 
20.1 72 8.59999 79.4 8.59999 89.3 ct 8.59999 92.8 11.7 95.9 15.2 95.9 ct 
18.9 95.9 22.3 92.8 22.3 89.3 ct 22.3 88.7 22 88.1 22 86.9 ct 
21.7 85.6 21.4 84.4 21.4 83.1 ct 21.4 79.1 26.3 75.7 32.5 75.7 ct 
40.3 75.7 44.3 80 44.3 88.4 ct 44.3 98 l  20.4 107.7 18 108.9 11.1 114.8 ct 
7.7 117.9 5.5 123.2 5.5 128.09999 ct 5.5 138.09999 12.4 144.9 22 144.9 ct 
28.8 144.9 35 141.5 44.6 133.4 ct 45.3 141.5 48.1 144.9 54.6 144.9 ct 
59.9 144.9 63 143 68.5 137.09999 ct p
44.3 124.1 m  44.3 129.09999 43.7 130.3 40.3 132.2 ct 
36.6 134.4 32.2 135.9 29.1 135.9 ct 23.5 135.9 19.2 130.59999 19.2 123.8 ct 
19.2 123.2 l  19.2 114.2 25.7 108.6 44.3 101.8 ct 
p ef
pom
pum
1255.6 184.9 t 
2.7 81.6 m  4.9 81 6.2 81 7.7 81 ct 11.7 81 13.3 83.4 13.3 90.9 ct 
13.3 130 l  13.3 138.4 11.1 140.9 2.4 140.9 ct 
2.4 143.4 l  36.89999 143.4 l  36.89999 140.9 l 
28.5 140.59999 26.3 139 26.3 132.8 ct 26.3 89 l 
26.3 88.7 27.6 87.2 28.5 86.2 ct 32.5 82.5 39.1 80 44.6 80 ct 
51.5 80 54.9 85.3 54.9 96.2 ct 54.9 130 l  54.9 138.7 53 140.3 44.3 140.9 ct 
44.3 143.4 l  79.1 143.4 l  79.1 140.9 l 
70.1 140.9 67.9 138.09999 67.9 128.5 ct 67.9 89.3 l 
72.6 82.8 77.6 80 84.7 80 ct 93.7 80 96.5 84.1 96.5 97.1 ct 
96.5 129.7 l  96.5 138.7 95.2 139.9 86.2 140.9 ct 
86.2 143.4 l  120.1 143.4 l  120.1 140.9 l 
116 140.59999 l  111.4 140.3 109.5 137.5 109.5 131.59999 ct 
109.5 99.6 l  109.5 81.3 103.3 72 91.5 72 ct 
82.5 72 74.4 76 66.1 85 ct 63.3 76 58 72 49.6 72 ct 
42.8 72 38.4 74.1 25.7 83.8 ct 25.7 72.29999 l 
24.5 72 l  16.69999 74.79999 11.4 76.6 2.7 78.8 ct 
p ef
pom
gr
gs
pum
531.8 542.1 t 
43.1 57.4 m  43.1 46.2 44.6 44.3 57.4 43.4 ct 
57.4 40.6 l  12.7 40.6 l  12.7 43.4 l  25.4 44.3 27.3 46.2 27.3 57.4 ct 
27.3 129.4 l  27.3 136.2 25.4 139.59999 21.4 139.59999 ct 
19.2 139.59999 18.3 138.4 17 134.4 ct 15.5 129.09999 13 126.6 9 126.6 ct 
4.9 126.6 1.5 130 1.5 134.4 ct 1.5 140.9 7.7 145.5 16.69999 145.5 ct 
33.5 145.5 43.1 134.4 43.1 114.8 ct p ef
pom
pum
591.89999 542.1 t 
74.1 107.3 m  74.1 71.29999 l  70.7 71.29999 l  68.9 83.8 66.1 86.2 53.6 86.2 ct 
31 86.2 l  31 51.8 l  31 47.4 31.9 46.5 36 46.5 ct 
57.1 46.5 l  74.79999 46.5 78.2 48.7 80.7 62.7 ct 
84.7 62.7 l  84.1 40.6 l  1.8 40.6 l  1.8 43.4 l 
13.3 44.3 15.2 46.5 15.2 57.4 ct 15.2 124.7 l 
15.2 137.5 13.6 139.59999 1.8 140.3 ct 1.8 143.4 l 
45.3 143.4 l  45.3 140.3 l  33.2 139.59999 31 137.5 31 126.3 ct 
31 92.4 l  53.6 92.4 l  66.1 92.4 68.9 94.9 70.7 107.3 ct 
p ef
pom
pum
677.4 542.1 t 
96.2 73.5 m  94.6 38.4 l  91.5 38.4 l  90.6 41.5 88.1 43.4 85 43.4 ct 
83.4 43.4 81.3 43.1 78.8 42.2 ct 71.29999 39.7 63.6 38.4 56.1 38.4 ct 
43.4 38.4 30.7 43.1 21.1 51.8 ct 10.2 61.4 4.29999 75.7 4.29999 92.8 ct 
4.29999 107.3 9 120.7 16.69999 129.4 ct 26 139.59999 40.3 145.5 55.8 145.5 ct 
73.2 145.5 88.7 138.4 98 125.7 ct 95.2 122.9 l 
83.8 134 73.5 138.7 60.8 138.7 ct 50.9 138.7 42.2 135.59999 35.6 129.7 ct 
27 121.9 22.3 108 22.3 90.9 ct 22.3 62.7 36.6 44.6 59.2 44.6 ct 
67.9 44.6 76 47.8 82.2 54 ct 87.2 58.9 89.7 63.3 92.4 73.5 ct 
p ef
pom
gr
gs
pum
521.2 997.2 t 
108 40.6 m  76.29999 40.6 l  76.29999 43.4 l  84.7 44 87.5 45.6 87.5 49.9 ct 
87.5 52.4 86.6 56.8 84.7 61.4 ct 61.7 118.2 l 
38.4 65.79999 l  33.2 54.6 31.9 50.9 31.9 48.7 ct 
31.9 45.6 34.1 44 39.1 43.7 ct 39.7 43.7 41.5 43.7 43.7 43.4 ct 
43.7 40.6 l  2.4 40.6 l  2.4 43.4 l  9.9 43.7 12.1 45.9 18.9 59.9 ct 
57.1 144.9 l  59.2 144.9 l  93.7 58 l  99 45.6 100.5 44 108 43.4 ct 
p ef
pom
pum
633 997.2 t 
27 72 m  3.1 80.3 l  3.1 82.8 l  4.29999 82.5 l 
6.2 82.2 8 82.2 9.6 82.2 ct 13.3 82.2 14.5 84.7 14.5 91.5 ct 
14.5 127.5 l  14.5 138.7 13 140.3 2.4 140.9 ct 
2.4 143.4 l  39.1 143.4 l  39.1 140.9 l 
28.8 140.3 27.6 138.7 27.6 127.5 ct 27.6 72.29999 l 
p
19.8 37.2 m  15.5 37.2 12.1 40.9 12.1 45.3 ct 
12.1 49.6 15.5 53 19.8 53 ct 24.2 53 27.9 49.6 27.9 45.3 ct 
27.9 40.9 l  24.2 37.2 l  p ef
pom
pum
676.1 997.2 t 
0.9 82.8 m  3.1 82.2 4.6 82.2 6.5 82.2 ct 
10.2 82.2 11.7 84.7 11.7 91.5 ct 11.7 130.3 l 
11.7 138.09999 10.5 139 0.6 140.9 ct 0.6 143.4 l 
37.8 143.4 l  37.8 140.9 l  27.3 140.59999 24.8 138.09999 24.8 129.4 ct 
24.8 94.3 l  24.8 89.3 31.3 81.6 35.6 81.6 ct 
36.6 81.6 37.8 82.5 39.7 84.1 ct 42.2 86.2 43.7 87.2 45.9 87.2 ct 
49.6 87.2 51.8 84.4 51.8 80 ct 51.8 75.1 48.7 72 43.4 72 ct 
36.89999 72 32.2 75.4 24.8 86.6 ct 24.8 72.29999 l 
23.9 72 l  15.8 75.4 10.2 77.2 0.9 80.3 ct 
p ef
pom
pum
726.9 997.2 t 
39.4 73.5 m  23.9 73.5 l  23.9 55.5 l  23.9 54 23.5 53.3 22.6 53.3 ct 
21.7 54.9 20.7 56.1 19.5 57.7 ct 13.6 66.4 7.1 73.79999 4.6 74.4 ct 
2.7 75.4 1.8 76.6 1.8 77.2 ct 1.8 77.9 2.1 78.2 2.4 78.5 ct 
10.8 78.5 l  10.8 125 l  10.8 138.09999 15.5 144.9 24.5 144.9 ct 
32.2 144.9 38.1 141.2 43.1 133.09999 ct 41.2 131.2 l 
37.8 135.3 35.3 136.8 31.9 136.8 ct 26 136.8 23.9 132.5 23.9 122.9 ct 
23.9 78.5 l  39.4 78.5 l  p ef
pom
pum
770.1 997.2 t 
74.1 135.59999 m  73.5 135.59999 l  66.4 135.59999 64.5 133.7 64.5 126.6 ct 
64.5 73.5 l  40 73.5 l  40 76 l  49.6 76.6 51.5 78.2 51.5 85.9 ct 
51.5 122.2 l  51.5 126.6 50.9 128.8 48.7 130.59999 ct 
44.3 134 39.7 135.9 35 135.9 ct 28.8 135.9 23.9 130.59999 23.9 124.1 ct 
23.9 73.5 l  1.2 73.5 l  1.2 75.7 l  8.59999 76 10.8 78.5 10.8 85.6 ct 
10.8 124.7 l  10.8 136.8 18.3 144.9 29.7 144.9 ct 
35.3 144.9 41.5 142.4 45.6 138.09999 ct 52.4 131.59999 l 
52.4 144.3 l  53 144.59999 l  60.8 141.5 66.4 139.9 74.1 137.8 ct 
p ef
pom
pum
848 997.2 t 
68.5 133.09999 m  65.79999 135.3 63.9 135.9 61.7 135.9 ct 
58 135.9 57.1 133.7 57.1 126.9 ct 57.1 96.8 l 
57.1 88.7 56.1 84.1 54 80.3 ct 50.5 74.79999 43.7 72 34.7 72 ct 
20.1 72 8.59999 79.4 8.59999 89.3 ct 8.59999 92.8 11.7 95.9 15.2 95.9 ct 
18.9 95.9 22.3 92.8 22.3 89.3 ct 22.3 88.7 22 88.1 22 86.9 ct 
21.7 85.6 21.4 84.4 21.4 83.1 ct 21.4 79.1 26.3 75.7 32.5 75.7 ct 
40.3 75.7 44.3 80 44.3 88.4 ct 44.3 98 l  20.4 107.7 18 108.9 11.1 114.8 ct 
7.7 117.9 5.5 123.2 5.5 128.09999 ct 5.5 138.09999 12.4 144.9 22 144.9 ct 
28.8 144.9 35 141.5 44.6 133.4 ct 45.3 141.5 48.1 144.9 54.6 144.9 ct 
59.9 144.9 63 143 68.5 137.09999 ct p
44.3 124.1 m  44.3 129.09999 43.7 130.3 40.3 132.2 ct 
36.6 134.4 32.2 135.9 29.1 135.9 ct 23.5 135.9 19.2 130.59999 19.2 123.8 ct 
19.2 123.2 l  19.2 114.2 25.7 108.6 44.3 101.8 ct 
p ef
pom
pum
916.6 997.2 t 
2.7 46.5 m  3.7 46.5 l  5.5 46.5 7.4 46.2 8.59999 46.2 ct 
13.6 46.2 15.2 48.4 15.2 55.8 ct 15.2 129.7 l 
15.2 138.09999 13 140.3 3.1 140.9 ct 3.1 143.4 l 
39.7 143.4 l  39.7 140.9 l  30.1 140.3 28.2 138.7 28.2 130.3 ct 
28.2 37.5 l  27.6 37.2 l  19.5 40 13.6 41.5 2.7 44 ct 
p ef
pom
pum
959.8 997.2 t 
pom
pum
998.7 997.2 t 
104.6 54.3 m  104.6 124.7 l  104.6 137.5 102.7 139.59999 90.3 140.3 ct 
90.3 143.4 l  133.7 143.4 l  133.7 140.3 l 
122.6 139.59999 120.4 137.5 120.4 126.3 ct 120.4 57.4 l 
120.4 46.5 122.2 44.3 133.7 43.4 ct 133.7 40.6 l 
103 40.6 l  68.5 118.8 l  32.89999 40.6 l  2.1 40.6 l 
2.1 43.4 l  14.8 44.3 16.69999 46.2 16.69999 57.4 ct 
16.69999 120.4 l  16.69999 136.5 14.5 139.3 1.8 140.3 ct 
1.8 143.4 l  38.1 143.4 l  38.1 140.3 l 
26.3 139.59999 23.5 136.2 23.5 120.4 ct 23.5 58 l 
62.7 143.4 l  64.79999 143.4 l  p ef
pom
pum
1135.9 997.2 t 
68.5 133.09999 m  65.79999 135.3 63.9 135.9 61.7 135.9 ct 
58 135.9 57.1 133.7 57.1 126.9 ct 57.1 96.8 l 
57.1 88.7 56.1 84.1 54 80.3 ct 50.5 74.79999 43.7 72 34.7 72 ct 
20.1 72 8.59999 79.4 8.59999 89.3 ct 8.59999 92.8 11.7 95.9 15.2 95.9 ct 
18.9 95.9 22.3 92.8 22.3 89.3 ct 22.3 88.7 22 88.1 22 86.9 ct 
21.7 85.6 21.4 84.4 21.4 83.1 ct 21.4 79.1 26.3 75.7 32.5 75.7 ct 
40.3 75.7 44.3 80 44.3 88.4 ct 44.3 98 l  20.4 107.7 18 108.9 11.1 114.8 ct 
7.7 117.9 5.5 123.2 5.5 128.09999 ct 5.5 138.09999 12.4 144.9 22 144.9 ct 
28.8 144.9 35 141.5 44.6 133.4 ct 45.3 141.5 48.1 144.9 54.6 144.9 ct 
59.9 144.9 63 143 68.5 137.09999 ct p
44.3 124.1 m  44.3 129.09999 43.7 130.3 40.3 132.2 ct 
36.6 134.4 32.2 135.9 29.1 135.9 ct 23.5 135.9 19.2 130.59999 19.2 123.8 ct 
19.2 123.2 l  19.2 114.2 25.7 108.6 44.3 101.8 ct 
p ef
pom
pum
1205.29999 997.2 t 
61.7 119.1 m  54.3 130 48.7 133.7 39.7 133.7 ct 
25.7 133.7 15.8 121.3 15.8 103.3 ct 15.8 87.5 24.2 76.29999 36.89999 76.29999 ct 
42.5 76.29999 44.3 78.2 45.9 83.8 ct 46.8 87.2 l 
48.1 91.5 50.9 94.3 54.3 94.3 ct 58.3 94.3 61.7 91.5 61.7 87.8 ct 
61.7 79.1 50.9 72 37.8 72 ct 30.1 72 22.3 75.1 15.8 80.7 ct 
8 87.5 3.7 98 3.7 110.1 ct 3.7 130.3 16.1 144.9 33.2 144.9 ct 
40.3 144.9 46.5 142.4 52.1 137.5 ct 56.1 133.7 59.2 129.7 63.9 120.4 ct 
p ef
pom
pum
1273.9 997.2 t 
24.2 90 m  30.7 82.8 35.3 80.3 41.5 80.3 ct 
49.3 80.3 53 85.9 53 96.8 ct 53 127.5 l  53 138.09999 51.5 139.9 42.5 140.9 ct 
42.5 143.4 l  75.4 143.4 l  75.4 140.9 l 
67 139.3 66.1 138.09999 66.1 127.5 ct 66.1 96.5 l 
66.1 80.3 59.5 72 47.1 72 ct 37.8 72 31.3 75.7 24.2 85 ct 
24.2 37.8 l  23.5 37.2 l  18.3 39.1 14.2 40.3 5.5 42.8 ct 
1.5 44 l  1.5 46.5 l  2.1 46.5 2.4 46.5 3.4 46.5 ct 
9.9 46.5 11.1 47.8 11.1 54.3 ct 11.1 127.5 l 
11.1 138.4 10.2 139.59999 1.2 140.9 ct 1.2 143.4 l 
34.7 143.4 l  34.7 140.9 l  25.7 139.9 24.2 138.09999 24.2 127.5 ct 
p ef
pom
pum
1350.9 997.2 t 
27 72 m  3.1 80.3 l  3.1 82.8 l  4.29999 82.5 l 
6.2 82.2 8 82.2 9.6 82.2 ct 13.3 82.2 14.5 84.7 14.5 91.5 ct 
14.5 127.5 l  14.5 138.7 13 140.3 2.4 140.9 ct 
2.4 143.4 l  39.1 143.4 l  39.1 140.9 l 
28.8 140.3 27.6 138.7 27.6 127.5 ct 27.6 72.29999 l 
p
19.8 37.2 m  15.5 37.2 12.1 40.9 12.1 45.3 ct 
12.1 49.6 15.5 53 19.8 53 ct 24.2 53 27.9 49.6 27.9 45.3 ct 
27.9 40.9 l  24.2 37.2 l  p ef
pom
pum
1394.1 997.2 t 
2.4 81.6 m  3.4 81 4.9 81 6.5 81 ct 10.8 81 12.4 83.1 12.4 90.9 ct 
12.4 129.4 l  12.4 138.09999 10.5 140.3 2.7 140.9 ct 
2.7 143.4 l  35.6 143.4 l  35.6 140.9 l 
27.6 140.3 25.4 138.4 25.4 132.8 ct 25.4 89.3 l 
32.89999 82.2 36.3 80.3 41.2 80.3 ct 49 80.3 52.7 85.3 52.7 95.6 ct 
52.7 127.8 l  52.7 137.8 50.5 140.3 42.8 140.9 ct 
42.8 143.4 l  75.1 143.4 l  75.1 140.9 l 
67.6 140.3 65.79999 138.4 65.79999 130.59999 ct 65.79999 95.2 l 
65.79999 80.7 58.9 72 47.4 72 ct 40.3 72 35.3 74.4 24.8 84.4 ct 
24.8 72.29999 l  23.9 72 l  16.1 74.79999 10.8 76.29999 2.4 78.8 ct 
p ef
pom
pum
1472 997.2 t 
63.3 117.9 m  55.8 129.7 49 134 39.1 134 ct 30.4 134 23.5 129.7 19.2 120.7 ct 
16.4 114.8 15.2 109.8 14.8 100.2 ct 62.7 100.2 l 
61.4 90.3 59.9 85.6 56.1 80.7 ct 51.5 75.1 44.3 72 36.3 72 ct 
28.5 72 21.1 74.79999 15.2 80 ct 8 86.2 3.7 97.4 3.7 110.1 ct 
3.7 131.59999 14.8 144.9 32.89999 144.9 ct 47.4 144.9 59.2 135.59999 65.79999 118.8 ct 
p
15.2 95.2 m  17 83.1 22.3 77.6 31.6 77.6 ct 
41.2 77.6 45 81.9 46.8 95.2 ct p ef
pom
gr
gs
pum
521.2 1534.3 t 
69.2 38.4 m  66.1 38.4 l  65.4 41.9 63.6 43.7 61.1 43.7 ct 
59.5 43.7 56.8 43.1 54.3 41.9 ct 48.4 39.7 42.8 38.4 37.8 38.4 ct 
31 38.4 24.2 40.9 19.2 45.6 ct 13.6 50.2 10.8 56.8 10.8 64.79999 ct 
10.8 77.2 17.6 85.9 35 95.2 ct 46.2 101.1 54.3 107.3 58.3 113.2 ct 
59.5 115.4 60.5 118.5 60.5 122.2 ct 60.5 132.8 52.7 139.9 41.2 139.9 ct 
27.6 139.9 17.6 131.2 9.9 112.3 ct 6.5 112.3 l 
11.1 145.2 l  14.5 145.2 l  14.5 142.4 16.4 140.3 18.9 140.3 ct 
20.4 140.3 23.2 140.9 26 141.8 ct 31.9 144.3 38.1 145.5 44.3 145.5 ct 
62.3 145.5 76 133.09999 76 117.3 ct 76 104.6 67.6 94.3 47.1 83.4 ct 
30.7 74.4 24.2 67.6 24.2 59.2 ct 24.2 50.5 30.7 44.6 40.3 44.6 ct 
47.4 44.6 54 47.8 59.2 53.3 ct 64.2 58.3 66.4 62.3 68.9 71.29999 ct 
72.6 71.29999 l  p ef
pom
pum
606.7 1534.3 t 
73.5 73.5 m  52.7 73.5 l  52.7 75.7 l  57.7 75.7 60.2 77.2 60.2 79.7 ct 
60.2 80.3 59.9 81.3 59.5 82.2 ct 44.3 125 l 
26.6 85.9 l  25.7 83.8 25.1 81.6 25.1 80 ct 
25.1 77.2 27.3 76 34.1 75.7 ct 34.1 73.5 l 
2.1 73.5 l  2.1 75.7 l  6.2 76.29999 8.59999 77.9 9.9 80.7 ct 
27.6 118.8 l  28.2 120.1 l  30.4 124.7 l 
34.7 132.5 37.2 138.09999 37.2 140.3 ct 37.2 142.7 33.8 152.4 31 157 ct 
28.8 161 25.4 164.2 23.2 164.2 ct 22.3 164.2 21.1 163.8 19.5 162.9 ct 
16.4 162 13.9 161.4 11.1 161.4 ct 7.7 161.4 4.6 164.5 4.6 168.2 ct 
4.6 173.2 9.6 177.2 16.1 177.2 ct 26.3 177.2 33.8 168.5 42.2 146.09999 ct 
66.1 82.8 l  68.2 77.9 69.79999 76.29999 73.5 75.7 ct 
p ef
pom
pum
684.6 1534.3 t 
48.7 94.6 m  48.1 73.5 l  46.5 73.5 l  46.2 73.79999 l 
44.6 74.79999 44.6 75.1 44 75.1 ct 43.1 75.1 41.5 74.79999 39.7 73.79999 ct 
36.3 72.6 32.89999 72 28.8 72 ct 16.69999 72 7.7 80 7.7 91.2 ct 
7.7 99.9 12.7 106.1 26 113.6 ct 35 118.5 l 
40.3 121.6 43.1 125.4 43.1 130.3 ct 43.1 137.09999 38.1 141.5 30.1 141.5 ct 
24.8 141.5 20.1 139.3 17 135.9 ct 13.9 132.2 12.4 128.5 10.5 119.8 ct 
8 119.8 l  8 144 l  9.9 144 l  11.1 142.4 11.7 142.09999 13.6 142.09999 ct 
14.8 142.09999 17 142.4 20.7 143.4 ct 25.1 144.3 29.1 144.9 31.9 144.9 ct 
44 144.9 54 135.9 54 125 ct 54 117.3 50.2 112 40.9 106.4 ct 
24.2 96.5 l  19.8 94 17.3 90.3 17.3 85.9 ct 
17.3 79.7 22.3 75.4 29.4 75.4 ct 38.1 75.4 42.8 80.7 46.5 94.6 ct 
p ef
pom
pum
744.7 1534.3 t 
39.4 73.5 m  23.9 73.5 l  23.9 55.5 l  23.9 54 23.5 53.3 22.6 53.3 ct 
21.7 54.9 20.7 56.1 19.5 57.7 ct 13.6 66.4 7.1 73.79999 4.6 74.4 ct 
2.7 75.4 1.8 76.6 1.8 77.2 ct 1.8 77.9 2.1 78.2 2.4 78.5 ct 
10.8 78.5 l  10.8 125 l  10.8 138.09999 15.5 144.9 24.5 144.9 ct 
32.2 144.9 38.1 141.2 43.1 133.09999 ct 41.2 131.2 l 
37.8 135.3 35.3 136.8 31.9 136.8 ct 26 136.8 23.9 132.5 23.9 122.9 ct 
23.9 78.5 l  39.4 78.5 l  p ef
pom
pum
787.9 1534.3 t 
63.3 117.9 m  55.8 129.7 49 134 39.1 134 ct 30.4 134 23.5 129.7 19.2 120.7 ct 
16.4 114.8 15.2 109.8 14.8 100.2 ct 62.7 100.2 l 
61.4 90.3 59.9 85.6 56.1 80.7 ct 51.5 75.1 44.3 72 36.3 72 ct 
28.5 72 21.1 74.79999 15.2 80 ct 8 86.2 3.7 97.4 3.7 110.1 ct 
3.7 131.59999 14.8 144.9 32.89999 144.9 ct 47.4 144.9 59.2 135.59999 65.79999 118.8 ct 
p
15.2 95.2 m  17 83.1 22.3 77.6 31.6 77.6 ct 
41.2 77.6 45 81.9 46.8 95.2 ct p ef
pom
pum
856.5 1534.3 t 
2.7 81.6 m  4.9 81 6.2 81 7.7 81 ct 11.7 81 13.3 83.4 13.3 90.9 ct 
13.3 130 l  13.3 138.4 11.1 140.9 2.4 140.9 ct 
2.4 143.4 l  36.89999 143.4 l  36.89999 140.9 l 
28.5 140.59999 26.3 139 26.3 132.8 ct 26.3 89 l 
26.3 88.7 27.6 87.2 28.5 86.2 ct 32.5 82.5 39.1 80 44.6 80 ct 
51.5 80 54.9 85.3 54.9 96.2 ct 54.9 130 l  54.9 138.7 53 140.3 44.3 140.9 ct 
44.3 143.4 l  79.1 143.4 l  79.1 140.9 l 
70.1 140.9 67.9 138.09999 67.9 128.5 ct 67.9 89.3 l 
72.6 82.8 77.6 80 84.7 80 ct 93.7 80 96.5 84.1 96.5 97.1 ct 
96.5 129.7 l  96.5 138.7 95.2 139.9 86.2 140.9 ct 
86.2 143.4 l  120.1 143.4 l  120.1 140.9 l 
116 140.59999 l  111.4 140.3 109.5 137.5 109.5 131.59999 ct 
109.5 99.6 l  109.5 81.3 103.3 72 91.5 72 ct 
82.5 72 74.4 76 66.1 85 ct 63.3 76 58 72 49.6 72 ct 
42.8 72 38.4 74.1 25.7 83.8 ct 25.7 72.29999 l 
24.5 72 l  16.69999 74.79999 11.4 76.6 2.7 78.8 ct 
p ef
pom
pum
976.7 1534.3 t 
pom
pum
1015.7 1534.3 t 
88.7 116.4 m  86.2 122.2 84.1 125.7 81.6 128.5 ct 
76.29999 134.4 67.6 137.09999 54.9 137.09999 ct 44.3 137.09999 l 
33.2 137.09999 31 136.2 31 130.9 ct 31 57.4 l  31 46.5 33.2 44.3 45.6 43.4 ct 
45.6 40.6 l  1.8 40.6 l  1.8 43.4 l  13.3 44.3 15.2 46.5 15.2 57.4 ct 
15.2 126.3 l  15.2 137.09999 13 139.59999 1.8 140.3 ct 
1.8 143.4 l  85.3 143.4 l  92.8 116.4 l 
p ef
pom
pum
1110.5 1534.3 t 
27 72 m  3.1 80.3 l  3.1 82.8 l  4.29999 82.5 l 
6.2 82.2 8 82.2 9.6 82.2 ct 13.3 82.2 14.5 84.7 14.5 91.5 ct 
14.5 127.5 l  14.5 138.7 13 140.3 2.4 140.9 ct 
2.4 143.4 l  39.1 143.4 l  39.1 140.9 l 
28.8 140.3 27.6 138.7 27.6 127.5 ct 27.6 72.29999 l 
p
19.8 37.2 m  15.5 37.2 12.1 40.9 12.1 45.3 ct 
12.1 49.6 15.5 53 19.8 53 ct 24.2 53 27.9 49.6 27.9 45.3 ct 
27.9 40.9 l  24.2 37.2 l  p ef
pom
pum
1153.7 1534.3 t 
23.5 37.5 m  22.9 37.2 l  16.4 39.7 12.1 40.9 4.9 42.8 ct 
0.3 44 l  0.3 46.5 l  1.2 46.5 1.8 46.5 3.1 46.5 ct 
9.3 46.5 10.5 47.8 10.5 54.3 ct 10.5 135 l 
10.5 139.59999 23.9 144.9 36.3 144.9 ct 56.8 144.9 72.6 127.8 72.6 105.5 ct 
72.6 86.6 60.8 72 45.3 72 ct 35.6 72 26.6 77.6 23.5 85 ct 
p
23.5 93.4 m  23.5 87.2 31 81.6 39.1 81.6 ct 
51.2 81.6 58.9 93.7 58.9 112.6 ct 58.9 130 51.5 139.9 38.8 139.9 ct 
30.7 139.9 23.5 136.2 23.5 132.5 ct p ef
pom
pum
1230.7 1534.3 t 
0.9 82.8 m  3.1 82.2 4.6 82.2 6.5 82.2 ct 
10.2 82.2 11.7 84.7 11.7 91.5 ct 11.7 130.3 l 
11.7 138.09999 10.5 139 0.6 140.9 ct 0.6 143.4 l 
37.8 143.4 l  37.8 140.9 l  27.3 140.59999 24.8 138.09999 24.8 129.4 ct 
24.8 94.3 l  24.8 89.3 31.3 81.6 35.6 81.6 ct 
36.6 81.6 37.8 82.5 39.7 84.1 ct 42.2 86.2 43.7 87.2 45.9 87.2 ct 
49.6 87.2 51.8 84.4 51.8 80 ct 51.8 75.1 48.7 72 43.4 72 ct 
36.89999 72 32.2 75.4 24.8 86.6 ct 24.8 72.29999 l 
23.9 72 l  15.8 75.4 10.2 77.2 0.9 80.3 ct 
p ef
pom
pum
1282.4 1534.3 t 
68.5 133.09999 m  65.79999 135.3 63.9 135.9 61.7 135.9 ct 
58 135.9 57.1 133.7 57.1 126.9 ct 57.1 96.8 l 
57.1 88.7 56.1 84.1 54 80.3 ct 50.5 74.79999 43.7 72 34.7 72 ct 
20.1 72 8.59999 79.4 8.59999 89.3 ct 8.59999 92.8 11.7 95.9 15.2 95.9 ct 
18.9 95.9 22.3 92.8 22.3 89.3 ct 22.3 88.7 22 88.1 22 86.9 ct 
21.7 85.6 21.4 84.4 21.4 83.1 ct 21.4 79.1 26.3 75.7 32.5 75.7 ct 
40.3 75.7 44.3 80 44.3 88.4 ct 44.3 98 l  20.4 107.7 18 108.9 11.1 114.8 ct 
7.7 117.9 5.5 123.2 5.5 128.09999 ct 5.5 138.09999 12.4 144.9 22 144.9 ct 
28.8 144.9 35 141.5 44.6 133.4 ct 45.3 141.5 48.1 144.9 54.6 144.9 ct 
59.9 144.9 63 143 68.5 137.09999 ct p
44.3 124.1 m  44.3 129.09999 43.7 130.3 40.3 132.2 ct 
36.6 134.4 32.2 135.9 29.1 135.9 ct 23.5 135.9 19.2 130.59999 19.2 123.8 ct 
19.2 123.2 l  19.2 114.2 25.7 108.6 44.3 101.8 ct 
p ef
pom
pum
1351.8 1534.3 t 
0.9 82.8 m  3.1 82.2 4.6 82.2 6.5 82.2 ct 
10.2 82.2 11.7 84.7 11.7 91.5 ct 11.7 130.3 l 
11.7 138.09999 10.5 139 0.6 140.9 ct 0.6 143.4 l 
37.8 143.4 l  37.8 140.9 l  27.3 140.59999 24.8 138.09999 24.8 129.4 ct 
24.8 94.3 l  24.8 89.3 31.3 81.6 35.6 81.6 ct 
36.6 81.6 37.8 82.5 39.7 84.1 ct 42.2 86.2 43.7 87.2 45.9 87.2 ct 
49.6 87.2 51.8 84.4 51.8 80 ct 51.8 75.1 48.7 72 43.4 72 ct 
36.89999 72 32.2 75.4 24.8 86.6 ct 24.8 72.29999 l 
23.9 72 l  15.8 75.4 10.2 77.2 0.9 80.3 ct 
p ef
pom
pum
1403.4 1534.3 t 
27 72 m  3.1 80.3 l  3.1 82.8 l  4.29999 82.5 l 
6.2 82.2 8 82.2 9.6 82.2 ct 13.3 82.2 14.5 84.7 14.5 91.5 ct 
14.5 127.5 l  14.5 138.7 13 140.3 2.4 140.9 ct 
2.4 143.4 l  39.1 143.4 l  39.1 140.9 l 
28.8 140.3 27.6 138.7 27.6 127.5 ct 27.6 72.29999 l 
p
19.8 37.2 m  15.5 37.2 12.1 40.9 12.1 45.3 ct 
12.1 49.6 15.5 53 19.8 53 ct 24.2 53 27.9 49.6 27.9 45.3 ct 
27.9 40.9 l  24.2 37.2 l  p ef
pom
pum
1445.8 1534.3 t 
63.3 117.9 m  55.8 129.7 49 134 39.1 134 ct 30.4 134 23.5 129.7 19.2 120.7 ct 
16.4 114.8 15.2 109.8 14.8 100.2 ct 62.7 100.2 l 
61.4 90.3 59.9 85.6 56.1 80.7 ct 51.5 75.1 44.3 72 36.3 72 ct 
28.5 72 21.1 74.79999 15.2 80 ct 8 86.2 3.7 97.4 3.7 110.1 ct 
3.7 131.59999 14.8 144.9 32.89999 144.9 ct 47.4 144.9 59.2 135.59999 65.79999 118.8 ct 
p
15.2 95.2 m  17 83.1 22.3 77.6 31.6 77.6 ct 
41.2 77.6 45 81.9 46.8 95.2 ct p ef
pom
pum
1515.2 1534.3 t 
48.7 94.6 m  48.1 73.5 l  46.5 73.5 l  46.2 73.79999 l 
44.6 74.79999 44.6 75.1 44 75.1 ct 43.1 75.1 41.5 74.79999 39.7 73.79999 ct 
36.3 72.6 32.89999 72 28.8 72 ct 16.69999 72 7.7 80 7.7 91.2 ct 
7.7 99.9 12.7 106.1 26 113.6 ct 35 118.5 l 
40.3 121.6 43.1 125.4 43.1 130.3 ct 43.1 137.09999 38.1 141.5 30.1 141.5 ct 
24.8 141.5 20.1 139.3 17 135.9 ct 13.9 132.2 12.4 128.5 10.5 119.8 ct 
8 119.8 l  8 144 l  9.9 144 l  11.1 142.4 11.7 142.09999 13.6 142.09999 ct 
14.8 142.09999 17 142.4 20.7 143.4 ct 25.1 144.3 29.1 144.9 31.9 144.9 ct 
44 144.9 54 135.9 54 125 ct 54 117.3 50.2 112 40.9 106.4 ct 
24.2 96.5 l  19.8 94 17.3 90.3 17.3 85.9 ct 
17.3 79.7 22.3 75.4 29.4 75.4 ct 38.1 75.4 42.8 80.7 46.5 94.6 ct 
p ef
pom
gr
gs
pum
521.2 2044.9 t 
63.9 43.4 m  65.79999 43.7 67.29999 43.7 67.9 43.7 ct 
72.6 44 74.4 45.3 74.4 48.4 ct 74.4 51.8 71 56.4 62.3 64.2 ct 
35 89.3 l  35 57.4 l  35 46.2 36.6 44.3 49.3 43.4 ct 
49.3 40.6 l  5.2 40.6 l  5.2 43.4 l  17.3 44.3 19.2 46.5 19.2 57.4 ct 
19.2 124.7 l  19.2 137.5 17.3 139.59999 5.2 140.3 ct 
5.2 143.4 l  49 143.4 l  49 140.3 l  36.89999 139.59999 35 137.8 35 126.3 ct 
35 97.4 l  39.1 94 l  55.5 110.5 l  67.29999 121.9 75.7 133.09999 75.7 136.8 ct 
75.7 139 73.5 139.9 69.2 140.3 ct 68.2 140.3 66.7 140.3 64.79999 140.3 ct 
64.79999 143.4 l  112 143.4 l  112 140.3 l  103.9 140.3 101.8 138.7 87.8 123.5 ct 
51.5 84.7 l  81 55.5 l  91.5 45.6 94 44.3 104.6 43.4 ct 
104.6 40.6 l  63.9 40.6 l  p ef
pom
pum
633 2044.9 t 
63.3 117.9 m  55.8 129.7 49 134 39.1 134 ct 30.4 134 23.5 129.7 19.2 120.7 ct 
16.4 114.8 15.2 109.8 14.8 100.2 ct 62.7 100.2 l 
61.4 90.3 59.9 85.6 56.1 80.7 ct 51.5 75.1 44.3 72 36.3 72 ct 
28.5 72 21.1 74.79999 15.2 80 ct 8 86.2 3.7 97.4 3.7 110.1 ct 
3.7 131.59999 14.8 144.9 32.89999 144.9 ct 47.4 144.9 59.2 135.59999 65.79999 118.8 ct 
p
15.2 95.2 m  17 83.1 22.3 77.6 31.6 77.6 ct 
41.2 77.6 45 81.9 46.8 95.2 ct p ef
pom
pum
701.5 2044.9 t 
0.9 82.8 m  3.1 82.2 4.6 82.2 6.5 82.2 ct 
10.2 82.2 11.7 84.7 11.7 91.5 ct 11.7 130.3 l 
11.7 138.09999 10.5 139 0.6 140.9 ct 0.6 143.4 l 
37.8 143.4 l  37.8 140.9 l  27.3 140.59999 24.8 138.09999 24.8 129.4 ct 
24.8 94.3 l  24.8 89.3 31.3 81.6 35.6 81.6 ct 
36.6 81.6 37.8 82.5 39.7 84.1 ct 42.2 86.2 43.7 87.2 45.9 87.2 ct 
49.6 87.2 51.8 84.4 51.8 80 ct 51.8 75.1 48.7 72 43.4 72 ct 
36.89999 72 32.2 75.4 24.8 86.6 ct 24.8 72.29999 l 
23.9 72 l  15.8 75.4 10.2 77.2 0.9 80.3 ct 
p ef
pom
pum
753.2 2044.9 t 
2.4 81.6 m  3.4 81 4.9 81 6.5 81 ct 10.8 81 12.4 83.1 12.4 90.9 ct 
12.4 129.4 l  12.4 138.09999 10.5 140.3 2.7 140.9 ct 
2.7 143.4 l  35.6 143.4 l  35.6 140.9 l 
27.6 140.3 25.4 138.4 25.4 132.8 ct 25.4 89.3 l 
32.89999 82.2 36.3 80.3 41.2 80.3 ct 49 80.3 52.7 85.3 52.7 95.6 ct 
52.7 127.8 l  52.7 137.8 50.5 140.3 42.8 140.9 ct 
42.8 143.4 l  75.1 143.4 l  75.1 140.9 l 
67.6 140.3 65.79999 138.4 65.79999 130.59999 ct 65.79999 95.2 l 
65.79999 80.7 58.9 72 47.4 72 ct 40.3 72 35.3 74.4 24.8 84.4 ct 
24.8 72.29999 l  23.9 72 l  16.1 74.79999 10.8 76.29999 2.4 78.8 ct 
p ef
pom
pum
830.2 2044.9 t 
63.3 117.9 m  55.8 129.7 49 134 39.1 134 ct 30.4 134 23.5 129.7 19.2 120.7 ct 
16.4 114.8 15.2 109.8 14.8 100.2 ct 62.7 100.2 l 
61.4 90.3 59.9 85.6 56.1 80.7 ct 51.5 75.1 44.3 72 36.3 72 ct 
28.5 72 21.1 74.79999 15.2 80 ct 8 86.2 3.7 97.4 3.7 110.1 ct 
3.7 131.59999 14.8 144.9 32.89999 144.9 ct 47.4 144.9 59.2 135.59999 65.79999 118.8 ct 
p
15.2 95.2 m  17 83.1 22.3 77.6 31.6 77.6 ct 
41.2 77.6 45 81.9 46.8 95.2 ct p ef
pom
pum
899.7 2044.9 t 
2.7 46.5 m  3.7 46.5 l  5.5 46.5 7.4 46.2 8.59999 46.2 ct 
13.6 46.2 15.2 48.4 15.2 55.8 ct 15.2 129.7 l 
15.2 138.09999 13 140.3 3.1 140.9 ct 3.1 143.4 l 
39.7 143.4 l  39.7 140.9 l  30.1 140.3 28.2 138.7 28.2 130.3 ct 
28.2 37.5 l  27.6 37.2 l  19.5 40 13.6 41.5 2.7 44 ct 
p ef
pom
gr
gs
pum
529.2 2563.5 t 
32.2 87.5 m  32.2 57.4 l  32.2 46.2 34.1 44.6 45.9 43.4 ct 
45.9 40.6 l  2.7 40.6 l  2.7 43.4 l  14.8 44.6 16.4 46.2 16.4 57.4 ct 
16.4 124.7 l  16.4 137.8 14.8 139.59999 2.7 140.3 ct 
2.7 143.4 l  45.9 143.4 l  45.9 140.3 l 
34.39999 139.3 32.2 137.5 32.2 126.3 ct 32.2 94.3 l 
79.4 94.3 l  79.4 124.7 l  79.4 137.8 77.9 139.59999 65.79999 140.3 ct 
65.79999 143.4 l  108.9 143.4 l  108.9 140.3 l 
97.1 139.3 95.2 137.5 95.2 126.3 ct 95.2 57.4 l 
95.2 46.2 96.8 44.6 108.9 43.4 ct 108.9 40.6 l 
65.79999 40.6 l  65.79999 43.4 l  77.6 44.6 79.4 46.2 79.4 57.4 ct 
79.4 87.5 l  p ef
pom
pum
641 2563.5 t 
68.5 133.09999 m  65.79999 135.3 63.9 135.9 61.7 135.9 ct 
58 135.9 57.1 133.7 57.1 126.9 ct 57.1 96.8 l 
57.1 88.7 56.1 84.1 54 80.3 ct 50.5 74.79999 43.7 72 34.7 72 ct 
20.1 72 8.59999 79.4 8.59999 89.3 ct 8.59999 92.8 11.7 95.9 15.2 95.9 ct 
18.9 95.9 22.3 92.8 22.3 89.3 ct 22.3 88.7 22 88.1 22 86.9 ct 
21.7 85.6 21.4 84.4 21.4 83.1 ct 21.4 79.1 26.3 75.7 32.5 75.7 ct 
40.3 75.7 44.3 80 44.3 88.4 ct 44.3 98 l  20.4 107.7 18 108.9 11.1 114.8 ct 
7.7 117.9 5.5 123.2 5.5 128.09999 ct 5.5 138.09999 12.4 144.9 22 144.9 ct 
28.8 144.9 35 141.5 44.6 133.4 ct 45.3 141.5 48.1 144.9 54.6 144.9 ct 
59.9 144.9 63 143 68.5 137.09999 ct p
44.3 124.1 m  44.3 129.09999 43.7 130.3 40.3 132.2 ct 
36.6 134.4 32.2 135.9 29.1 135.9 ct 23.5 135.9 19.2 130.59999 19.2 123.8 ct 
19.2 123.2 l  19.2 114.2 25.7 108.6 44.3 101.8 ct 
p ef
pom
pum
709.5 2563.5 t 
0.9 82.8 m  3.1 82.2 4.6 82.2 6.5 82.2 ct 
10.2 82.2 11.7 84.7 11.7 91.5 ct 11.7 130.3 l 
11.7 138.09999 10.5 139 0.6 140.9 ct 0.6 143.4 l 
37.8 143.4 l  37.8 140.9 l  27.3 140.59999 24.8 138.09999 24.8 129.4 ct 
24.8 94.3 l  24.8 89.3 31.3 81.6 35.6 81.6 ct 
36.6 81.6 37.8 82.5 39.7 84.1 ct 42.2 86.2 43.7 87.2 45.9 87.2 ct 
49.6 87.2 51.8 84.4 51.8 80 ct 51.8 75.1 48.7 72 43.4 72 ct 
36.89999 72 32.2 75.4 24.8 86.6 ct 24.8 72.29999 l 
23.9 72 l  15.8 75.4 10.2 77.2 0.9 80.3 ct 
p ef
pom
pum
761.2 2563.5 t 
53.3 144.9 m  76 136.8 l  76 134.4 l  73.2 134.4 72.9 134.4 72.6 134.4 ct 
67 134.4 65.79999 132.8 65.79999 125.7 ct 65.79999 37.5 l 
64.79999 37.2 l  57.4 40 52.1 41.5 42.2 44 ct 42.2 46.5 l 
43.4 46.5 44.3 46.5 45.6 46.5 ct 51.2 46.5 52.7 48.1 52.7 54.3 ct 
52.7 78.5 l  46.8 73.5 42.5 72 36.3 72 ct 18.6 72 4 89.3 4 111.4 ct 
4 131.2 15.8 144.9 32.89999 144.9 ct 41.5 144.9 47.4 141.8 52.7 134.4 ct 
52.7 144.3 l  p
52.7 127.5 m  52.7 128.5 51.5 130.3 49.9 132.2 ct 
47.1 135.3 43.4 136.8 38.8 136.8 ct 26 136.8 17.3 124.4 17.3 105.2 ct 
17.3 87.8 25.1 76.29999 36.89999 76.29999 ct 45 76.29999 52.7 83.4 52.7 91.8 ct 
p ef
pom
pum
838.2 2563.5 t 
88.4 73.5 m  88.4 75.7 l  93.7 76.9 95.2 77.9 95.2 80.7 ct 
95.2 82.8 94.3 86.6 92.8 90.9 ct 78.8 125.4 l 
65.79999 90.6 l  63 83.4 63 83.4 63 81.3 ct 63 77.9 64.79999 76.9 72 75.7 ct 
72 73.5 l  40.6 73.5 l  40.6 75.7 l  46.2 76.29999 48.1 78.2 51.2 86.6 ct 
52.4 89.3 53.3 92.4 54.3 95.2 ct 40.3 126 l 
24.8 85.6 l  24.2 84.1 23.9 82.5 23.9 81 ct 
23.9 77.6 25.7 76.29999 31 75.7 ct 31 73.5 l  3.1 73.5 l 
3.1 75.7 l  6.8 76 8 77.6 11.4 85.6 ct 32.2 138.7 l 
34.1 143.4 35.3 145.5 36.3 145.5 ct 37.2 145.5 38.4 143.4 40.3 139.3 ct 
57.7 102.1 l  71.7 138.7 l  73.79999 144.59999 74.4 145.5 75.4 145.5 ct 
76.6 145.5 77.2 144 79.7 137.8 ct 101.1 84.1 l 
103.9 77.6 104.6 76.9 107.7 75.7 ct 107.7 73.5 l 
p ef
pom
pum
950 2563.5 t 
68.5 133.09999 m  65.79999 135.3 63.9 135.9 61.7 135.9 ct 
58 135.9 57.1 133.7 57.1 126.9 ct 57.1 96.8 l 
57.1 88.7 56.1 84.1 54 80.3 ct 50.5 74.79999 43.7 72 34.7 72 ct 
20.1 72 8.59999 79.4 8.59999 89.3 ct 8.59999 92.8 11.7 95.9 15.2 95.9 ct 
18.9 95.9 22.3 92.8 22.3 89.3 ct 22.3 88.7 22 88.1 22 86.9 ct 
21.7 85.6 21.4 84.4 21.4 83.1 ct 21.4 79.1 26.3 75.7 32.5 75.7 ct 
40.3 75.7 44.3 80 44.3 88.4 ct 44.3 98 l  20.4 107.7 18 108.9 11.1 114.8 ct 
7.7 117.9 5.5 123.2 5.5 128.09999 ct 5.5 138.09999 12.4 144.9 22 144.9 ct 
28.8 144.9 35 141.5 44.6 133.4 ct 45.3 141.5 48.1 144.9 54.6 144.9 ct 
59.9 144.9 63 143 68.5 137.09999 ct p
44.3 124.1 m  44.3 129.09999 43.7 130.3 40.3 132.2 ct 
36.6 134.4 32.2 135.9 29.1 135.9 ct 23.5 135.9 19.2 130.59999 19.2 123.8 ct 
19.2 123.2 l  19.2 114.2 25.7 108.6 44.3 101.8 ct 
p ef
pom
pum
1019.4 2563.5 t 
0.9 82.8 m  3.1 82.2 4.6 82.2 6.5 82.2 ct 
10.2 82.2 11.7 84.7 11.7 91.5 ct 11.7 130.3 l 
11.7 138.09999 10.5 139 0.6 140.9 ct 0.6 143.4 l 
37.8 143.4 l  37.8 140.9 l  27.3 140.59999 24.8 138.09999 24.8 129.4 ct 
24.8 94.3 l  24.8 89.3 31.3 81.6 35.6 81.6 ct 
36.6 81.6 37.8 82.5 39.7 84.1 ct 42.2 86.2 43.7 87.2 45.9 87.2 ct 
49.6 87.2 51.8 84.4 51.8 80 ct 51.8 75.1 48.7 72 43.4 72 ct 
36.89999 72 32.2 75.4 24.8 86.6 ct 24.8 72.29999 l 
23.9 72 l  15.8 75.4 10.2 77.2 0.9 80.3 ct 
p ef
pom
pum
1071.1 2563.5 t 
63.3 117.9 m  55.8 129.7 49 134 39.1 134 ct 30.4 134 23.5 129.7 19.2 120.7 ct 
16.4 114.8 15.2 109.8 14.8 100.2 ct 62.7 100.2 l 
61.4 90.3 59.9 85.6 56.1 80.7 ct 51.5 75.1 44.3 72 36.3 72 ct 
28.5 72 21.1 74.79999 15.2 80 ct 8 86.2 3.7 97.4 3.7 110.1 ct 
3.7 131.59999 14.8 144.9 32.89999 144.9 ct 47.4 144.9 59.2 135.59999 65.79999 118.8 ct 
p
15.2 95.2 m  17 83.1 22.3 77.6 31.6 77.6 ct 
41.2 77.6 45 81.9 46.8 95.2 ct p ef
pom
gr
gs
pum
1881.2 2563.5 t 
45 38.4 m  17 52.4 l  17 54.6 l  18.9 54 20.7 53.3 21.4 53 ct 
24.2 51.8 26.6 51.2 28.2 51.2 ct 31.6 51.2 32.89999 53.6 32.89999 58.6 ct 
32.89999 128.8 l  32.89999 134 31.6 137.5 29.1 139 ct 
27 140.3 24.8 140.9 18.3 140.9 ct 18.3 143.4 l 
61.1 143.4 l  61.1 140.9 l  48.7 140.9 46.2 139.3 46.2 131.9 ct 
46.2 38.8 l  p ef
pom
pum
1881.2 2563.5 t 
45 38.4 m  17 52.4 l  17 54.6 l  18.9 54 20.7 53.3 21.4 53 ct 
24.2 51.8 26.6 51.2 28.2 51.2 ct 31.6 51.2 32.89999 53.6 32.89999 58.6 ct 
32.89999 128.8 l  32.89999 134 31.6 137.5 29.1 139 ct 
27 140.3 24.8 140.9 18.3 140.9 ct 18.3 143.4 l 
61.1 143.4 l  61.1 140.9 l  48.7 140.9 46.2 139.3 46.2 131.9 ct 
46.2 38.8 l  p ef
pom
gr
gs
pum
1870.6 2068.7 t 
73.5 121.9 m  71.7 121.3 l  65.79999 130 63.9 131.59999 56.8 131.59999 ct 
19.8 131.59999 l  45.9 104.2 l  59.5 89.7 65.79999 77.9 65.79999 65.79999 ct 
65.79999 50.2 53 38.4 36.89999 38.4 ct 28.5 38.4 20.4 41.9 14.5 48.1 ct 
9.6 53.3 7.4 58.3 4.6 69.2 ct 8 70.1 l 
14.2 54.9 19.8 49.9 30.4 49.9 ct 43.4 49.9 52.4 58.6 52.4 71.7 ct 
52.4 83.8 45.3 98.3 32.2 112 ct 4.6 141.5 l 
4.6 143.4 l  65.1 143.4 l  p ef
pom
pum
1870.6 2068.7 t 
73.5 121.9 m  71.7 121.3 l  65.79999 130 63.9 131.59999 56.8 131.59999 ct 
19.8 131.59999 l  45.9 104.2 l  59.5 89.7 65.79999 77.9 65.79999 65.79999 ct 
65.79999 50.2 53 38.4 36.89999 38.4 ct 28.5 38.4 20.4 41.9 14.5 48.1 ct 
9.6 53.3 7.4 58.3 4.6 69.2 ct 8 70.1 l 
14.2 54.9 19.8 49.9 30.4 49.9 ct 43.4 49.9 52.4 58.6 52.4 71.7 ct 
52.4 83.8 45.3 98.3 32.2 112 ct 4.6 141.5 l 
4.6 143.4 l  65.1 143.4 l  p ef
pom
gr
gs
pum
1881.2 1513.1 t 
23.5 92.1 m  32.89999 92.1 36.3 92.4 40 93.7 ct 
49.6 97.1 55.8 106.1 55.8 116.7 ct 55.8 129.7 46.8 139.9 35.3 139.9 ct 
31.3 139.9 28.2 138.7 22.3 135 ct 17.6 132.2 15.2 131.2 12.4 131.2 ct 
9 131.2 6.5 133.4 6.5 136.5 ct 6.5 142.09999 13.3 145.5 24.2 145.5 ct 
36 145.5 48.4 141.5 55.5 135 ct 63 128.8 67 119.8 67 109.2 ct 
67 101.5 64.5 94 59.9 89.3 ct 56.8 85.9 54 84.1 47.1 81 ct 
57.7 73.79999 61.7 67.9 61.7 59.5 ct 61.7 47.1 51.8 38.4 37.5 38.4 ct 
29.7 38.4 22.9 40.9 17.3 45.9 ct 12.7 50.2 10.2 54.3 6.8 63.6 ct 
9.3 64.2 l  15.5 52.7 22.6 47.8 32.2 47.8 ct 
42.5 47.8 49.3 54.6 49.3 64.2 ct 49.3 69.79999 47.1 75.4 43.1 79.4 ct 
38.4 84.1 34.1 86.2 23.5 90 ct p ef
pom
pum
1881.2 1513.1 t 
23.5 92.1 m  32.89999 92.1 36.3 92.4 40 93.7 ct 
49.6 97.1 55.8 106.1 55.8 116.7 ct 55.8 129.7 46.8 139.9 35.3 139.9 ct 
31.3 139.9 28.2 138.7 22.3 135 ct 17.6 132.2 15.2 131.2 12.4 131.2 ct 
9 131.2 6.5 133.4 6.5 136.5 ct 6.5 142.09999 13.3 145.5 24.2 145.5 ct 
36 145.5 48.4 141.5 55.5 135 ct 63 128.8 67 119.8 67 109.2 ct 
67 101.5 64.5 94 59.9 89.3 ct 56.8 85.9 54 84.1 47.1 81 ct 
57.7 73.79999 61.7 67.9 61.7 59.5 ct 61.7 47.1 51.8 38.4 37.5 38.4 ct 
29.7 38.4 22.9 40.9 17.3 45.9 ct 12.7 50.2 10.2 54.3 6.8 63.6 ct 
9.3 64.2 l  15.5 52.7 22.6 47.8 32.2 47.8 ct 
42.5 47.8 49.3 54.6 49.3 64.2 ct 49.3 69.79999 47.1 75.4 43.1 79.4 ct 
38.4 84.1 34.1 86.2 23.5 90 ct p ef
pom
gr
gs
pum
1881.2 973.4 t 
73.2 107.3 m  57.4 107.3 l  57.4 38.4 l 
50.5 38.4 l  1.8 107.3 l  1.8 117.3 l  45.3 117.3 l 
45.3 143.4 l  57.4 143.4 l  57.4 117.3 l 
73.2 117.3 l  p
45.3 107.3 m  8 107.3 l  45.3 54.3 l  p ef
pom
pum
1881.2 973.4 t 
73.2 107.3 m  57.4 107.3 l  57.4 38.4 l 
50.5 38.4 l  1.8 107.3 l  1.8 117.3 l  45.3 117.3 l 
45.3 143.4 l  57.4 143.4 l  57.4 117.3 l 
73.2 117.3 l  p
45.3 107.3 m  8 107.3 l  45.3 54.3 l  p ef
pom
gr
gs
pum
1881.2 322.5 t 
27.9 52.7 m  58.3 52.7 l  60.8 52.7 61.4 52.4 62 51.5 ct 
67.9 37.5 l  66.4 36.6 l  64.2 39.7 62.7 40.6 59.2 40.6 ct 
27 40.6 l  9.9 77.2 l  9.9 77.6 9.9 77.9 9.9 78.2 ct 
9.9 78.8 10.5 79.4 11.7 79.4 ct 16.69999 79.4 22.9 80.3 29.1 82.5 ct 
47.1 88.1 55.2 97.7 55.2 113.2 ct 55.2 128.09999 45.9 139.59999 33.8 139.59999 ct 
30.7 139.59999 27.9 138.7 23.2 135.3 ct 18.3 131.59999 14.8 130 11.4 130 ct 
7.1 130 4.9 131.9 4.9 135.9 ct 4.9 141.8 12.1 145.5 23.9 145.5 ct 
36.89999 145.5 48.1 141.2 55.8 133.4 ct 63 126.3 66.1 117.6 66.1 105.8 ct 
66.1 94.6 63.3 87.5 55.5 79.7 ct 48.7 72.9 39.7 69.2 21.4 66.1 ct 
p ef
pom
pum
1881.2 322.5 t 
27.9 52.7 m  58.3 52.7 l  60.8 52.7 61.4 52.4 62 51.5 ct 
67.9 37.5 l  66.4 36.6 l  64.2 39.7 62.7 40.6 59.2 40.6 ct 
27 40.6 l  9.9 77.2 l  9.9 77.6 9.9 77.9 9.9 78.2 ct 
9.9 78.8 10.5 79.4 11.7 79.4 ct 16.69999 79.4 22.9 80.3 29.1 82.5 ct 
47.1 88.1 55.2 97.7 55.2 113.2 ct 55.2 128.09999 45.9 139.59999 33.8 139.59999 ct 
30.7 139.59999 27.9 138.7 23.2 135.3 ct 18.3 131.59999 14.8 130 11.4 130 ct 
7.1 130 4.9 131.9 4.9 135.9 ct 4.9 141.8 12.1 145.5 23.9 145.5 ct 
36.89999 145.5 48.1 141.2 55.8 133.4 ct 63 126.3 66.1 117.6 66.1 105.8 ct 
66.1 94.6 63.3 87.5 55.5 79.7 ct 48.7 72.9 39.7 69.2 21.4 66.1 ct 
p ef
pom
gr
gr
0 2840.1 t 
pom
count op_count sub {pop} repeat countdictstack dict_count sub {end} repeat b4_inc_state restore
%%PageTrailer
%%Trailer
%%EOF
