(JNukeMethodEvent Sor.main (methodstart) (vmState "Sor.main ([Ljava/lang/String;)V" (pc 0) (thread 0)))
(JNukeRByteCode 6 "r13 = InvokeVirtual" (JNukeMethod "java/lang/String.equals" (JNukeSignature "Z" (JNukeVector "Ljava/lang/Object;"))) r13 r14 (line 31))
(JNukeMethodEvent EDU/oswego/cs/dl/util/concurrent/CyclicBarrier.<init> (methodstart) (vmState "EDU/oswego/cs/dl/util/concurrent/CyclicBarrier.<init> (I)V" (pc 0) (thread 0)))
(JNukeMethodEvent EDU/oswego/cs/dl/util/concurrent/CyclicBarrier.<init> (methodstart) (vmState "EDU/oswego/cs/dl/util/concurrent/CyclicBarrier.<init> (ILjava/lang/Runnable;)V" (pc 0) (thread 0)))
(JNukeMethodEvent EDU/oswego/cs/dl/util/concurrent/CyclicBarrier.<init> (methodend) (vmState "EDU/oswego/cs/dl/util/concurrent/CyclicBarrier.<init> (ILjava/lang/Runnable;)V" (line 113) (pc 26) (thread 0)))
(JNukeMethodEvent EDU/oswego/cs/dl/util/concurrent/CyclicBarrier.<init> (methodend) (vmState "EDU/oswego/cs/dl/util/concurrent/CyclicBarrier.<init> (I)V" (line 100) (pc 4) (thread 0)))
(JNukeRByteCode 132 "<r13, r14> = InvokeVirtual" (JNukeMethod "java/util/Date.getTime" (JNukeSignature "J" (JNukeVector))) r13 (line 78))
(JNukeMethodEvent sor_first_row_odd.<init> (methodstart) (vmState "sor_first_row_odd.<init> (II)V" (pc 0) (thread 0)))
(JNukeMethodEvent sor_first_row_odd.<init> (methodend) (vmState "sor_first_row_odd.<init> (II)V" (line 134) (pc 20) (thread 0)))
(JNukeMethodEvent sor_first_row_odd.run (methodstart) (vmState "Sor.main ([Ljava/lang/String;)V" (line 90) (pc 179) (thread 1)))
(JNukeRByteCode 179 "     InvokeVirtual" (JNukeMethod "java/lang/Thread.start" (JNukeSignature "V" (JNukeVector))) r13 (line 90))
(JNukeMethodEvent sor_first_row_odd.<init> (methodstart) (vmState "sor_first_row_odd.<init> (II)V" (pc 0) (thread 0)))
(JNukeMethodEvent sor_first_row_odd.<init> (methodend) (vmState "sor_first_row_odd.<init> (II)V" (line 134) (pc 20) (thread 0)))
(JNukeMethodEvent sor_first_row_odd.run (methodstart) (vmState "Sor.main ([Ljava/lang/String;)V" (line 90) (pc 179) (thread 2)))
(JNukeRByteCode 179 "     InvokeVirtual" (JNukeMethod "java/lang/Thread.start" (JNukeSignature "V" (JNukeVector))) r13 (line 90))
(JNukeRByteCode 190 "     InvokeVirtual" (JNukeMethod "java/lang/Thread.join" (JNukeSignature "V" (JNukeVector))) r13 (line 95))
(JNukeMethodEvent EDU/oswego/cs/dl/util/concurrent/CyclicBarrier.barrier (methodstart) (vmState "EDU/oswego/cs/dl/util/concurrent/CyclicBarrier.barrier ()I" (pc 0) (thread 1)))
(JNukeRByteCode 117 "r5 = InvokeVirtual" (JNukeMethod "EDU/oswego/cs/dl/util/concurrent/CyclicBarrier.barrier" (JNukeSignature "I" (JNukeVector))) r5 (line 157))
(JNukeLockAccess (JNukeLockInfo "EDU/oswego/cs/dl/util/concurrent/CyclicBarrier") (vmState "EDU/oswego/cs/dl/util/concurrent/CyclicBarrier.doBarrier (ZJ)I" (line 217) (pc 3) (thread 1)))
(JNukeMethodEvent EDU/oswego/cs/dl/util/concurrent/CyclicBarrier.doBarrier (methodstart) (vmState "EDU/oswego/cs/dl/util/concurrent/CyclicBarrier.doBarrier (ZJ)I" (pc 0) (thread 1)))
(JNukeRByteCode 3 "r1 = InvokeVirtual" (JNukeMethod "EDU/oswego/cs/dl/util/concurrent/CyclicBarrier.doBarrier" (JNukeSignature "I" (JNukeVector "Z" "J"))) r1 r2 r3 r4 (line 178))
(JNukeRByteCode 85 "     InvokeVirtual" (JNukeMethod "java/lang/Object.wait" (JNukeSignature "V" (JNukeVector "J"))) r11 r12 r13 (line 252))
(JNukeMethodEvent EDU/oswego/cs/dl/util/concurrent/CyclicBarrier.barrier (methodstart) (vmState "EDU/oswego/cs/dl/util/concurrent/CyclicBarrier.barrier ()I" (pc 0) (thread 2)))
(JNukeRByteCode 117 "r5 = InvokeVirtual" (JNukeMethod "EDU/oswego/cs/dl/util/concurrent/CyclicBarrier.barrier" (JNukeSignature "I" (JNukeVector))) r5 (line 157))
(JNukeLockAccess (JNukeLockInfo "EDU/oswego/cs/dl/util/concurrent/CyclicBarrier") (vmState "EDU/oswego/cs/dl/util/concurrent/CyclicBarrier.doBarrier (ZJ)I" (line 217) (pc 3) (thread 2)))
(JNukeMethodEvent EDU/oswego/cs/dl/util/concurrent/CyclicBarrier.doBarrier (methodstart) (vmState "EDU/oswego/cs/dl/util/concurrent/CyclicBarrier.doBarrier (ZJ)I" (pc 0) (thread 2)))
(JNukeRByteCode 3 "r1 = InvokeVirtual" (JNukeMethod "EDU/oswego/cs/dl/util/concurrent/CyclicBarrier.doBarrier" (JNukeSignature "I" (JNukeVector "Z" "J"))) r1 r2 r3 r4 (line 178))
(JNukeRByteCode 40 "     InvokeVirtual" (JNukeMethod "java/lang/Object.notifyAll" (JNukeSignature "V" (JNukeVector))) r11 (line 230))
(JNukeMethodEvent EDU/oswego/cs/dl/util/concurrent/CyclicBarrier.doBarrier (methodend) (vmState "EDU/oswego/cs/dl/util/concurrent/CyclicBarrier.doBarrier (ZJ)I" (line 234) (pc 48) (thread 2)))
(JNukeLockAccess (JNukeLockInfo "EDU/oswego/cs/dl/util/concurrent/CyclicBarrier") (vmState "EDU/oswego/cs/dl/util/concurrent/CyclicBarrier.barrier ()I" (line 178) (pc 4) (thread 2)))
(JNukeMethodEvent EDU/oswego/cs/dl/util/concurrent/CyclicBarrier.barrier (methodend) (vmState "EDU/oswego/cs/dl/util/concurrent/CyclicBarrier.barrier ()I" (line 178) (pc 4) (thread 2)))
(JNukeMethodEvent EDU/oswego/cs/dl/util/concurrent/CyclicBarrier.doBarrier (methodend) (vmState "EDU/oswego/cs/dl/util/concurrent/CyclicBarrier.doBarrier (ZJ)I" (line 270) (pc 114) (thread 1)))
(JNukeLockAccess (JNukeLockInfo "EDU/oswego/cs/dl/util/concurrent/CyclicBarrier") (vmState "EDU/oswego/cs/dl/util/concurrent/CyclicBarrier.barrier ()I" (line 178) (pc 4) (thread 1)))
(JNukeMethodEvent EDU/oswego/cs/dl/util/concurrent/CyclicBarrier.barrier (methodend) (vmState "EDU/oswego/cs/dl/util/concurrent/CyclicBarrier.barrier ()I" (line 178) (pc 4) (thread 1)))
(JNukeMethodEvent EDU/oswego/cs/dl/util/concurrent/CyclicBarrier.barrier (methodstart) (vmState "EDU/oswego/cs/dl/util/concurrent/CyclicBarrier.barrier ()I" (pc 0) (thread 2)))
(JNukeRByteCode 236 "r5 = InvokeVirtual" (JNukeMethod "EDU/oswego/cs/dl/util/concurrent/CyclicBarrier.barrier" (JNukeSignature "I" (JNukeVector))) r5 (line 176))
(JNukeLockAccess (JNukeLockInfo "EDU/oswego/cs/dl/util/concurrent/CyclicBarrier") (vmState "EDU/oswego/cs/dl/util/concurrent/CyclicBarrier.doBarrier (ZJ)I" (line 217) (pc 3) (thread 2)))
(JNukeMethodEvent EDU/oswego/cs/dl/util/concurrent/CyclicBarrier.doBarrier (methodstart) (vmState "EDU/oswego/cs/dl/util/concurrent/CyclicBarrier.doBarrier (ZJ)I" (pc 0) (thread 2)))
(JNukeRByteCode 3 "r1 = InvokeVirtual" (JNukeMethod "EDU/oswego/cs/dl/util/concurrent/CyclicBarrier.doBarrier" (JNukeSignature "I" (JNukeVector "Z" "J"))) r1 r2 r3 r4 (line 178))
(JNukeMethodEvent EDU/oswego/cs/dl/util/concurrent/CyclicBarrier.barrier (methodstart) (vmState "EDU/oswego/cs/dl/util/concurrent/CyclicBarrier.barrier ()I" (pc 0) (thread 1)))
(JNukeRByteCode 236 "r5 = InvokeVirtual" (JNukeMethod "EDU/oswego/cs/dl/util/concurrent/CyclicBarrier.barrier" (JNukeSignature "I" (JNukeVector))) r5 (line 176))
(JNukeRByteCode 85 "     InvokeVirtual" (JNukeMethod "java/lang/Object.wait" (JNukeSignature "V" (JNukeVector "J"))) r11 r12 r13 (line 252))
(JNukeLockAccess (JNukeLockInfo "EDU/oswego/cs/dl/util/concurrent/CyclicBarrier") (vmState "EDU/oswego/cs/dl/util/concurrent/CyclicBarrier.doBarrier (ZJ)I" (line 217) (pc 3) (thread 1)))
(JNukeMethodEvent EDU/oswego/cs/dl/util/concurrent/CyclicBarrier.doBarrier (methodstart) (vmState "EDU/oswego/cs/dl/util/concurrent/CyclicBarrier.doBarrier (ZJ)I" (pc 0) (thread 1)))
(JNukeRByteCode 3 "r1 = InvokeVirtual" (JNukeMethod "EDU/oswego/cs/dl/util/concurrent/CyclicBarrier.doBarrier" (JNukeSignature "I" (JNukeVector "Z" "J"))) r1 r2 r3 r4 (line 178))
(JNukeRByteCode 40 "     InvokeVirtual" (JNukeMethod "java/lang/Object.notifyAll" (JNukeSignature "V" (JNukeVector))) r11 (line 230))
(JNukeMethodEvent EDU/oswego/cs/dl/util/concurrent/CyclicBarrier.doBarrier (methodend) (vmState "EDU/oswego/cs/dl/util/concurrent/CyclicBarrier.doBarrier (ZJ)I" (line 234) (pc 48) (thread 1)))
(JNukeLockAccess (JNukeLockInfo "EDU/oswego/cs/dl/util/concurrent/CyclicBarrier") (vmState "EDU/oswego/cs/dl/util/concurrent/CyclicBarrier.barrier ()I" (line 178) (pc 4) (thread 1)))
(JNukeMethodEvent EDU/oswego/cs/dl/util/concurrent/CyclicBarrier.barrier (methodend) (vmState "EDU/oswego/cs/dl/util/concurrent/CyclicBarrier.barrier ()I" (line 178) (pc 4) (thread 1)))
(JNukeMethodEvent EDU/oswego/cs/dl/util/concurrent/CyclicBarrier.doBarrier (methodend) (vmState "EDU/oswego/cs/dl/util/concurrent/CyclicBarrier.doBarrier (ZJ)I" (line 270) (pc 114) (thread 2)))
(JNukeLockAccess (JNukeLockInfo "EDU/oswego/cs/dl/util/concurrent/CyclicBarrier") (vmState "EDU/oswego/cs/dl/util/concurrent/CyclicBarrier.barrier ()I" (line 178) (pc 4) (thread 2)))
(JNukeMethodEvent EDU/oswego/cs/dl/util/concurrent/CyclicBarrier.barrier (methodend) (vmState "EDU/oswego/cs/dl/util/concurrent/CyclicBarrier.barrier ()I" (line 178) (pc 4) (thread 2)))
(JNukeMethodEvent EDU/oswego/cs/dl/util/concurrent/CyclicBarrier.barrier (methodstart) (vmState "EDU/oswego/cs/dl/util/concurrent/CyclicBarrier.barrier ()I" (pc 0) (thread 1)))
(JNukeRByteCode 117 "r5 = InvokeVirtual" (JNukeMethod "EDU/oswego/cs/dl/util/concurrent/CyclicBarrier.barrier" (JNukeSignature "I" (JNukeVector))) r5 (line 157))
(JNukeLockAccess (JNukeLockInfo "EDU/oswego/cs/dl/util/concurrent/CyclicBarrier") (vmState "EDU/oswego/cs/dl/util/concurrent/CyclicBarrier.doBarrier (ZJ)I" (line 217) (pc 3) (thread 1)))
(JNukeMethodEvent EDU/oswego/cs/dl/util/concurrent/CyclicBarrier.doBarrier (methodstart) (vmState "EDU/oswego/cs/dl/util/concurrent/CyclicBarrier.doBarrier (ZJ)I" (pc 0) (thread 1)))
(JNukeRByteCode 3 "r1 = InvokeVirtual" (JNukeMethod "EDU/oswego/cs/dl/util/concurrent/CyclicBarrier.doBarrier" (JNukeSignature "I" (JNukeVector "Z" "J"))) r1 r2 r3 r4 (line 178))
(JNukeMethodEvent EDU/oswego/cs/dl/util/concurrent/CyclicBarrier.barrier (methodstart) (vmState "EDU/oswego/cs/dl/util/concurrent/CyclicBarrier.barrier ()I" (pc 0) (thread 2)))
(JNukeRByteCode 117 "r5 = InvokeVirtual" (JNukeMethod "EDU/oswego/cs/dl/util/concurrent/CyclicBarrier.barrier" (JNukeSignature "I" (JNukeVector))) r5 (line 157))
(JNukeRByteCode 85 "     InvokeVirtual" (JNukeMethod "java/lang/Object.wait" (JNukeSignature "V" (JNukeVector "J"))) r11 r12 r13 (line 252))
(JNukeLockAccess (JNukeLockInfo "EDU/oswego/cs/dl/util/concurrent/CyclicBarrier") (vmState "EDU/oswego/cs/dl/util/concurrent/CyclicBarrier.doBarrier (ZJ)I" (line 217) (pc 3) (thread 2)))
(JNukeMethodEvent EDU/oswego/cs/dl/util/concurrent/CyclicBarrier.doBarrier (methodstart) (vmState "EDU/oswego/cs/dl/util/concurrent/CyclicBarrier.doBarrier (ZJ)I" (pc 0) (thread 2)))
(JNukeRByteCode 3 "r1 = InvokeVirtual" (JNukeMethod "EDU/oswego/cs/dl/util/concurrent/CyclicBarrier.doBarrier" (JNukeSignature "I" (JNukeVector "Z" "J"))) r1 r2 r3 r4 (line 178))
(JNukeRByteCode 40 "     InvokeVirtual" (JNukeMethod "java/lang/Object.notifyAll" (JNukeSignature "V" (JNukeVector))) r11 (line 230))
(JNukeMethodEvent EDU/oswego/cs/dl/util/concurrent/CyclicBarrier.doBarrier (methodend) (vmState "EDU/oswego/cs/dl/util/concurrent/CyclicBarrier.doBarrier (ZJ)I" (line 234) (pc 48) (thread 2)))
(JNukeLockAccess (JNukeLockInfo "EDU/oswego/cs/dl/util/concurrent/CyclicBarrier") (vmState "EDU/oswego/cs/dl/util/concurrent/CyclicBarrier.barrier ()I" (line 178) (pc 4) (thread 2)))
(JNukeMethodEvent EDU/oswego/cs/dl/util/concurrent/CyclicBarrier.barrier (methodend) (vmState "EDU/oswego/cs/dl/util/concurrent/CyclicBarrier.barrier ()I" (line 178) (pc 4) (thread 2)))
(JNukeMethodEvent EDU/oswego/cs/dl/util/concurrent/CyclicBarrier.doBarrier (methodend) (vmState "EDU/oswego/cs/dl/util/concurrent/CyclicBarrier.doBarrier (ZJ)I" (line 270) (pc 114) (thread 1)))
(JNukeLockAccess (JNukeLockInfo "EDU/oswego/cs/dl/util/concurrent/CyclicBarrier") (vmState "EDU/oswego/cs/dl/util/concurrent/CyclicBarrier.barrier ()I" (line 178) (pc 4) (thread 1)))
(JNukeMethodEvent EDU/oswego/cs/dl/util/concurrent/CyclicBarrier.barrier (methodend) (vmState "EDU/oswego/cs/dl/util/concurrent/CyclicBarrier.barrier ()I" (line 178) (pc 4) (thread 1)))
(JNukeMethodEvent EDU/oswego/cs/dl/util/concurrent/CyclicBarrier.barrier (methodstart) (vmState "EDU/oswego/cs/dl/util/concurrent/CyclicBarrier.barrier ()I" (pc 0) (thread 2)))
(JNukeRByteCode 236 "r5 = InvokeVirtual" (JNukeMethod "EDU/oswego/cs/dl/util/concurrent/CyclicBarrier.barrier" (JNukeSignature "I" (JNukeVector))) r5 (line 176))
(JNukeLockAccess (JNukeLockInfo "EDU/oswego/cs/dl/util/concurrent/CyclicBarrier") (vmState "EDU/oswego/cs/dl/util/concurrent/CyclicBarrier.doBarrier (ZJ)I" (line 217) (pc 3) (thread 2)))
(JNukeMethodEvent EDU/oswego/cs/dl/util/concurrent/CyclicBarrier.doBarrier (methodstart) (vmState "EDU/oswego/cs/dl/util/concurrent/CyclicBarrier.doBarrier (ZJ)I" (pc 0) (thread 2)))
(JNukeRByteCode 3 "r1 = InvokeVirtual" (JNukeMethod "EDU/oswego/cs/dl/util/concurrent/CyclicBarrier.doBarrier" (JNukeSignature "I" (JNukeVector "Z" "J"))) r1 r2 r3 r4 (line 178))
(JNukeMethodEvent EDU/oswego/cs/dl/util/concurrent/CyclicBarrier.barrier (methodstart) (vmState "EDU/oswego/cs/dl/util/concurrent/CyclicBarrier.barrier ()I" (pc 0) (thread 1)))
(JNukeRByteCode 236 "r5 = InvokeVirtual" (JNukeMethod "EDU/oswego/cs/dl/util/concurrent/CyclicBarrier.barrier" (JNukeSignature "I" (JNukeVector))) r5 (line 176))
(JNukeRByteCode 85 "     InvokeVirtual" (JNukeMethod "java/lang/Object.wait" (JNukeSignature "V" (JNukeVector "J"))) r11 r12 r13 (line 252))
(JNukeLockAccess (JNukeLockInfo "EDU/oswego/cs/dl/util/concurrent/CyclicBarrier") (vmState "EDU/oswego/cs/dl/util/concurrent/CyclicBarrier.doBarrier (ZJ)I" (line 217) (pc 3) (thread 1)))
(JNukeMethodEvent EDU/oswego/cs/dl/util/concurrent/CyclicBarrier.doBarrier (methodstart) (vmState "EDU/oswego/cs/dl/util/concurrent/CyclicBarrier.doBarrier (ZJ)I" (pc 0) (thread 1)))
(JNukeRByteCode 3 "r1 = InvokeVirtual" (JNukeMethod "EDU/oswego/cs/dl/util/concurrent/CyclicBarrier.doBarrier" (JNukeSignature "I" (JNukeVector "Z" "J"))) r1 r2 r3 r4 (line 178))
(JNukeRByteCode 40 "     InvokeVirtual" (JNukeMethod "java/lang/Object.notifyAll" (JNukeSignature "V" (JNukeVector))) r11 (line 230))
(JNukeMethodEvent EDU/oswego/cs/dl/util/concurrent/CyclicBarrier.doBarrier (methodend) (vmState "EDU/oswego/cs/dl/util/concurrent/CyclicBarrier.doBarrier (ZJ)I" (line 234) (pc 48) (thread 1)))
(JNukeLockAccess (JNukeLockInfo "EDU/oswego/cs/dl/util/concurrent/CyclicBarrier") (vmState "EDU/oswego/cs/dl/util/concurrent/CyclicBarrier.barrier ()I" (line 178) (pc 4) (thread 1)))
(JNukeMethodEvent EDU/oswego/cs/dl/util/concurrent/CyclicBarrier.barrier (methodend) (vmState "EDU/oswego/cs/dl/util/concurrent/CyclicBarrier.barrier ()I" (line 178) (pc 4) (thread 1)))
(JNukeMethodEvent sor_first_row_odd.run (methodend) (vmState "sor_first_row_odd.run ()V" (line 181) (pc 245) (thread 1)))
(JNukeMethodEvent EDU/oswego/cs/dl/util/concurrent/CyclicBarrier.doBarrier (methodend) (vmState "EDU/oswego/cs/dl/util/concurrent/CyclicBarrier.doBarrier (ZJ)I" (line 270) (pc 114) (thread 2)))
(JNukeLockAccess (JNukeLockInfo "EDU/oswego/cs/dl/util/concurrent/CyclicBarrier") (vmState "EDU/oswego/cs/dl/util/concurrent/CyclicBarrier.barrier ()I" (line 178) (pc 4) (thread 2)))
(JNukeMethodEvent EDU/oswego/cs/dl/util/concurrent/CyclicBarrier.barrier (methodend) (vmState "EDU/oswego/cs/dl/util/concurrent/CyclicBarrier.barrier ()I" (line 178) (pc 4) (thread 2)))
(JNukeMethodEvent sor_first_row_odd.run (methodend) (vmState "sor_first_row_odd.run ()V" (line 181) (pc 245) (thread 2)))
(JNukeRByteCode 190 "     InvokeVirtual" (JNukeMethod "java/lang/Thread.join" (JNukeSignature "V" (JNukeVector))) r13 (line 95))
(JNukeRByteCode 201 "<r13, r14> = InvokeVirtual" (JNukeMethod "java/util/Date.getTime" (JNukeSignature "J" (JNukeVector))) r13 (line 100))
(JNukeLockAccess (JNukeLockInfo "java/lang/StringBuffer") (vmState "java/lang/StringBuffer.append (Ljava/lang/String;)Ljava/lang/StringBuffer;" (pc 208) (thread 0)))
(JNukeRByteCode 208 "r14 = InvokeVirtual" (JNukeMethod "java/lang/StringBuffer.append" (JNukeSignature "Ljava/lang/StringBuffer;" (JNukeVector "Ljava/lang/String;"))) r14 r15 (line 102))
(JNukeLockAccess (JNukeLockInfo "java/lang/StringBuffer") (vmState "Sor.main ([Ljava/lang/String;)V" (line 102) (pc 209) (thread 0)))
(JNukeRByteCode 210 "r14 = InvokeVirtual" (JNukeMethod "java/lang/StringBuffer.append" (JNukeSignature "Ljava/lang/StringBuffer;" (JNukeVector "I"))) r14 r15 (line 102))
(JNukeRByteCode 211 "r14 = InvokeVirtual" (JNukeMethod "java/lang/StringBuffer.toString" (JNukeSignature "Ljava/lang/String;" (JNukeVector))) r14 (line 102))
(JNukeLockAccess (JNukeLockInfo "java/io/PrintStream") (vmState "java/io/PrintStream.println (Ljava/lang/String;)V" (line 53) (pc 212) (thread 0)))
(JNukeRByteCode 212 "     InvokeVirtual" (JNukeMethod "java/io/PrintStream.println" (JNukeSignature "V" (JNukeVector "Ljava/lang/String;"))) r13 r14 (line 102))
Sor-2
(JNukeLockAccess (JNukeLockInfo "java/io/PrintStream") (vmState "Sor.main ([Ljava/lang/String;)V" (line 102) (pc 213) (thread 0)))
(JNukeLockAccess (JNukeLockInfo "java/lang/StringBuffer") (vmState "java/lang/StringBuffer.append (Ljava/lang/String;)Ljava/lang/StringBuffer;" (pc 252) (thread 0)))
(JNukeRByteCode 252 "r14 = InvokeVirtual" (JNukeMethod "java/lang/StringBuffer.append" (JNukeSignature "Ljava/lang/StringBuffer;" (JNukeVector "Ljava/lang/String;"))) r14 r15 (line 111))
(JNukeLockAccess (JNukeLockInfo "java/lang/StringBuffer") (vmState "Sor.main ([Ljava/lang/String;)V" (line 111) (pc 253) (thread 0)))
(JNukeRByteCode 254 "r14 = InvokeVirtual" (JNukeMethod "java/lang/StringBuffer.append" (JNukeSignature "Ljava/lang/StringBuffer;" (JNukeVector "F"))) r14 r15 (line 111))
(JNukeLockAccess (JNukeLockInfo "java/lang/StringBuffer") (vmState "java/lang/StringBuffer.append (Ljava/lang/String;)Ljava/lang/StringBuffer;" (pc 256) (thread 0)))
(JNukeRByteCode 256 "r14 = InvokeVirtual" (JNukeMethod "java/lang/StringBuffer.append" (JNukeSignature "Ljava/lang/StringBuffer;" (JNukeVector "Ljava/lang/String;"))) r14 r15 (line 111))
(JNukeLockAccess (JNukeLockInfo "java/lang/StringBuffer") (vmState "Sor.main ([Ljava/lang/String;)V" (line 111) (pc 257) (thread 0)))
(JNukeRByteCode 258 "r14 = InvokeVirtual" (JNukeMethod "java/lang/StringBuffer.append" (JNukeSignature "Ljava/lang/StringBuffer;" (JNukeVector "F"))) r14 r15 (line 111))
(JNukeRByteCode 259 "r14 = InvokeVirtual" (JNukeMethod "java/lang/StringBuffer.toString" (JNukeSignature "Ljava/lang/String;" (JNukeVector))) r14 (line 111))
(JNukeLockAccess (JNukeLockInfo "java/io/PrintStream") (vmState "java/io/PrintStream.println (Ljava/lang/String;)V" (line 53) (pc 260) (thread 0)))
(JNukeRByteCode 260 "     InvokeVirtual" (JNukeMethod "java/io/PrintStream.println" (JNukeSignature "V" (JNukeVector "Ljava/lang/String;"))) r13 r14 (line 111))
Exiting. red_sum = 104.90625, black_sum = 97.0625
(JNukeLockAccess (JNukeLockInfo "java/io/PrintStream") (vmState "Sor.main ([Ljava/lang/String;)V" (line 111) (pc 261) (thread 0)))
(JNukeMethodEvent Sor.main (methodend) (vmState "Sor.main ([Ljava/lang/String;)V" (line 112) (pc 261) (thread 0)))
