#FIG 3.2
Landscape
Center
Metric
A4      
100.00
Single
-2
1200 2
6 900 1845 3870 2475
2 2 0 2 0 7 100 0 -1 0.000 0 0 -1 0 0 5
	 945 1890 3825 1890 3825 2430 945 2430 945 1890
4 1 0 50 0 18 20 0.0000 4 270 2520 2385 2250 AnalysisAlgorithm\001
-6
6 5805 4410 7245 5040
2 2 0 2 0 7 100 0 -1 0.000 0 0 -1 0 0 5
	 5850 4455 7200 4455 7200 4995 5850 4995 5850 4455
4 1 0 50 0 18 20 0.0000 4 210 960 6525 4815 RV API\001
-6
6 5310 3150 7785 3780
2 2 0 2 0 7 100 0 -1 0.000 0 0 -1 0 0 5
	 5355 3195 7740 3195 7740 3735 5355 3735 5355 3195
4 1 0 50 0 18 20 0.0000 4 270 1920 6570 3555 ThreadSplitter\001
-6
6 5715 2070 7290 2655
6 5715 2070 6840 2385
4 0 0 50 0 16 20 0.0000 4 270 1125 5715 2295 Dynamic\001
-6
4 0 0 50 0 16 20 0.0000 4 210 1545 5715 2625 environment\001
-6
2 1 0 2 0 7 100 0 -1 0.000 0 0 -1 1 0 2
	3 1 2.00 120.00 240.00
	 2385 3195 2385 2430
2 2 0 2 0 7 100 0 -1 0.000 0 0 -1 0 0 5
	 990 3195 3780 3195 3780 3735 990 3735 990 3195
2 1 0 2 0 7 100 0 -1 0.000 0 0 -1 1 0 2
	3 1 2.00 120.00 240.00
	 5355 3465 3780 3465
2 1 0 2 0 7 100 0 -1 0.000 0 0 -1 0 0 2
	 6525 3735 6525 4455
2 3 2 2 0 7 50 0 -1 3.000 0 0 -1 0 0 5
	 720 2925 8010 2925 8010 5220 720 5220 720 2925
4 1 0 50 0 18 20 0.0000 4 270 2385 2385 3555 DynamicAnalysis\001
