%!PS-Adobe-3.0 EPSF-3.0 
%%BoundingBox: 0 0 805 558
%%Pages: 0
%%Creator: Sun Microsystems, Inc.
%%Title: none
%%CreationDate: none
%%LanguageLevel: 2
%%EndComments
%%BeginProlog
%%BeginResource: SDRes
/b4_inc_state save def
/dict_count countdictstack def
/op_count count 1 sub def
userdict begin
0 setgray 0 setlinecap 1 setlinewidth 0 setlinejoin 10 setmiterlimit[] 0 setdash newpath
/languagelevel where {pop languagelevel 1 ne {false setstrokeadjust false setoverprint} if} if
/bdef {bind def} bind def
/c {setrgbcolor} bdef
/l {neg lineto} bdef
/rl {neg rlineto} bdef
/cl {currentlinewidth currentdash currentlinecap 2 setlinecap} bdef
/lc {setlinecap} bdef
/lw {setlinewidth} bdef
/ld {setdash} bdef
/m {neg moveto} bdef
/ct {6 2 roll neg 6 2 roll neg 6 2 roll neg curveto} bdef
/r {rotate} bdef
/t {neg translate} bdef
/s {scale} bdef
/sw {show} bdef
/gs {gsave} bdef
/gr {grestore} bdef
/f {findfont dup length dict begin
{1 index /FID ne {def} {pop pop} ifelse} forall /Encoding ISOLatin1Encoding def
currentdict end /NFont exch definefont pop /NFont findfont} bdef
/p {closepath} bdef
/sf {scalefont setfont} bdef
/ef {eofill}bdef
/pc {closepath stroke}bdef
/ps {stroke}bdef
/pum {matrix currentmatrix}bdef
/pom {setmatrix}bdef
/bs {/aString exch def /nXOfs exch def /nWidth exch def currentpoint nXOfs 0 rmoveto pum nWidth aString stringwidth pop div 1 scale aString show pom moveto} bdef
%%EndResource
%%EndProlog
%%BeginSetup
%%EndSetup
%%Page: 1 1
%%BeginPageSetup
%%EndPageSetup
pum
0.28345 0.28339 s 
0 -1969 t 
gs
-63.5 -63.5 t 
63.5 63.5 m 2903.4 63.5 l 2903.4 2032.4 l 63.5 2032.4 l 63.5 63.5 l
eoclip newpath
gs
63.5 63.5 m 2903.4 63.5 l 2903.4 2032.4 l 63.5 2032.4 l 63.5 63.5 l
eoclip newpath
gs
63.5 0 t 
0 63.5 m 2839.9 63.5 l 2839.9 2032.4 l 0 2032.4 l 0 63.5 l
eoclip newpath
gs
gr
0.003 0.003 0.003 c 244.4 1919.4 m  2932 1919.4 l  ps
244.4 1576.4 m  2932 1576.4 l  ps
244.4 1233.4 m  2932 1233.4 l  ps
244.4 890.4 m  2932 890.4 l  ps
244.4 547.39999 m  2932 547.39999 l  ps
244.4 204.3 m  2932 204.3 l  ps
244.4 1919.4 m  2932 1919.4 l  ps
244.4 1919.4 m  2932 1919.4 l  ps
244.4 1934.4 m  244.4 1919.4 l  ps
gs
pum
635 1944.6 t 
5.3 67 m  5.3 14 l  25.1 14 l  29.3 14 32.5 14.5 34.89999 15.5 ct 
37.39999 16.69999 39.3 18.3 40.7 20.5 ct 42 22.7 42.7 25.1 42.7 27.5 ct 
42.7 29.7 42.1 31.9 40.9 33.8 ct 39.6 35.89999 37.8 37.5 35.3 38.7 ct 
38.6 39.6 40.9 41.2 42.7 43.6 ct 44.5 45.8 45.2 48.5 45.2 51.6 ct 
45.2 54.1 44.8 56.3 43.8 58.6 ct 42.7 60.6 41.4 62.3 39.9 63.4 ct 
38.3 64.6 36.39999 65.5 34 66.1 ct 31.8 66.7 28.8 67 25.6 67 ct 
p
12.2 36.2 m  23.8 36.2 l  26.9 36.2 29.1 36.1 30.4 35.6 ct 
32.2 35 33.5 34.1 34.39999 33 ct 35.3 31.8 35.8 30.1 35.8 28.4 ct 
35.8 26.6 35.5 25 34.6 23.6 ct 33.7 22.3 32.5 21.4 30.9 21 ct 
29.4 20.5 26.7 20.2 22.9 20.2 ct 12.2 20.2 l 
p
12.2 60.6 m  25.6 60.6 l  27.8 60.6 29.4 60.6 30.3 60.5 ct 
31.9 60.2 33.3 59.6 34.3 59 ct 35.5 58.3 36.39999 57.4 37 56 ct 
37.7 54.7 38 53.2 38 51.6 ct 38 49.5 37.5 47.9 36.5 46.4 ct 
35.5 44.9 34.1 43.9 32.39999 43.3 ct 30.4 42.7 27.9 42.4 24.5 42.4 ct 
12.2 42.4 l  p ef
pom
pum
684.1 1944.6 t 
29.8 67 m  29.8 61.2 l  26.9 65.7 22.9 67.7 17.69999 67.7 ct 
15.5 67.7 13.4 67.29999 11.3 66.6 ct 9.4 65.7 7.9 64.5 7.1 63.1 ct 
6 62 5.4 60.3 5 58.4 ct 4.7 57.1 4.5 55.2 4.5 52.3 ct 
4.5 28.5 l  11.1 28.5 l  11.1 49.8 l  11.1 53.2 11.2 55.5 11.5 56.6 ct 
11.9 58.4 12.8 59.7 14.2 60.8 ct 15.5 61.7 17.1 62.3 19 62.3 ct 
21 62.3 22.7 61.7 24.5 60.6 ct 26.3 59.7 27.5 58.3 28.2 56.6 ct 
28.8 54.9 29.3 52.3 29.3 49.1 ct 29.3 28.5 l 
35.8 28.5 l  35.8 67 l  p ef
pom
pum
724.7 1944.6 t 
10.8 67 m  4.7 67 l  4.7 14 l  11.2 14 l  11.2 32.8 l 
14 29.4 17.4 27.6 21.7 27.6 ct 24.1 27.6 26.3 28.2 28.4 29.1 ct 
30.6 30 32.2 31.3 33.7 33.1 ct 35 34.89999 36.1 37 36.8 39.3 ct 
37.5 41.8 38 44.4 38 47.2 ct 38 53.7 36.39999 58.9 33.1 62.4 ct 
29.8 66 26 67.7 21.4 67.7 ct 16.8 67.7 13.3 66 10.8 62.1 ct 
p
10.8 47.5 m  10.8 52 11.3 55.3 12.5 57.4 ct 
14.6 60.8 17.4 62.4 20.8 62.4 ct 23.8 62.4 26.1 61.2 28.2 58.7 ct 
30.3 56.3 31.3 52.6 31.3 47.8 ct 31.3 42.7 30.3 39 28.4 36.7 ct 
26.4 34.3 23.9 33.1 21.1 33.1 ct 18.3 33.1 15.8 34.3 13.7 36.8 ct 
11.8 39.2 l  10.8 42.7 l  p ef
pom
pum
765.4 1944.6 t 
10.8 67 m  4.7 67 l  4.7 14 l  11.2 14 l  11.2 32.8 l 
14 29.4 17.4 27.6 21.7 27.6 ct 24.1 27.6 26.3 28.2 28.4 29.1 ct 
30.6 30 32.2 31.3 33.7 33.1 ct 35 34.89999 36.1 37 36.8 39.3 ct 
37.5 41.8 38 44.4 38 47.2 ct 38 53.7 36.39999 58.9 33.1 62.4 ct 
29.8 66 26 67.7 21.4 67.7 ct 16.8 67.7 13.3 66 10.8 62.1 ct 
p
10.8 47.5 m  10.8 52 11.3 55.3 12.5 57.4 ct 
14.6 60.8 17.4 62.4 20.8 62.4 ct 23.8 62.4 26.1 61.2 28.2 58.7 ct 
30.3 56.3 31.3 52.6 31.3 47.8 ct 31.3 42.7 30.3 39 28.4 36.7 ct 
26.4 34.3 23.9 33.1 21.1 33.1 ct 18.3 33.1 15.8 34.3 13.7 36.8 ct 
11.8 39.2 l  10.8 42.7 l  p ef
pom
pum
806.9 1944.6 t 
4.5 67 m  4.5 14 l  11.1 14 l  11.1 67 l  p ef
pom
pum
823 1944.6 t 
31 54.6 m  37.7 55.5 l  36.7 59.3 34.7 62.4 31.9 64.5 ct 
29 66.7 25.3 67.7 20.8 67.7 ct 15.2 67.7 10.8 66.1 7.5 62.6 ct 
4.2 59.2 2.6 54.3 2.6 48.1 ct 2.6 41.5 4.2 36.7 7.6 33.1 ct 
10.9 29.4 15.2 27.6 20.5 27.6 ct 25.7 27.6 29.8 29.4 33.1 33 ct 
36.39999 36.39999 38 41.4 38 47.6 ct 38 48.1 38 48.6 38 49.4 ct 
9.3 49.4 l  9.6 53.7 10.8 56.8 12.8 59.2 ct 
15 61.4 17.69999 62.4 21 62.4 ct 23.3 62.4 25.3 61.8 27 60.6 ct 
28.7 59.3 l  30 57.4 l  p
9.7 44.1 m  31 44.1 l  30.7 40.8 30 38.4 28.7 36.8 ct 
26.6 34.3 23.9 33.1 20.5 33.1 ct 17.6 33.1 15 34 13 36.1 ct 
11.1 38 l  9.9 40.7 l  p ef
pom
pum
863.6 1944.6 t 
3.2 50 m  9.9 49.4 l  10.2 52 10.9 54.1 11.9 55.9 ct 
13.1 57.5 14.9 58.9 17.3 60 ct 19.8 61.1 22.4 61.5 25.4 61.5 ct 
28.1 61.5 30.4 61.1 32.5 60.3 ct 34.6 59.6 36.1 58.4 37.1 57.1 ct 
38.1 55.7 38.6 54.1 38.6 52.5 ct 38.6 50.9 38.1 49.4 37.1 48.2 ct 
36.2 47 34.6 46 32.39999 45.1 ct 31 44.5 27.8 43.6 23 42.4 ct 
18.19999 41.2 14.8 40.2 12.7 39.2 ct 10.2 37.8 8.4 36.2 7.1 34.3 ct 
5.9 32.2 5.3 30.1 5.3 27.6 ct 5.3 25 6 22.4 7.5 20.1 ct 
9 17.9 11.2 16.1 14.2 14.9 ct 17.1 13.7 20.4 13 23.9 13 ct 
27.8 13 31.3 13.7 34.3 14.9 ct 37.2 16.19999 39.6 18 41.2 20.5 ct 
42.7 23 43.6 25.7 43.8 28.8 ct 37.1 29.4 l 
36.7 26 35.5 23.5 33.39999 21.9 ct 31.3 20.1 28.2 19.2 24.2 19.2 ct 
19.9 19.2 16.8 19.9 14.9 21.6 ct 13 23 11.9 25 11.9 27.2 ct 
11.9 29.1 12.7 30.6 14 31.9 ct 15.3 33.1 18.9 34.39999 24.7 35.6 ct 
30.3 37 34.3 38.1 36.39999 39 ct 39.5 40.5 41.7 42.3 43.2 44.5 ct 
44.6 46.6 45.4 49.1 45.4 51.9 ct 45.4 54.7 44.5 57.4 43 59.9 ct 
41.4 62.4 39 64.29999 36.1 65.79999 ct 33 67.1 29.6 67.9 25.9 67.9 ct 
21 67.9 17 67.1 13.7 65.7 ct 10.5 64.29999 7.9 62.3 6.2 59.4 ct 
4.2 56.6 l  3.4 53.4 l  p ef
pom
pum
912.7 1944.6 t 
2.3 47.8 m  2.3 40.7 4.2 35.3 8.2 31.9 ct 
11.5 29.1 15.6 27.6 20.4 27.6 ct 25.6 27.6 29.8 29.4 33.3 32.8 ct 
36.7 36.39999 38.3 41.1 38.3 47.2 ct 38.3 52.2 37.5 56 36.1 58.9 ct 
34.6 61.7 32.39999 63.9 29.6 65.5 ct 26.7 67 23.6 67.7 20.4 67.7 ct 
14.9 67.7 10.6 66.1 7.4 62.6 ct 3.9 59.2 l 
2.3 54.3 l  p
9 47.8 m  9 52.6 10.2 56.3 12.2 58.7 ct 14.3 61.2 17.1 62.4 20.4 62.4 ct 
23.6 62.4 26.3 61.2 28.4 58.7 ct 30.6 56.3 31.6 52.5 31.6 47.5 ct 
31.6 42.7 30.6 39.2 28.4 36.8 ct 26.1 34.3 23.5 33.1 20.4 33.1 ct 
17.1 33.1 14.3 34.3 12.2 36.7 ct 10.2 39.2 l 
9 42.9 l  p ef
pom
pum
954.2 1944.6 t 
4.7 67 m  4.7 28.5 l  10.6 28.5 l  10.6 34.39999 l 
12.1 31.6 13.4 29.8 14.6 29 ct 15.9 28.1 17.3 27.6 18.9 27.6 ct 
21 27.6 23.3 28.4 25.6 29.8 ct 23.3 35.8 l 
21.7 34.89999 20.1 34.39999 18.5 34.39999 ct 17.1 34.39999 15.8 34.89999 14.8 35.6 ct 
13.6 36.5 12.8 37.7 12.2 39.2 ct 11.5 41.5 11.2 44.1 11.2 46.9 ct 
11.2 67 l  p ef
pom
pum
978.7 1944.6 t 
18.9 61.1 m  19.9 66.79999 l  18 67.29999 16.4 67.4 15 67.4 ct 
12.7 67.4 10.8 67 9.4 66.29999 ct 8.2 65.5 7.2 64.6 6.8 63.3 ct 
6.2 62.1 6 59.6 6 55.7 ct 6 33.5 l  1.1 33.5 l 
1.1 28.5 l  6 28.5 l  6 19 l  12.4 15.2 l  12.4 28.5 l 
18.9 28.5 l  18.9 33.5 l  12.4 33.5 l  12.4 56 l 
12.4 58 12.5 59.2 12.8 59.6 ct 13 60.2 13.4 60.6 13.9 60.9 ct 
14.5 61.2 15.2 61.4 16.1 61.4 ct 16.8 61.4 l 
17.69999 61.2 l  p ef
pom
pum
999.1 1944.6 t 
pom
pum
1019.4 1944.6 t 
27.5 67 m  21 67 l  21 25.4 l  19.3 27 17.3 28.5 14.8 30 ct 
12.2 31.5 10 32.5 7.9 33.3 ct 7.9 27 l  11.6 25.3 14.8 23.2 17.4 20.8 ct 
20.2 18.5 22.2 16.1 23.2 13.7 ct 27.5 13.7 l 
p ef
pom
pum
1060 1944.6 t 
4.8 32.7 m  3.1 22.7 l  3.1 14 l  10.6 14 l 
10.6 22.7 l  8.8 32.7 l  p ef
pom
pum
1074.4 1944.6 t 
2.9 40.8 m  2.9 34.6 3.7 29.6 4.8 25.7 ct 
6.2 21.9 8.09999 18.9 10.6 16.8 ct 13.1 14.8 16.4 13.7 20.2 13.7 ct 
23 13.7 25.6 14.3 27.6 15.5 ct 29.8 16.5 31.6 18.3 33 20.4 ct 
34.39999 22.6 35.5 25.1 36.39999 28.2 ct 37.1 31.3 37.5 35.6 37.5 40.8 ct 
37.5 47 36.8 52 35.6 55.9 ct 34.3 59.6 32.39999 62.6 29.8 64.6 ct 
27.3 66.79999 24.1 67.9 20.2 67.9 ct 15 67.9 11.1 66 8.2 62.4 ct 
4.7 58 l  2.9 50.7 l  p
9.6 40.8 m  9.6 49.5 10.6 55.3 12.7 58.1 ct 
14.8 61.1 17.3 62.4 20.2 62.4 ct 23.2 62.4 25.7 61.1 27.8 58.1 ct 
29.8 55.3 30.7 49.5 30.7 40.8 ct 30.7 32.1 29.8 26.3 27.8 23.5 ct 
25.7 20.5 23.2 19.2 20.1 19.2 ct 17.1 19.2 14.8 20.4 13 22.9 ct 
10.8 26.1 l  9.6 32.1 l  p ef
pom
pum
1115.1 1944.6 t 
2.9 40.8 m  2.9 34.6 3.7 29.6 4.8 25.7 ct 
6.2 21.9 8.09999 18.9 10.6 16.8 ct 13.1 14.8 16.4 13.7 20.2 13.7 ct 
23 13.7 25.6 14.3 27.6 15.5 ct 29.8 16.5 31.6 18.3 33 20.4 ct 
34.39999 22.6 35.5 25.1 36.39999 28.2 ct 37.1 31.3 37.5 35.6 37.5 40.8 ct 
37.5 47 36.8 52 35.6 55.9 ct 34.3 59.6 32.39999 62.6 29.8 64.6 ct 
27.3 66.79999 24.1 67.9 20.2 67.9 ct 15 67.9 11.1 66 8.2 62.4 ct 
4.7 58 l  2.9 50.7 l  p
9.6 40.8 m  9.6 49.5 10.6 55.3 12.7 58.1 ct 
14.8 61.1 17.3 62.4 20.2 62.4 ct 23.2 62.4 25.7 61.1 27.8 58.1 ct 
29.8 55.3 30.7 49.5 30.7 40.8 ct 30.7 32.1 29.8 26.3 27.8 23.5 ct 
25.7 20.5 23.2 19.2 20.1 19.2 ct 17.1 19.2 14.8 20.4 13 22.9 ct 
10.8 26.1 l  9.6 32.1 l  p ef
pom
pum
1156.5 1944.6 t 
2.9 40.8 m  2.9 34.6 3.7 29.6 4.8 25.7 ct 
6.2 21.9 8.09999 18.9 10.6 16.8 ct 13.1 14.8 16.4 13.7 20.2 13.7 ct 
23 13.7 25.6 14.3 27.6 15.5 ct 29.8 16.5 31.6 18.3 33 20.4 ct 
34.39999 22.6 35.5 25.1 36.39999 28.2 ct 37.1 31.3 37.5 35.6 37.5 40.8 ct 
37.5 47 36.8 52 35.6 55.9 ct 34.3 59.6 32.39999 62.6 29.8 64.6 ct 
27.3 66.79999 24.1 67.9 20.2 67.9 ct 15 67.9 11.1 66 8.2 62.4 ct 
4.7 58 l  2.9 50.7 l  p
9.6 40.8 m  9.6 49.5 10.6 55.3 12.7 58.1 ct 
14.8 61.1 17.3 62.4 20.2 62.4 ct 23.2 62.4 25.7 61.1 27.8 58.1 ct 
29.8 55.3 30.7 49.5 30.7 40.8 ct 30.7 32.1 29.8 26.3 27.8 23.5 ct 
25.7 20.5 23.2 19.2 20.1 19.2 ct 17.1 19.2 14.8 20.4 13 22.9 ct 
10.8 26.1 l  9.6 32.1 l  p ef
pom
gr
1588.2 1934.4 m  1588.2 1919.4 l  ps
gs
pum
1957.9 1944.6 t 
5.3 67 m  5.3 14 l  25.1 14 l  29.3 14 32.5 14.5 34.89999 15.5 ct 
37.39999 16.69999 39.3 18.3 40.7 20.5 ct 42 22.7 42.7 25.1 42.7 27.5 ct 
42.7 29.7 42.1 31.9 40.9 33.8 ct 39.6 35.89999 37.8 37.5 35.3 38.7 ct 
38.6 39.6 40.9 41.2 42.7 43.6 ct 44.5 45.8 45.2 48.5 45.2 51.6 ct 
45.2 54.1 44.8 56.3 43.8 58.6 ct 42.7 60.6 41.4 62.3 39.9 63.4 ct 
38.3 64.6 36.39999 65.5 34 66.1 ct 31.8 66.7 28.8 67 25.6 67 ct 
p
12.2 36.2 m  23.8 36.2 l  26.9 36.2 29.1 36.1 30.4 35.6 ct 
32.2 35 33.5 34.1 34.39999 33 ct 35.3 31.8 35.8 30.1 35.8 28.4 ct 
35.8 26.6 35.5 25 34.6 23.6 ct 33.7 22.3 32.5 21.4 30.9 21 ct 
29.4 20.5 26.7 20.2 22.9 20.2 ct 12.2 20.2 l 
p
12.2 60.6 m  25.6 60.6 l  27.8 60.6 29.4 60.6 30.3 60.5 ct 
31.9 60.2 33.3 59.6 34.3 59 ct 35.5 58.3 36.39999 57.4 37 56 ct 
37.7 54.7 38 53.2 38 51.6 ct 38 49.5 37.5 47.9 36.5 46.4 ct 
35.5 44.9 34.1 43.9 32.39999 43.3 ct 30.4 42.7 27.9 42.4 24.5 42.4 ct 
12.2 42.4 l  p ef
pom
pum
2007 1944.6 t 
29.8 67 m  29.8 61.2 l  26.9 65.7 22.9 67.7 17.69999 67.7 ct 
15.5 67.7 13.4 67.29999 11.3 66.6 ct 9.4 65.7 7.9 64.5 7.1 63.1 ct 
6 62 5.4 60.3 5 58.4 ct 4.7 57.1 4.5 55.2 4.5 52.3 ct 
4.5 28.5 l  11.1 28.5 l  11.1 49.8 l  11.1 53.2 11.2 55.5 11.5 56.6 ct 
11.9 58.4 12.8 59.7 14.2 60.8 ct 15.5 61.7 17.1 62.3 19 62.3 ct 
21 62.3 22.7 61.7 24.5 60.6 ct 26.3 59.7 27.5 58.3 28.2 56.6 ct 
28.8 54.9 29.3 52.3 29.3 49.1 ct 29.3 28.5 l 
35.8 28.5 l  35.8 67 l  p ef
pom
pum
2047.6 1944.6 t 
10.8 67 m  4.7 67 l  4.7 14 l  11.2 14 l  11.2 32.8 l 
14 29.4 17.4 27.6 21.7 27.6 ct 24.1 27.6 26.3 28.2 28.4 29.1 ct 
30.6 30 32.2 31.3 33.7 33.1 ct 35 34.89999 36.1 37 36.8 39.3 ct 
37.5 41.8 38 44.4 38 47.2 ct 38 53.7 36.39999 58.9 33.1 62.4 ct 
29.8 66 26 67.7 21.4 67.7 ct 16.8 67.7 13.3 66 10.8 62.1 ct 
p
10.8 47.5 m  10.8 52 11.3 55.3 12.5 57.4 ct 
14.6 60.8 17.4 62.4 20.8 62.4 ct 23.8 62.4 26.1 61.2 28.2 58.7 ct 
30.3 56.3 31.3 52.6 31.3 47.8 ct 31.3 42.7 30.3 39 28.4 36.7 ct 
26.4 34.3 23.9 33.1 21.1 33.1 ct 18.3 33.1 15.8 34.3 13.7 36.8 ct 
11.8 39.2 l  10.8 42.7 l  p ef
pom
pum
2088.3 1944.6 t 
10.8 67 m  4.7 67 l  4.7 14 l  11.2 14 l  11.2 32.8 l 
14 29.4 17.4 27.6 21.7 27.6 ct 24.1 27.6 26.3 28.2 28.4 29.1 ct 
30.6 30 32.2 31.3 33.7 33.1 ct 35 34.89999 36.1 37 36.8 39.3 ct 
37.5 41.8 38 44.4 38 47.2 ct 38 53.7 36.39999 58.9 33.1 62.4 ct 
29.8 66 26 67.7 21.4 67.7 ct 16.8 67.7 13.3 66 10.8 62.1 ct 
p
10.8 47.5 m  10.8 52 11.3 55.3 12.5 57.4 ct 
14.6 60.8 17.4 62.4 20.8 62.4 ct 23.8 62.4 26.1 61.2 28.2 58.7 ct 
30.3 56.3 31.3 52.6 31.3 47.8 ct 31.3 42.7 30.3 39 28.4 36.7 ct 
26.4 34.3 23.9 33.1 21.1 33.1 ct 18.3 33.1 15.8 34.3 13.7 36.8 ct 
11.8 39.2 l  10.8 42.7 l  p ef
pom
pum
2129.8 1944.6 t 
4.5 67 m  4.5 14 l  11.1 14 l  11.1 67 l  p ef
pom
pum
2145.9 1944.6 t 
31 54.6 m  37.7 55.5 l  36.7 59.3 34.7 62.4 31.9 64.5 ct 
29 66.7 25.3 67.7 20.8 67.7 ct 15.2 67.7 10.8 66.1 7.5 62.6 ct 
4.2 59.2 2.6 54.3 2.6 48.1 ct 2.6 41.5 4.2 36.7 7.6 33.1 ct 
10.9 29.4 15.2 27.6 20.5 27.6 ct 25.7 27.6 29.8 29.4 33.1 33 ct 
36.39999 36.39999 38 41.4 38 47.6 ct 38 48.1 38 48.6 38 49.4 ct 
9.3 49.4 l  9.6 53.7 10.8 56.8 12.8 59.2 ct 
15 61.4 17.69999 62.4 21 62.4 ct 23.3 62.4 25.3 61.8 27 60.6 ct 
28.7 59.3 l  30 57.4 l  p
9.7 44.1 m  31 44.1 l  30.7 40.8 30 38.4 28.7 36.8 ct 
26.6 34.3 23.9 33.1 20.5 33.1 ct 17.6 33.1 15 34 13 36.1 ct 
11.1 38 l  9.9 40.7 l  p ef
pom
pum
2186.5 1944.6 t 
3.2 50 m  9.9 49.4 l  10.2 52 10.9 54.1 11.9 55.9 ct 
13.1 57.5 14.9 58.9 17.3 60 ct 19.8 61.1 22.4 61.5 25.4 61.5 ct 
28.1 61.5 30.4 61.1 32.5 60.3 ct 34.6 59.6 36.1 58.4 37.1 57.1 ct 
38.1 55.7 38.6 54.1 38.6 52.5 ct 38.6 50.9 38.1 49.4 37.1 48.2 ct 
36.2 47 34.6 46 32.39999 45.1 ct 31 44.5 27.8 43.6 23 42.4 ct 
18.19999 41.2 14.8 40.2 12.7 39.2 ct 10.2 37.8 8.4 36.2 7.1 34.3 ct 
5.9 32.2 5.3 30.1 5.3 27.6 ct 5.3 25 6 22.4 7.5 20.1 ct 
9 17.9 11.2 16.1 14.2 14.9 ct 17.1 13.7 20.4 13 23.9 13 ct 
27.8 13 31.3 13.7 34.3 14.9 ct 37.2 16.19999 39.6 18 41.2 20.5 ct 
42.7 23 43.6 25.7 43.8 28.8 ct 37.1 29.4 l 
36.7 26 35.5 23.5 33.39999 21.9 ct 31.3 20.1 28.2 19.2 24.2 19.2 ct 
19.9 19.2 16.8 19.9 14.9 21.6 ct 13 23 11.9 25 11.9 27.2 ct 
11.9 29.1 12.7 30.6 14 31.9 ct 15.3 33.1 18.9 34.39999 24.7 35.6 ct 
30.3 37 34.3 38.1 36.39999 39 ct 39.5 40.5 41.7 42.3 43.2 44.5 ct 
44.6 46.6 45.4 49.1 45.4 51.9 ct 45.4 54.7 44.5 57.4 43 59.9 ct 
41.4 62.4 39 64.29999 36.1 65.79999 ct 33 67.1 29.6 67.9 25.9 67.9 ct 
21 67.9 17 67.1 13.7 65.7 ct 10.5 64.29999 7.9 62.3 6.2 59.4 ct 
4.2 56.6 l  3.4 53.4 l  p ef
pom
pum
2235.59999 1944.6 t 
2.3 47.8 m  2.3 40.7 4.2 35.3 8.2 31.9 ct 
11.5 29.1 15.6 27.6 20.4 27.6 ct 25.6 27.6 29.8 29.4 33.3 32.8 ct 
36.7 36.39999 38.3 41.1 38.3 47.2 ct 38.3 52.2 37.5 56 36.1 58.9 ct 
34.6 61.7 32.39999 63.9 29.6 65.5 ct 26.7 67 23.6 67.7 20.4 67.7 ct 
14.9 67.7 10.6 66.1 7.4 62.6 ct 3.9 59.2 l 
2.3 54.3 l  p
9 47.8 m  9 52.6 10.2 56.3 12.2 58.7 ct 14.3 61.2 17.1 62.4 20.4 62.4 ct 
23.6 62.4 26.3 61.2 28.4 58.7 ct 30.6 56.3 31.6 52.5 31.6 47.5 ct 
31.6 42.7 30.6 39.2 28.4 36.8 ct 26.1 34.3 23.5 33.1 20.4 33.1 ct 
17.1 33.1 14.3 34.3 12.2 36.7 ct 10.2 39.2 l 
9 42.9 l  p ef
pom
pum
2277.09999 1944.6 t 
4.7 67 m  4.7 28.5 l  10.6 28.5 l  10.6 34.39999 l 
12.1 31.6 13.4 29.8 14.6 29 ct 15.9 28.1 17.3 27.6 18.9 27.6 ct 
21 27.6 23.3 28.4 25.6 29.8 ct 23.3 35.8 l 
21.7 34.89999 20.1 34.39999 18.5 34.39999 ct 17.1 34.39999 15.8 34.89999 14.8 35.6 ct 
13.6 36.5 12.8 37.7 12.2 39.2 ct 11.5 41.5 11.2 44.1 11.2 46.9 ct 
11.2 67 l  p ef
pom
pum
2301.59999 1944.6 t 
18.9 61.1 m  19.9 66.79999 l  18 67.29999 16.4 67.4 15 67.4 ct 
12.7 67.4 10.8 67 9.4 66.29999 ct 8.2 65.5 7.2 64.6 6.8 63.3 ct 
6.2 62.1 6 59.6 6 55.7 ct 6 33.5 l  1.1 33.5 l 
1.1 28.5 l  6 28.5 l  6 19 l  12.4 15.2 l  12.4 28.5 l 
18.9 28.5 l  18.9 33.5 l  12.4 33.5 l  12.4 56 l 
12.4 58 12.5 59.2 12.8 59.6 ct 13 60.2 13.4 60.6 13.9 60.9 ct 
14.5 61.2 15.2 61.4 16.1 61.4 ct 16.8 61.4 l 
17.69999 61.2 l  p ef
pom
pum
2322 1944.6 t 
pom
pum
2342.3 1944.6 t 
27.5 67 m  21 67 l  21 25.4 l  19.3 27 17.3 28.5 14.8 30 ct 
12.2 31.5 10 32.5 7.9 33.3 ct 7.9 27 l  11.6 25.3 14.8 23.2 17.4 20.8 ct 
20.2 18.5 22.2 16.1 23.2 13.7 ct 27.5 13.7 l 
p ef
pom
pum
2382.9 1944.6 t 
2.9 40.8 m  2.9 34.6 3.7 29.6 4.8 25.7 ct 
6.2 21.9 8.09999 18.9 10.6 16.8 ct 13.1 14.8 16.4 13.7 20.2 13.7 ct 
23 13.7 25.6 14.3 27.6 15.5 ct 29.8 16.5 31.6 18.3 33 20.4 ct 
34.39999 22.6 35.5 25.1 36.39999 28.2 ct 37.1 31.3 37.5 35.6 37.5 40.8 ct 
37.5 47 36.8 52 35.6 55.9 ct 34.3 59.6 32.39999 62.6 29.8 64.6 ct 
27.3 66.79999 24.1 67.9 20.2 67.9 ct 15 67.9 11.1 66 8.2 62.4 ct 
4.7 58 l  2.9 50.7 l  p
9.6 40.8 m  9.6 49.5 10.6 55.3 12.7 58.1 ct 
14.8 61.1 17.3 62.4 20.2 62.4 ct 23.2 62.4 25.7 61.1 27.8 58.1 ct 
29.8 55.3 30.7 49.5 30.7 40.8 ct 30.7 32.1 29.8 26.3 27.8 23.5 ct 
25.7 20.5 23.2 19.2 20.1 19.2 ct 17.1 19.2 14.8 20.4 13 22.9 ct 
10.8 26.1 l  9.6 32.1 l  p ef
pom
pum
2424.4 1944.6 t 
4.8 32.7 m  3.1 22.7 l  3.1 14 l  10.6 14 l 
10.6 22.7 l  8.8 32.7 l  p ef
pom
pum
2438 1944.6 t 
2.9 40.8 m  2.9 34.6 3.7 29.6 4.8 25.7 ct 
6.2 21.9 8.09999 18.9 10.6 16.8 ct 13.1 14.8 16.4 13.7 20.2 13.7 ct 
23 13.7 25.6 14.3 27.6 15.5 ct 29.8 16.5 31.6 18.3 33 20.4 ct 
34.39999 22.6 35.5 25.1 36.39999 28.2 ct 37.1 31.3 37.5 35.6 37.5 40.8 ct 
37.5 47 36.8 52 35.6 55.9 ct 34.3 59.6 32.39999 62.6 29.8 64.6 ct 
27.3 66.79999 24.1 67.9 20.2 67.9 ct 15 67.9 11.1 66 8.2 62.4 ct 
4.7 58 l  2.9 50.7 l  p
9.6 40.8 m  9.6 49.5 10.6 55.3 12.7 58.1 ct 
14.8 61.1 17.3 62.4 20.2 62.4 ct 23.2 62.4 25.7 61.1 27.8 58.1 ct 
29.8 55.3 30.7 49.5 30.7 40.8 ct 30.7 32.1 29.8 26.3 27.8 23.5 ct 
25.7 20.5 23.2 19.2 20.1 19.2 ct 17.1 19.2 14.8 20.4 13 22.9 ct 
10.8 26.1 l  9.6 32.1 l  p ef
pom
pum
2479.4 1944.6 t 
2.9 40.8 m  2.9 34.6 3.7 29.6 4.8 25.7 ct 
6.2 21.9 8.09999 18.9 10.6 16.8 ct 13.1 14.8 16.4 13.7 20.2 13.7 ct 
23 13.7 25.6 14.3 27.6 15.5 ct 29.8 16.5 31.6 18.3 33 20.4 ct 
34.39999 22.6 35.5 25.1 36.39999 28.2 ct 37.1 31.3 37.5 35.6 37.5 40.8 ct 
37.5 47 36.8 52 35.6 55.9 ct 34.3 59.6 32.39999 62.6 29.8 64.6 ct 
27.3 66.79999 24.1 67.9 20.2 67.9 ct 15 67.9 11.1 66 8.2 62.4 ct 
4.7 58 l  2.9 50.7 l  p
9.6 40.8 m  9.6 49.5 10.6 55.3 12.7 58.1 ct 
14.8 61.1 17.3 62.4 20.2 62.4 ct 23.2 62.4 25.7 61.1 27.8 58.1 ct 
29.8 55.3 30.7 49.5 30.7 40.8 ct 30.7 32.1 29.8 26.3 27.8 23.5 ct 
25.7 20.5 23.2 19.2 20.1 19.2 ct 17.1 19.2 14.8 20.4 13 22.9 ct 
10.8 26.1 l  9.6 32.1 l  p ef
pom
pum
2520.1 1944.6 t 
2.9 40.8 m  2.9 34.6 3.7 29.6 4.8 25.7 ct 
6.2 21.9 8.09999 18.9 10.6 16.8 ct 13.1 14.8 16.4 13.7 20.2 13.7 ct 
23 13.7 25.6 14.3 27.6 15.5 ct 29.8 16.5 31.6 18.3 33 20.4 ct 
34.39999 22.6 35.5 25.1 36.39999 28.2 ct 37.1 31.3 37.5 35.6 37.5 40.8 ct 
37.5 47 36.8 52 35.6 55.9 ct 34.3 59.6 32.39999 62.6 29.8 64.6 ct 
27.3 66.79999 24.1 67.9 20.2 67.9 ct 15 67.9 11.1 66 8.2 62.4 ct 
4.7 58 l  2.9 50.7 l  p
9.6 40.8 m  9.6 49.5 10.6 55.3 12.7 58.1 ct 
14.8 61.1 17.3 62.4 20.2 62.4 ct 23.2 62.4 25.7 61.1 27.8 58.1 ct 
29.8 55.3 30.7 49.5 30.7 40.8 ct 30.7 32.1 29.8 26.3 27.8 23.5 ct 
25.7 20.5 23.2 19.2 20.1 19.2 ct 17.1 19.2 14.8 20.4 13 22.9 ct 
10.8 26.1 l  9.6 32.1 l  p ef
pom
gr
0.003 0.402 0.800 c 1084.1 1124.9 m  1420 1124.9 l  1420 1919.4 l 
1084.1 1919.4 l  1084.1 1124.9 l  p ef
0.003 0.003 0.003 c 1252 1919.4 m  1084.1 1919.4 l  1084.1 1124.9 l 
1420 1124.9 l  1420 1919.4 l  1252 1919.4 l  ps
0.003 0.402 0.800 c 2427.9 432.9 m  2763.8 432.9 l  2763.8 1919.4 l 
2427.9 1919.4 l  2427.9 432.9 l  p ef
0.003 0.003 0.003 c 2595.8 1919.4 m  2427.9 1919.4 l  2427.9 432.9 l 
2763.8 432.9 l  2763.8 1919.4 l  2595.8 1919.4 l 
ps
0.601 0.203 0.402 c 748.2 1560.9 m  1084.1 1560.9 l 
1084.1 1919.4 l  748.2 1919.4 l  748.2 1560.9 l 
p ef
0.003 0.003 0.003 c 916.1 1919.4 m  748.2 1919.4 l  748.2 1560.9 l 
1084.1 1560.9 l  1084.1 1919.4 l  916.1 1919.4 l 
ps
0.601 0.203 0.402 c 2092 869.3 m  2427.9 869.3 l  2427.9 1919.4 l 
2092 1919.4 l  2092 869.3 l  p ef
0.003 0.003 0.003 c 2259.9 1919.4 m  2092 1919.4 l  2092 869.3 l 
2427.9 869.3 l  2427.9 1919.4 l  2259.9 1919.4 l 
ps
0.902 0.902 0.902 c 412.3 1795.4 m  748.2 1795.4 l 
748.2 1919.4 l  412.3 1919.4 l  412.3 1795.4 l 
p ef
0.003 0.003 0.003 c 580.2 1919.4 m  412.3 1919.4 l  412.3 1795.4 l 
748.2 1795.4 l  748.2 1919.4 l  580.2 1919.4 l 
ps
0.902 0.902 0.902 c 1756.1 1617.3 m  2092 1617.3 l  2092 1919.4 l 
1756.1 1919.4 l  1756.1 1617.3 l  p ef
0.003 0.003 0.003 c 1924 1919.4 m  1756.1 1919.4 l  1756.1 1617.3 l 
2092 1617.3 l  2092 1919.4 l  1924 1919.4 l  ps
244.4 1919.4 m  244.4 204.4 l  ps
244.4 1919.4 m  244.4 204.4 l  ps
229.4 1919.4 m  244.4 1919.4 l  ps
gs
pum
116.4 1878.4 t 
2.9 40.8 m  2.9 34.6 3.7 29.6 4.8 25.7 ct 
6.2 21.9 8.09999 18.9 10.6 16.8 ct 13.1 14.8 16.4 13.7 20.2 13.7 ct 
23 13.7 25.6 14.3 27.6 15.5 ct 29.8 16.5 31.6 18.3 33 20.4 ct 
34.39999 22.6 35.5 25.1 36.39999 28.2 ct 37.1 31.3 37.5 35.6 37.5 40.8 ct 
37.5 47 36.8 52 35.6 55.9 ct 34.3 59.6 32.39999 62.6 29.8 64.6 ct 
27.3 66.79999 24.1 67.9 20.2 67.9 ct 15 67.9 11.1 66 8.2 62.4 ct 
4.7 58 l  2.9 50.7 l  p
9.6 40.8 m  9.6 49.5 10.6 55.3 12.7 58.1 ct 
14.8 61.1 17.3 62.4 20.2 62.4 ct 23.2 62.4 25.7 61.1 27.8 58.1 ct 
29.8 55.3 30.7 49.5 30.7 40.8 ct 30.7 32.1 29.8 26.3 27.8 23.5 ct 
25.7 20.5 23.2 19.2 20.1 19.2 ct 17.1 19.2 14.8 20.4 13 22.9 ct 
10.8 26.1 l  9.6 32.1 l  p ef
pom
pum
157 1878.4 t 
6.5 67 m  6.5 59.4 l  13.9 59.4 l  13.9 67 l 
13.9 69.7 13.4 71.9 12.4 73.5 ct 11.5 75.1 9.9 76.5 7.8 77.4 ct 
6 74.7 l  7.4 74 8.4 73.1 9.09999 72 ct 9.7 70.79999 10 69.1 10.2 67 ct 
p ef
pom
pum
177.4 1878.4 t 
27.5 67 m  21 67 l  21 25.4 l  19.3 27 17.3 28.5 14.8 30 ct 
12.2 31.5 10 32.5 7.9 33.3 ct 7.9 27 l  11.6 25.3 14.8 23.2 17.4 20.8 ct 
20.2 18.5 22.2 16.1 23.2 13.7 ct 27.5 13.7 l 
p ef
pom
gr
229.4 1576.4 m  244.4 1576.4 l  ps
gs
pum
179.9 1534.5 t 
27.5 67 m  21 67 l  21 25.4 l  19.3 27 17.3 28.5 14.8 30 ct 
12.2 31.5 10 32.5 7.9 33.3 ct 7.9 27 l  11.6 25.3 14.8 23.2 17.4 20.8 ct 
20.2 18.5 22.2 16.1 23.2 13.7 ct 27.5 13.7 l 
p ef
pom
pum
179.9 1534.5 t 
27.5 67 m  21 67 l  21 25.4 l  19.3 27 17.3 28.5 14.8 30 ct 
12.2 31.5 10 32.5 7.9 33.3 ct 7.9 27 l  11.6 25.3 14.8 23.2 17.4 20.8 ct 
20.2 18.5 22.2 16.1 23.2 13.7 ct 27.5 13.7 l 
p ef
pom
gr
229.4 1233.4 m  244.4 1233.4 l  ps
gs
pum
137.59999 1193.2 t 
27.5 67 m  21 67 l  21 25.4 l  19.3 27 17.3 28.5 14.8 30 ct 
12.2 31.5 10 32.5 7.9 33.3 ct 7.9 27 l  11.6 25.3 14.8 23.2 17.4 20.8 ct 
20.2 18.5 22.2 16.1 23.2 13.7 ct 27.5 13.7 l 
p ef
pom
pum
178.2 1193.2 t 
2.9 40.8 m  2.9 34.6 3.7 29.6 4.8 25.7 ct 
6.2 21.9 8.09999 18.9 10.6 16.8 ct 13.1 14.8 16.4 13.7 20.2 13.7 ct 
23 13.7 25.6 14.3 27.6 15.5 ct 29.8 16.5 31.6 18.3 33 20.4 ct 
34.39999 22.6 35.5 25.1 36.39999 28.2 ct 37.1 31.3 37.5 35.6 37.5 40.8 ct 
37.5 47 36.8 52 35.6 55.9 ct 34.3 59.6 32.39999 62.6 29.8 64.6 ct 
27.3 66.79999 24.1 67.9 20.2 67.9 ct 15 67.9 11.1 66 8.2 62.4 ct 
4.7 58 l  2.9 50.7 l  p
9.6 40.8 m  9.6 49.5 10.6 55.3 12.7 58.1 ct 
14.8 61.1 17.3 62.4 20.2 62.4 ct 23.2 62.4 25.7 61.1 27.8 58.1 ct 
29.8 55.3 30.7 49.5 30.7 40.8 ct 30.7 32.1 29.8 26.3 27.8 23.5 ct 
25.7 20.5 23.2 19.2 20.1 19.2 ct 17.1 19.2 14.8 20.4 13 22.9 ct 
10.8 26.1 l  9.6 32.1 l  p ef
pom
gr
229.4 890.4 m  244.4 890.4 l  ps
gs
pum
95.3 849.2 t 
27.5 67 m  21 67 l  21 25.4 l  19.3 27 17.3 28.5 14.8 30 ct 
12.2 31.5 10 32.5 7.9 33.3 ct 7.9 27 l  11.6 25.3 14.8 23.2 17.4 20.8 ct 
20.2 18.5 22.2 16.1 23.2 13.7 ct 27.5 13.7 l 
p ef
pom
pum
135.9 849.2 t 
2.9 40.8 m  2.9 34.6 3.7 29.6 4.8 25.7 ct 
6.2 21.9 8.09999 18.9 10.6 16.8 ct 13.1 14.8 16.4 13.7 20.2 13.7 ct 
23 13.7 25.6 14.3 27.6 15.5 ct 29.8 16.5 31.6 18.3 33 20.4 ct 
34.39999 22.6 35.5 25.1 36.39999 28.2 ct 37.1 31.3 37.5 35.6 37.5 40.8 ct 
37.5 47 36.8 52 35.6 55.9 ct 34.3 59.6 32.39999 62.6 29.8 64.6 ct 
27.3 66.79999 24.1 67.9 20.2 67.9 ct 15 67.9 11.1 66 8.2 62.4 ct 
4.7 58 l  2.9 50.7 l  p
9.6 40.8 m  9.6 49.5 10.6 55.3 12.7 58.1 ct 
14.8 61.1 17.3 62.4 20.2 62.4 ct 23.2 62.4 25.7 61.1 27.8 58.1 ct 
29.8 55.3 30.7 49.5 30.7 40.8 ct 30.7 32.1 29.8 26.3 27.8 23.5 ct 
25.7 20.5 23.2 19.2 20.1 19.2 ct 17.1 19.2 14.8 20.4 13 22.9 ct 
10.8 26.1 l  9.6 32.1 l  p ef
pom
pum
176.6 849.2 t 
2.9 40.8 m  2.9 34.6 3.7 29.6 4.8 25.7 ct 
6.2 21.9 8.09999 18.9 10.6 16.8 ct 13.1 14.8 16.4 13.7 20.2 13.7 ct 
23 13.7 25.6 14.3 27.6 15.5 ct 29.8 16.5 31.6 18.3 33 20.4 ct 
34.39999 22.6 35.5 25.1 36.39999 28.2 ct 37.1 31.3 37.5 35.6 37.5 40.8 ct 
37.5 47 36.8 52 35.6 55.9 ct 34.3 59.6 32.39999 62.6 29.8 64.6 ct 
27.3 66.79999 24.1 67.9 20.2 67.9 ct 15 67.9 11.1 66 8.2 62.4 ct 
4.7 58 l  2.9 50.7 l  p
9.6 40.8 m  9.6 49.5 10.6 55.3 12.7 58.1 ct 
14.8 61.1 17.3 62.4 20.2 62.4 ct 23.2 62.4 25.7 61.1 27.8 58.1 ct 
29.8 55.3 30.7 49.5 30.7 40.8 ct 30.7 32.1 29.8 26.3 27.8 23.5 ct 
25.7 20.5 23.2 19.2 20.1 19.2 ct 17.1 19.2 14.8 20.4 13 22.9 ct 
10.8 26.1 l  9.6 32.1 l  p ef
pom
gr
229.4 547.39999 m  244.4 547.39999 l  ps
gs
pum
55.6 505.3 t 
27.5 67 m  21 67 l  21 25.4 l  19.3 27 17.3 28.5 14.8 30 ct 
12.2 31.5 10 32.5 7.9 33.3 ct 7.9 27 l  11.6 25.3 14.8 23.2 17.4 20.8 ct 
20.2 18.5 22.2 16.1 23.2 13.7 ct 27.5 13.7 l 
p ef
pom
pum
96.2 505.3 t 
2.9 40.8 m  2.9 34.6 3.7 29.6 4.8 25.7 ct 
6.2 21.9 8.09999 18.9 10.6 16.8 ct 13.1 14.8 16.4 13.7 20.2 13.7 ct 
23 13.7 25.6 14.3 27.6 15.5 ct 29.8 16.5 31.6 18.3 33 20.4 ct 
34.39999 22.6 35.5 25.1 36.39999 28.2 ct 37.1 31.3 37.5 35.6 37.5 40.8 ct 
37.5 47 36.8 52 35.6 55.9 ct 34.3 59.6 32.39999 62.6 29.8 64.6 ct 
27.3 66.79999 24.1 67.9 20.2 67.9 ct 15 67.9 11.1 66 8.2 62.4 ct 
4.7 58 l  2.9 50.7 l  p
9.6 40.8 m  9.6 49.5 10.6 55.3 12.7 58.1 ct 
14.8 61.1 17.3 62.4 20.2 62.4 ct 23.2 62.4 25.7 61.1 27.8 58.1 ct 
29.8 55.3 30.7 49.5 30.7 40.8 ct 30.7 32.1 29.8 26.3 27.8 23.5 ct 
25.7 20.5 23.2 19.2 20.1 19.2 ct 17.1 19.2 14.8 20.4 13 22.9 ct 
10.8 26.1 l  9.6 32.1 l  p ef
pom
pum
136.9 505.3 t 
2.9 40.8 m  2.9 34.6 3.7 29.6 4.8 25.7 ct 
6.2 21.9 8.09999 18.9 10.6 16.8 ct 13.1 14.8 16.4 13.7 20.2 13.7 ct 
23 13.7 25.6 14.3 27.6 15.5 ct 29.8 16.5 31.6 18.3 33 20.4 ct 
34.39999 22.6 35.5 25.1 36.39999 28.2 ct 37.1 31.3 37.5 35.6 37.5 40.8 ct 
37.5 47 36.8 52 35.6 55.9 ct 34.3 59.6 32.39999 62.6 29.8 64.6 ct 
27.3 66.79999 24.1 67.9 20.2 67.9 ct 15 67.9 11.1 66 8.2 62.4 ct 
4.7 58 l  2.9 50.7 l  p
9.6 40.8 m  9.6 49.5 10.6 55.3 12.7 58.1 ct 
14.8 61.1 17.3 62.4 20.2 62.4 ct 23.2 62.4 25.7 61.1 27.8 58.1 ct 
29.8 55.3 30.7 49.5 30.7 40.8 ct 30.7 32.1 29.8 26.3 27.8 23.5 ct 
25.7 20.5 23.2 19.2 20.1 19.2 ct 17.1 19.2 14.8 20.4 13 22.9 ct 
10.8 26.1 l  9.6 32.1 l  p ef
pom
pum
178.4 505.3 t 
2.9 40.8 m  2.9 34.6 3.7 29.6 4.8 25.7 ct 
6.2 21.9 8.09999 18.9 10.6 16.8 ct 13.1 14.8 16.4 13.7 20.2 13.7 ct 
23 13.7 25.6 14.3 27.6 15.5 ct 29.8 16.5 31.6 18.3 33 20.4 ct 
34.39999 22.6 35.5 25.1 36.39999 28.2 ct 37.1 31.3 37.5 35.6 37.5 40.8 ct 
37.5 47 36.8 52 35.6 55.9 ct 34.3 59.6 32.39999 62.6 29.8 64.6 ct 
27.3 66.79999 24.1 67.9 20.2 67.9 ct 15 67.9 11.1 66 8.2 62.4 ct 
4.7 58 l  2.9 50.7 l  p
9.6 40.8 m  9.6 49.5 10.6 55.3 12.7 58.1 ct 
14.8 61.1 17.3 62.4 20.2 62.4 ct 23.2 62.4 25.7 61.1 27.8 58.1 ct 
29.8 55.3 30.7 49.5 30.7 40.8 ct 30.7 32.1 29.8 26.3 27.8 23.5 ct 
25.7 20.5 23.2 19.2 20.1 19.2 ct 17.1 19.2 14.8 20.4 13 22.9 ct 
10.8 26.1 l  9.6 32.1 l  p ef
pom
gr
229.4 204.3 m  244.4 204.3 l  ps
gs
pum
15.9 163.9 t 
27.5 67 m  21 67 l  21 25.4 l  19.3 27 17.3 28.5 14.8 30 ct 
12.2 31.5 10 32.5 7.9 33.3 ct 7.9 27 l  11.6 25.3 14.8 23.2 17.4 20.8 ct 
20.2 18.5 22.2 16.1 23.2 13.7 ct 27.5 13.7 l 
p ef
pom
pum
56.5 163.9 t 
2.9 40.8 m  2.9 34.6 3.7 29.6 4.8 25.7 ct 
6.2 21.9 8.09999 18.9 10.6 16.8 ct 13.1 14.8 16.4 13.7 20.2 13.7 ct 
23 13.7 25.6 14.3 27.6 15.5 ct 29.8 16.5 31.6 18.3 33 20.4 ct 
34.39999 22.6 35.5 25.1 36.39999 28.2 ct 37.1 31.3 37.5 35.6 37.5 40.8 ct 
37.5 47 36.8 52 35.6 55.9 ct 34.3 59.6 32.39999 62.6 29.8 64.6 ct 
27.3 66.79999 24.1 67.9 20.2 67.9 ct 15 67.9 11.1 66 8.2 62.4 ct 
4.7 58 l  2.9 50.7 l  p
9.6 40.8 m  9.6 49.5 10.6 55.3 12.7 58.1 ct 
14.8 61.1 17.3 62.4 20.2 62.4 ct 23.2 62.4 25.7 61.1 27.8 58.1 ct 
29.8 55.3 30.7 49.5 30.7 40.8 ct 30.7 32.1 29.8 26.3 27.8 23.5 ct 
25.7 20.5 23.2 19.2 20.1 19.2 ct 17.1 19.2 14.8 20.4 13 22.9 ct 
10.8 26.1 l  9.6 32.1 l  p ef
pom
pum
97.2 163.9 t 
2.9 40.8 m  2.9 34.6 3.7 29.6 4.8 25.7 ct 
6.2 21.9 8.09999 18.9 10.6 16.8 ct 13.1 14.8 16.4 13.7 20.2 13.7 ct 
23 13.7 25.6 14.3 27.6 15.5 ct 29.8 16.5 31.6 18.3 33 20.4 ct 
34.39999 22.6 35.5 25.1 36.39999 28.2 ct 37.1 31.3 37.5 35.6 37.5 40.8 ct 
37.5 47 36.8 52 35.6 55.9 ct 34.3 59.6 32.39999 62.6 29.8 64.6 ct 
27.3 66.79999 24.1 67.9 20.2 67.9 ct 15 67.9 11.1 66 8.2 62.4 ct 
4.7 58 l  2.9 50.7 l  p
9.6 40.8 m  9.6 49.5 10.6 55.3 12.7 58.1 ct 
14.8 61.1 17.3 62.4 20.2 62.4 ct 23.2 62.4 25.7 61.1 27.8 58.1 ct 
29.8 55.3 30.7 49.5 30.7 40.8 ct 30.7 32.1 29.8 26.3 27.8 23.5 ct 
25.7 20.5 23.2 19.2 20.1 19.2 ct 17.1 19.2 14.8 20.4 13 22.9 ct 
10.8 26.1 l  9.6 32.1 l  p ef
pom
pum
138.7 163.9 t 
2.9 40.8 m  2.9 34.6 3.7 29.6 4.8 25.7 ct 
6.2 21.9 8.09999 18.9 10.6 16.8 ct 13.1 14.8 16.4 13.7 20.2 13.7 ct 
23 13.7 25.6 14.3 27.6 15.5 ct 29.8 16.5 31.6 18.3 33 20.4 ct 
34.39999 22.6 35.5 25.1 36.39999 28.2 ct 37.1 31.3 37.5 35.6 37.5 40.8 ct 
37.5 47 36.8 52 35.6 55.9 ct 34.3 59.6 32.39999 62.6 29.8 64.6 ct 
27.3 66.79999 24.1 67.9 20.2 67.9 ct 15 67.9 11.1 66 8.2 62.4 ct 
4.7 58 l  2.9 50.7 l  p
9.6 40.8 m  9.6 49.5 10.6 55.3 12.7 58.1 ct 
14.8 61.1 17.3 62.4 20.2 62.4 ct 23.2 62.4 25.7 61.1 27.8 58.1 ct 
29.8 55.3 30.7 49.5 30.7 40.8 ct 30.7 32.1 29.8 26.3 27.8 23.5 ct 
25.7 20.5 23.2 19.2 20.1 19.2 ct 17.1 19.2 14.8 20.4 13 22.9 ct 
10.8 26.1 l  9.6 32.1 l  p ef
pom
pum
179.3 163.9 t 
2.9 40.8 m  2.9 34.6 3.7 29.6 4.8 25.7 ct 
6.2 21.9 8.09999 18.9 10.6 16.8 ct 13.1 14.8 16.4 13.7 20.2 13.7 ct 
23 13.7 25.6 14.3 27.6 15.5 ct 29.8 16.5 31.6 18.3 33 20.4 ct 
34.39999 22.6 35.5 25.1 36.39999 28.2 ct 37.1 31.3 37.5 35.6 37.5 40.8 ct 
37.5 47 36.8 52 35.6 55.9 ct 34.3 59.6 32.39999 62.6 29.8 64.6 ct 
27.3 66.79999 24.1 67.9 20.2 67.9 ct 15 67.9 11.1 66 8.2 62.4 ct 
4.7 58 l  2.9 50.7 l  p
9.6 40.8 m  9.6 49.5 10.6 55.3 12.7 58.1 ct 
14.8 61.1 17.3 62.4 20.2 62.4 ct 23.2 62.4 25.7 61.1 27.8 58.1 ct 
29.8 55.3 30.7 49.5 30.7 40.8 ct 30.7 32.1 29.8 26.3 27.8 23.5 ct 
25.7 20.5 23.2 19.2 20.1 19.2 ct 17.1 19.2 14.8 20.4 13 22.9 ct 
10.8 26.1 l  9.6 32.1 l  p ef
pom
gr
1470 187.5 m  603.5 187.5 l  603.5 76.9 l  2336.59999 76.9 l 
2336.59999 187.5 l  1470 187.5 l  ps
0.902 0.902 0.902 c 623.7 103.8 m  684.2 103.8 l  684.2 164.3 l 
623.7 164.3 l  623.7 103.8 l  p ef
0.003 0.003 0.003 c 653.9 164.3 m  623.7 164.3 l  623.7 103.8 l 
684.2 103.8 l  684.2 164.3 l  653.9 164.3 l 
ps
gs
pum
703.8 98.2 t 
3.5 58.5 m  3.5 52.3 l  9.3 55.1 15.1 56.4 20.7 56.4 ct 
27.1 56.4 30.3 54.1 30.3 49.4 ct 30.3 47 29.4 45.2 27.7 43.9 ct 
26.3 43.1 24.1 42.1 21 41.2 ct 15.1 39.2 l 
7.5 36.7 3.7 32.6 3.7 26.9 ct 3.7 19 9 15.1 19.7 15.1 ct 
24.3 15.1 29 15.7 34 17 ct 34 22.7 l  28.8 20.8 23.9 19.7 19.3 19.7 ct 
12.9 19.7 9.6 22 9.6 26.4 ct 9.6 28.1 10.3 29.4 11.5 30.5 ct 
12.7 31.6 15 32.7 18 33.6 ct 24.2 35.6 l  28.8 37.2 31.9 38.9 33.89999 40.8 ct 
35.7 42.7 36.7 45.3 36.7 48.4 ct 36.7 52.3 35.2 55.5 32.3 57.6 ct 
29.5 59.9 25.5 61.2 20.4 61.2 ct 15.5 61.2 l 
9.9 60.2 l  p ef
pom
pum
743.6 98.2 t 
23.2 60.1 m  23.2 54 l  21.8 55.9 20.3 57.5 19 58.5 ct 
16.9 60.1 14.7 60.8 12.3 60.8 ct 6.9 60.8 4.1 57.5 4.1 51 ct 
4.1 27.8 l  9.9 27.8 l  9.9 49 l  9.9 51.7 10.1 53.4 10.7 54.4 ct 
11.2 55.2 12.3 55.7 13.8 55.7 ct 17 55.7 20.1 53.4 23.2 48.7 ct 
23.2 27.8 l  29 27.8 l  29 60.1 l  p ef
pom
pum
777.5 98.2 t 
4.4 60.1 m  4.4 27.8 l  10.3 27.8 l  10.3 33.89999 l 
11.7 31.9 13.2 30.4 14.5 29.4 ct 16.6 27.9 18.9 27.2 21.3 27.2 ct 
26.6 27.2 29.4 30.4 29.4 36.89999 ct 29.4 60.1 l 
23.6 60.1 l  23.6 38.9 l  23.6 36.2 23.2 34.5 22.7 33.5 ct 
22.1 32.7 21.2 32.2 19.7 32.2 ct 16.4 32.2 13.3 34.5 10.3 39.2 ct 
10.3 60.1 l  p ef
pom
pum
812.2 98.2 t 
pom
pum
828.3 98.2 t 
1.3 66.9 m  1.3 61.5 l  4.7 63 7.8 63.8 10.9 63.8 ct 
14.1 63.8 16.3 63 17.3 61.4 ct 18.1 60.1 18.5 57.9 18.5 54.7 ct 
18.5 16.19999 l  24.8 16.19999 l  24.8 54.5 l  24.8 63.9 19.9 68.79999 10.5 68.79999 ct 
7.3 68.79999 l  4.29999 68.2 l  p ef
pom
pum
858.7 98.2 t 
4.8 60.1 m  4.8 16.19999 l  18.9 16.19999 l  33.5 16.19999 40.9 23.2 40.9 37.2 ct 
40.9 44.3 39 50 35.1 54 ct 31.3 58 25.9 60.1 18.9 60.1 ct 
p
11 55.3 m  18.5 55.3 l  29 55.3 34.2 49.5 34.2 37.8 ct 
34.2 31 32.2 26.1 27.9 23.2 ct 26.7 22.4 25.3 21.9 23.7 21.5 ct 
21.6 21 19 20.9 15.6 20.9 ct 11 20.9 l  p ef
pom
pum
902.8 98.2 t 
5.5 60.1 m  5.5 16.19999 l  11.3 16.19999 l  11.3 37.8 l 
29.5 16.19999 l  35.8 16.19999 l  18.1 37.2 l  38.9 60.1 l 
31 60.1 l  11.3 37.8 l  11.3 60.1 l  p ef
pom
pum
943.4 98.2 t 
pom
pum
960.3 98.2 t 
6.7 60.1 m  6.7 55.6 l  15.5 55.6 l  15.5 21 l 
6.7 23.2 l  6.7 18.69999 l  21.3 15.1 l  21.3 55.6 l 
30.1 55.6 l  30.1 60.1 l  p ef
pom
pum
994.2 98.2 t 
4.7 60.1 m  4.7 52.7 l  11.9 52.7 l  11.9 60.1 l 
p ef
pom
pum
1011.1 98.2 t 
20.2 60.1 m  20.2 47.6 l  0.8 47.6 l  0.8 43.2 l 
20.2 16.19999 l  25.8 16.19999 l  25.8 42.9 l  31.6 42.9 l 
31.6 47.6 l  25.8 47.6 l  25.8 60.1 l  p
6.5 42.9 m  20.7 42.9 l  20.7 23.3 l  p ef
pom
gr
0.601 0.203 0.402 c 1194.7 103.8 m  1255.2 103.8 l 
1255.2 164.3 l  1194.7 164.3 l  1194.7 103.8 l 
p ef
0.003 0.003 0.003 c 1224.9 164.3 m  1194.7 164.3 l  1194.7 103.8 l 
1255.2 103.8 l  1255.2 164.3 l  1224.9 164.3 l 
ps
gs
pum
1275.3 98.2 t 
1.3 66.9 m  1.3 61.5 l  4.7 63 7.8 63.8 10.9 63.8 ct 
14.1 63.8 16.3 63 17.3 61.4 ct 18.1 60.1 18.5 57.9 18.5 54.7 ct 
18.5 16.19999 l  24.8 16.19999 l  24.8 54.5 l  24.8 63.9 19.9 68.79999 10.5 68.79999 ct 
7.3 68.79999 l  4.29999 68.2 l  p ef
pom
pum
1305.8 98.2 t 
4.8 60.1 m  4.8 16.19999 l  10.9 16.19999 l  33.39999 50 l 
33.39999 16.19999 l  38.7 16.19999 l  38.7 60.1 l  32.7 60.1 l 
10.1 26.1 l  10.1 60.1 l  p ef
pom
pum
1349 98.2 t 
23.2 60.1 m  23.2 54 l  21.8 55.9 20.3 57.5 19 58.5 ct 
16.9 60.1 14.7 60.8 12.3 60.8 ct 6.9 60.8 4.1 57.5 4.1 51 ct 
4.1 27.8 l  9.9 27.8 l  9.9 49 l  9.9 51.7 10.1 53.4 10.7 54.4 ct 
11.2 55.2 12.3 55.7 13.8 55.7 ct 17 55.7 20.1 53.4 23.2 48.7 ct 
23.2 27.8 l  29 27.8 l  29 60.1 l  p ef
pom
pum
1383.7 98.2 t 
4.4 60.1 m  4.4 13.3 l  10.3 13.3 l  10.3 43.5 l 
21 27.8 l  26.6 27.8 l  16.3 43.1 l  29.6 60.1 l 
22.6 60.1 l  10.3 43.6 l  10.3 60.1 l  p ef
pom
pum
1414.2 98.2 t 
24.1 40.4 m  24.1 38.5 23.8 37 23.5 36.1 ct 
22.5 33 20.2 31.5 16.8 31.5 ct 14.4 31.5 12.6 32.2 11.2 33.6 ct 
9.8 35 9 37.3 8.7 40.4 ct p
29.9 54.4 m  29.9 59 l  25.9 60.2 22.3 60.8 18.9 60.8 ct 
13.8 60.8 9.9 59.2 6.9 56.1 ct 3.9 52.9 2.5 48.8 2.5 43.6 ct 
2.5 38.5 3.7 34.6 6.4 31.6 ct 8.9 28.7 12.6 27.2 16.9 27.2 ct 
22.1 27.2 25.6 28.9 27.8 32.6 ct 29.4 35.3 30.1 38.7 30 43.1 ct 
30 44.9 l  8.59999 44.9 l  8.8 47.2 9.2 49 9.8 50.2 ct 
11.5 54.2 14.9 56.3 20.1 56.3 ct 23.1 56.3 l 
26.3 55.7 l  p ef
pom
pum
1448 98.2 t 
pom
pum
1464.1 98.2 t 
17.9 60.1 m  0.9 16.19999 l  7.3 16.19999 l  21.3 52.2 l 
34.7 16.19999 l  39.9 16.19999 l  23.7 60.1 l  p ef
pom
pum
1504.7 98.2 t 
4.8 60.1 m  4.8 16.19999 l  13.4 16.19999 l  25.4 50.1 l 
37.8 16.19999 l  45.5 16.19999 l  45.5 60.1 l  39.7 60.1 l 
39.7 24.4 l  27.7 57 l  21.8 57 l  10.1 24.3 l 
10.1 60.1 l  p ef
pom
gr
0.003 0.402 0.800 c 1765.7 103.8 m  1826.2 103.8 l  1826.2 164.3 l 
1765.7 164.3 l  1765.7 103.8 l  p ef
0.003 0.003 0.003 c 1795.9 164.3 m  1765.7 164.3 l  1765.7 103.8 l 
1826.2 103.8 l  1826.2 164.3 l  1795.9 164.3 l 
ps
gs
pum
1846.8 98.2 t 
1.3 66.9 m  1.3 61.5 l  4.7 63 7.8 63.8 10.9 63.8 ct 
14.1 63.8 16.3 63 17.3 61.4 ct 18.1 60.1 18.5 57.9 18.5 54.7 ct 
18.5 16.19999 l  24.8 16.19999 l  24.8 54.5 l  24.8 63.9 19.9 68.79999 10.5 68.79999 ct 
7.3 68.79999 l  4.29999 68.2 l  p ef
pom
pum
1877.3 98.2 t 
4.8 60.1 m  4.8 16.19999 l  10.9 16.19999 l  33.39999 50 l 
33.39999 16.19999 l  38.7 16.19999 l  38.7 60.1 l  32.7 60.1 l 
10.1 26.1 l  10.1 60.1 l  p ef
pom
pum
1920.5 98.2 t 
23.2 60.1 m  23.2 54 l  21.8 55.9 20.3 57.5 19 58.5 ct 
16.9 60.1 14.7 60.8 12.3 60.8 ct 6.9 60.8 4.1 57.5 4.1 51 ct 
4.1 27.8 l  9.9 27.8 l  9.9 49 l  9.9 51.7 10.1 53.4 10.7 54.4 ct 
11.2 55.2 12.3 55.7 13.8 55.7 ct 17 55.7 20.1 53.4 23.2 48.7 ct 
23.2 27.8 l  29 27.8 l  29 60.1 l  p ef
pom
pum
1955.2 98.2 t 
4.4 60.1 m  4.4 13.3 l  10.3 13.3 l  10.3 43.5 l 
21 27.8 l  26.6 27.8 l  16.3 43.1 l  29.6 60.1 l 
22.6 60.1 l  10.3 43.6 l  10.3 60.1 l  p ef
pom
pum
1985.7 98.2 t 
24.1 40.4 m  24.1 38.5 23.8 37 23.5 36.1 ct 
22.5 33 20.2 31.5 16.8 31.5 ct 14.4 31.5 12.6 32.2 11.2 33.6 ct 
9.8 35 9 37.3 8.7 40.4 ct p
29.9 54.4 m  29.9 59 l  25.9 60.2 22.3 60.8 18.9 60.8 ct 
13.8 60.8 9.9 59.2 6.9 56.1 ct 3.9 52.9 2.5 48.8 2.5 43.6 ct 
2.5 38.5 3.7 34.6 6.4 31.6 ct 8.9 28.7 12.6 27.2 16.9 27.2 ct 
22.1 27.2 25.6 28.9 27.8 32.6 ct 29.4 35.3 30.1 38.7 30 43.1 ct 
30 44.9 l  8.59999 44.9 l  8.8 47.2 9.2 49 9.8 50.2 ct 
11.5 54.2 14.9 56.3 20.1 56.3 ct 23.1 56.3 l 
26.3 55.7 l  p ef
pom
pum
2019.5 98.2 t 
pom
pum
2035.6 98.2 t 
5.2 60.1 m  5.2 16.19999 l  11.5 16.19999 l  11.5 60.1 l 
p ef
pom
pum
2052.5 98.2 t 
4.4 60.1 m  4.4 27.8 l  10.3 27.8 l  10.3 33.89999 l 
11.7 31.9 13.2 30.4 14.5 29.4 ct 16.6 27.9 18.9 27.2 21.3 27.2 ct 
26.6 27.2 29.4 30.4 29.4 36.89999 ct 29.4 60.1 l 
23.6 60.1 l  23.6 38.9 l  23.6 36.2 23.2 34.5 22.7 33.5 ct 
22.1 32.7 21.2 32.2 19.7 32.2 ct 16.4 32.2 13.3 34.5 10.3 39.2 ct 
10.3 60.1 l  p ef
pom
pum
2086.4 98.2 t 
15.6 60.2 m  14.4 60.6 13.3 60.8 12.2 60.8 ct 
7 60.8 4.4 57.5 4.4 51.1 ct 4.4 32.3 l 
0.8 32.3 l  0.8 27.8 l  4.4 27.8 l  4.4 22 l 
10.3 21.5 l  10.3 27.8 l  16.4 27.8 l  16.4 32.3 l 
10.3 32.3 l  10.3 50 l  10.3 52.6 10.5 54.2 10.9 55.1 ct 
11.3 55.9 12.2 56.3 13.6 56.3 ct 14.4 56.3 15 56.3 15.6 56.1 ct 
p ef
pom
pum
2103.3 98.2 t 
24.1 40.4 m  24.1 38.5 23.8 37 23.5 36.1 ct 
22.5 33 20.2 31.5 16.8 31.5 ct 14.4 31.5 12.6 32.2 11.2 33.6 ct 
9.8 35 9 37.3 8.7 40.4 ct p
29.9 54.4 m  29.9 59 l  25.9 60.2 22.3 60.8 18.9 60.8 ct 
13.8 60.8 9.9 59.2 6.9 56.1 ct 3.9 52.9 2.5 48.8 2.5 43.6 ct 
2.5 38.5 3.7 34.6 6.4 31.6 ct 8.9 28.7 12.6 27.2 16.9 27.2 ct 
22.1 27.2 25.6 28.9 27.8 32.6 ct 29.4 35.3 30.1 38.7 30 43.1 ct 
30 44.9 l  8.59999 44.9 l  8.8 47.2 9.2 49 9.8 50.2 ct 
11.5 54.2 14.9 56.3 20.1 56.3 ct 23.1 56.3 l 
26.3 55.7 l  p ef
pom
pum
2137.2 98.2 t 
4.4 60.1 m  4.4 27.8 l  10.3 27.8 l  10.3 33.89999 l 
11.1 31.8 12.1 30.4 13 29.4 ct 14.4 27.9 16.1 27.2 18 27.2 ct 
18.4 27.2 19 27.2 19.7 27.3 ct 19.7 32.8 l 
18.6 32.39999 17.8 32.3 17.19999 32.3 ct 15 32.3 12.7 34.5 10.3 38.9 ct 
10.3 60.1 l  p ef
pom
pum
2157.5 98.2 t 
10.3 71.7 m  4.4 71.7 l  4.4 27.8 l  10.3 27.8 l 
10.3 33.89999 l  11.3 31.9 12.6 30.4 13.8 29.4 ct 
15.5 27.9 17.5 27.2 19.9 27.2 ct 23.2 27.2 25.9 28.6 27.9 31.5 ct 
30 34.39999 31 38.2 31 43.1 ct 31 48.7 29.6 53 27.1 56.2 ct 
24.4 59.2 20.7 60.8 15.8 60.8 ct 14.1 60.8 12.2 60.6 10.3 60.1 ct 
p
10.3 39.2 m  10.3 55.6 l  12.9 56.1 15 56.3 16.3 56.3 ct 
21.9 56.3 24.7 52.2 24.7 43.7 ct 24.7 40.1 24.2 37.3 23.1 35.3 ct 
22 33.3 20.6 32.3 18.6 32.3 ct 16.19999 32.3 l 
13.4 34.6 l  p ef
pom
pum
2191.4 98.2 t 
4.4 60.1 m  4.4 27.8 l  10.3 27.8 l  10.3 33.89999 l 
11.1 31.8 12.1 30.4 13 29.4 ct 14.4 27.9 16.1 27.2 18 27.2 ct 
18.4 27.2 19 27.2 19.7 27.3 ct 19.7 32.8 l 
18.6 32.39999 17.8 32.3 17.19999 32.3 ct 15 32.3 12.7 34.5 10.3 38.9 ct 
10.3 60.1 l  p ef
pom
pum
2211.7 98.2 t 
24.1 40.4 m  24.1 38.5 23.8 37 23.5 36.1 ct 
22.5 33 20.2 31.5 16.8 31.5 ct 14.4 31.5 12.6 32.2 11.2 33.6 ct 
9.8 35 9 37.3 8.7 40.4 ct p
29.9 54.4 m  29.9 59 l  25.9 60.2 22.3 60.8 18.9 60.8 ct 
13.8 60.8 9.9 59.2 6.9 56.1 ct 3.9 52.9 2.5 48.8 2.5 43.6 ct 
2.5 38.5 3.7 34.6 6.4 31.6 ct 8.9 28.7 12.6 27.2 16.9 27.2 ct 
22.1 27.2 25.6 28.9 27.8 32.6 ct 29.4 35.3 30.1 38.7 30 43.1 ct 
30 44.9 l  8.59999 44.9 l  8.8 47.2 9.2 49 9.8 50.2 ct 
11.5 54.2 14.9 56.3 20.1 56.3 ct 23.1 56.3 l 
26.3 55.7 l  p ef
pom
pum
2245.59999 98.2 t 
15.6 60.2 m  14.4 60.6 13.3 60.8 12.2 60.8 ct 
7 60.8 4.4 57.5 4.4 51.1 ct 4.4 32.3 l 
0.8 32.3 l  0.8 27.8 l  4.4 27.8 l  4.4 22 l 
10.3 21.5 l  10.3 27.8 l  16.4 27.8 l  16.4 32.3 l 
10.3 32.3 l  10.3 50 l  10.3 52.6 10.5 54.2 10.9 55.1 ct 
11.3 55.9 12.2 56.3 13.6 56.3 ct 14.4 56.3 15 56.3 15.6 56.1 ct 
p ef
pom
pum
2262.5 98.2 t 
24.1 40.4 m  24.1 38.5 23.8 37 23.5 36.1 ct 
22.5 33 20.2 31.5 16.8 31.5 ct 14.4 31.5 12.6 32.2 11.2 33.6 ct 
9.8 35 9 37.3 8.7 40.4 ct p
29.9 54.4 m  29.9 59 l  25.9 60.2 22.3 60.8 18.9 60.8 ct 
13.8 60.8 9.9 59.2 6.9 56.1 ct 3.9 52.9 2.5 48.8 2.5 43.6 ct 
2.5 38.5 3.7 34.6 6.4 31.6 ct 8.9 28.7 12.6 27.2 16.9 27.2 ct 
22.1 27.2 25.6 28.9 27.8 32.6 ct 29.4 35.3 30.1 38.7 30 43.1 ct 
30 44.9 l  8.59999 44.9 l  8.8 47.2 9.2 49 9.8 50.2 ct 
11.5 54.2 14.9 56.3 20.1 56.3 ct 23.1 56.3 l 
26.3 55.7 l  p ef
pom
pum
2296.4 98.2 t 
4.4 60.1 m  4.4 27.8 l  10.3 27.8 l  10.3 33.89999 l 
11.1 31.8 12.1 30.4 13 29.4 ct 14.4 27.9 16.1 27.2 18 27.2 ct 
18.4 27.2 19 27.2 19.7 27.3 ct 19.7 32.8 l 
18.6 32.39999 17.8 32.3 17.19999 32.3 ct 15 32.3 12.7 34.5 10.3 38.9 ct 
10.3 60.1 l  p ef
pom
gr
1261.20225 1261.20225 t 
-1261.20225 -1261.20225 m -57665.74195 -1261.20225 l -57665.74195 -40366.41659 l -1261.20225 -40366.41659 l -1261.20225 -1261.20225 l
eoclip newpath
gr
63.5 63.5 m 2903.4 63.5 l 2903.4 2032.4 l 63.5 2032.4 l 63.5 63.5 l
eoclip newpath
gr
gs
pum
314.9 94.9 t 
0.003 0.003 0.003 c 25.2 89.2 m  17.9 89.2 l  15.2 89.2 13.8 87.9 13.8 84.8 ct 
13.8 27.9 l  13.8 25.4 14.9 24.2 17.6 24.2 ct 
25.2 24.2 l  25.2 22.1 l  7.4 22.1 l  7.4 91.4 l 
25.2 91.4 l  p ef
pom
pum
342.8 94.9 t 
26.5 51.6 m  26.2 40.1 l  25.4 40.1 l  25.2 40.3 l 
24.3 40.8 24.3 40.9 24 40.9 ct 23.5 40.9 22.6 40.8 21.6 40.3 ct 
19.8 39.6 17.9 39.3 15.7 39.3 ct 9.09999 39.3 4.2 43.7 4.2 49.8 ct 
4.2 54.5 6.9 57.9 14.2 62 ct 19.1 64.7 l 
22 66.4 23.5 68.4 23.5 71.1 ct 23.5 74.79999 20.8 77.2 16.4 77.2 ct 
13.5 77.2 11 76 9.3 74.1 ct 7.6 72.1 6.7 70.1 5.7 65.29999 ct 
4.4 65.29999 l  4.4 78.6 l  5.4 78.6 l  6 77.7 6.4 77.5 7.4 77.5 ct 
8.09999 77.5 9.3 77.7 11.3 78.2 ct 13.7 78.7 15.9 79.1 17.4 79.1 ct 
24 79.1 29.4 74.1 29.4 68.2 ct 29.4 64 27.4 61.1 22.3 58.1 ct 
13.2 52.6 l  10.8 51.3 9.4 49.2 9.4 46.9 ct 
9.4 43.5 12.1 41.1 16 41.1 ct 20.8 41.1 23.3 44 25.4 51.6 ct 
p ef
pom
pum
375.9 94.9 t 
2.8 89.2 m  2.8 91.4 l  20.6 91.4 l  20.6 22.1 l 
2.8 22.1 l  2.8 24.2 l  10.1 24.2 l  12.8 24.2 14.2 25.7 14.2 28.6 ct 
14.2 85.5 l  14.2 88.2 13 89.2 10.5 89.2 ct 
p ef
pom
gr
gs
pum
558.3 1712.2 t 
0.003 0.003 0.003 c 3.3 46.7 m  3.3 39.6 4.2 33.8 5.5 29.4 ct 
7.1 25 9.3 21.6 12.1 19.3 ct 15 16.9 18.8 15.7 23.2 15.7 ct 
26.4 15.7 29.3 16.4 31.6 17.69999 ct 34.2 18.9 36.2 21 37.7 23.3 ct 
39.4 25.9 40.6 28.7 41.6 32.3 ct 42.5 35.89999 43 40.8 43 46.7 ct 
43 53.8 42.1 59.6 40.8 64 ct 39.3 68.2 37 71.6 34.2 74 ct 
31.3 76.5 27.6 77.7 23.2 77.7 ct 17.19999 77.7 12.7 75.5 9.4 71.4 ct 
5.4 66.4 l  3.3 58.1 l  p
11 46.7 m  11 56.7 12.1 63.3 14.5 66.5 ct 16.9 69.9 19.8 71.4 23.2 71.4 ct 
26.5 71.4 29.4 69.9 31.8 66.5 ct 34.2 63.3 35.2 56.7 35.2 46.7 ct 
35.2 36.7 34.2 30.1 31.8 26.9 ct 29.4 23.5 26.5 22 23 22 ct 
19.6 22 16.9 23.3 14.9 26.2 ct 12.3 29.9 l 
11 36.7 l  p ef
pom
pum
604.89999 1712.2 t 
7.6 76.7 m  7.6 68 l  16 68 l  16 76.7 l  p ef
pom
pum
628.6 1712.2 t 
42.5 69.4 m  42.5 76.7 l  2.5 76.7 l  2.3 74.79999 2.7 73.1 3.3 71.4 ct 
4.4 68.7 5.9 66 8.3 63.3 ct 10.5 60.8 13.7 57.7 17.9 54.2 ct 
24.5 48.7 28.9 44.5 31.3 41.3 ct 33.7 38.2 34.8 35.2 34.8 32.5 ct 
34.8 29.4 33.7 26.9 31.6 24.9 ct 29.4 22.8 26.7 22 23.3 22 ct 
19.8 22 16.9 23 14.7 25.2 ct 12.7 27.2 11.5 30.3 11.5 34 ct 
3.8 33.3 l  4.4 27.6 6.4 23.2 9.8 20.3 ct 
13.2 17.19999 17.69999 15.7 23.5 15.7 ct 29.3 15.7 34 17.4 37.39999 20.6 ct 
40.8 23.8 42.5 27.7 42.5 32.5 ct 42.5 35 42 37.39999 40.9 39.8 ct 
39.9 42.1 38.2 44.5 36 47 ct 33.7 49.8 29.9 53.3 24.5 57.7 ct 
20.1 61.6 17.19999 64.2 15.9 65.29999 ct 14.7 66.7 13.7 68 12.8 69.4 ct 
p ef
pom
pum
676 1712.2 t 
3.5 60.6 m  10.8 59.6 l  11.6 63.8 13.2 66.9 15.2 68.7 ct 
17.19999 70.6 19.8 71.4 22.8 71.4 ct 26.2 71.4 29.3 70.29999 31.6 67.9 ct 
34 65.5 35.2 62.5 35.2 58.9 ct 35.2 55.5 34.2 52.6 31.8 50.4 ct 
29.6 48.2 26.9 47 23.3 47 ct 22 47 20.3 47.4 18.1 47.9 ct 
18.9 41.3 l  19.4 41.5 19.8 41.5 20.1 41.5 ct 
23.3 41.5 26.2 40.6 28.7 38.9 ct 31.3 37.39999 32.5 34.8 32.5 31.3 ct 
32.5 28.6 31.6 26.4 29.8 24.5 ct 27.9 22.8 25.5 21.8 22.6 21.8 ct 
19.6 21.8 17.19999 22.8 15.4 24.5 ct 13.3 26.4 12.1 29.1 11.6 32.8 ct 
4.2 31.5 l  5 26.4 7.1 22.6 10.5 19.8 ct 
13.7 17.1 17.6 15.7 22.5 15.7 ct 25.7 15.7 28.7 16.4 31.6 17.9 ct 
34.3 19.3 36.5 21.3 37.89999 23.7 ct 39.4 26 40.1 28.7 40.1 31.5 ct 
40.1 34.2 39.4 36.5 38.1 38.6 ct 36.7 40.8 34.5 42.5 31.8 43.8 ct 
35.39999 44.7 38.2 46.4 40.1 48.9 ct 42.1 51.4 43.1 54.8 43.1 58.7 ct 
43.1 64 41.1 68.6 37.39999 72.1 ct 33.5 75.79999 28.6 77.7 22.6 77.7 ct 
17.4 77.7 13 76 9.4 73 ct 5.9 69.7 l  3.8 65.7 l 
p ef
pom
gr
gs
pum
899.6 1474 t 
0.003 0.003 0.003 c 31.5 76.7 m  24 76.7 l  24 29.1 l 
22.1 31 19.8 32.6 16.9 34.3 ct 14 36 11.5 37.2 9.09999 38.1 ct 
9.09999 31 l  13.3 28.9 16.9 26.5 19.9 23.8 ct 
23.2 21.1 25.4 18.4 26.5 15.7 ct 31.5 15.7 l 
p ef
pom
pum
946.2 1474 t 
7.6 76.7 m  7.6 68 l  16 68 l  16 76.7 l  p ef
pom
pum
969.9 1474 t 
31.5 76.7 m  24 76.7 l  24 29.1 l  22.1 31 19.8 32.6 16.9 34.3 ct 
14 36 11.5 37.2 9.09999 38.1 ct 9.09999 31 l  13.3 28.9 16.9 26.5 19.9 23.8 ct 
23.2 21.1 25.4 18.4 26.5 15.7 ct 31.5 15.7 l 
p ef
pom
pum
1017.3 1474 t 
31.5 76.7 m  24 76.7 l  24 29.1 l  22.1 31 19.8 32.6 16.9 34.3 ct 
14 36 11.5 37.2 9.09999 38.1 ct 9.09999 31 l  13.3 28.9 16.9 26.5 19.9 23.8 ct 
23.2 21.1 25.4 18.4 26.5 15.7 ct 31.5 15.7 l 
p ef
pom
gr
gs
pum
1209.1 1034.79999 t 
0.003 0.003 0.003 c 42.5 69.4 m  42.5 76.7 l  2.5 76.7 l 
2.3 74.79999 2.7 73.1 3.3 71.4 ct 4.4 68.7 5.9 66 8.3 63.3 ct 
10.5 60.8 13.7 57.7 17.9 54.2 ct 24.5 48.7 28.9 44.5 31.3 41.3 ct 
33.7 38.2 34.8 35.2 34.8 32.5 ct 34.8 29.4 33.7 26.9 31.6 24.9 ct 
29.4 22.8 26.7 22 23.3 22 ct 19.8 22 16.9 23 14.7 25.2 ct 
12.7 27.2 11.5 30.3 11.5 34 ct 3.8 33.3 l 
4.4 27.6 6.4 23.2 9.8 20.3 ct 13.2 17.19999 17.69999 15.7 23.5 15.7 ct 
29.3 15.7 34 17.4 37.39999 20.6 ct 40.8 23.8 42.5 27.7 42.5 32.5 ct 
42.5 35 42 37.39999 40.9 39.8 ct 39.9 42.1 38.2 44.5 36 47 ct 
33.7 49.8 29.9 53.3 24.5 57.7 ct 20.1 61.6 17.19999 64.2 15.9 65.29999 ct 
14.7 66.7 13.7 68 12.8 69.4 ct p ef
pom
pum
1255.7 1034.79999 t 
3.3 46.7 m  3.3 39.6 4.2 33.8 5.5 29.4 ct 
7.1 25 9.3 21.6 12.1 19.3 ct 15 16.9 18.8 15.7 23.2 15.7 ct 
26.4 15.7 29.3 16.4 31.6 17.69999 ct 34.2 18.9 36.2 21 37.7 23.3 ct 
39.4 25.9 40.6 28.7 41.6 32.3 ct 42.5 35.89999 43 40.8 43 46.7 ct 
43 53.8 42.1 59.6 40.8 64 ct 39.3 68.2 37 71.6 34.2 74 ct 
31.3 76.5 27.6 77.7 23.2 77.7 ct 17.19999 77.7 12.7 75.5 9.4 71.4 ct 
5.4 66.4 l  3.3 58.1 l  p
11 46.7 m  11 56.7 12.1 63.3 14.5 66.5 ct 16.9 69.9 19.8 71.4 23.2 71.4 ct 
26.5 71.4 29.4 69.9 31.8 66.5 ct 34.2 63.3 35.2 56.7 35.2 46.7 ct 
35.2 36.7 34.2 30.1 31.8 26.9 ct 29.4 23.5 26.5 22 23 22 ct 
19.6 22 16.9 23.3 14.9 26.2 ct 12.3 29.9 l 
11 36.7 l  p ef
pom
pum
1303.1 1034.79999 t 
7.6 76.7 m  7.6 68 l  16 68 l  16 76.7 l  p ef
pom
pum
1326.8 1034.79999 t 
3.8 23.8 m  3.8 16.69999 l  43.1 16.69999 l  43.1 22.5 l 
39.3 26.7 35.5 32.1 31.6 38.9 ct 27.9 45.7 24.9 52.8 22.8 59.9 ct 
21.3 65 20.4 70.6 19.9 76.7 ct 12.3 76.7 l 
12.5 71.79999 13.3 66 15.2 59.2 ct 16.9 52.6 19.6 46 22.8 39.8 ct 
26.2 33.5 29.8 28.2 33.5 23.8 ct p ef
pom
pum
1373.4 1034.79999 t 
42.5 69.4 m  42.5 76.7 l  2.5 76.7 l  2.3 74.79999 2.7 73.1 3.3 71.4 ct 
4.4 68.7 5.9 66 8.3 63.3 ct 10.5 60.8 13.7 57.7 17.9 54.2 ct 
24.5 48.7 28.9 44.5 31.3 41.3 ct 33.7 38.2 34.8 35.2 34.8 32.5 ct 
34.8 29.4 33.7 26.9 31.6 24.9 ct 29.4 22.8 26.7 22 23.3 22 ct 
19.8 22 16.9 23 14.7 25.2 ct 12.7 27.2 11.5 30.3 11.5 34 ct 
3.8 33.3 l  4.4 27.6 6.4 23.2 9.8 20.3 ct 
13.2 17.19999 17.69999 15.7 23.5 15.7 ct 29.3 15.7 34 17.4 37.39999 20.6 ct 
40.8 23.8 42.5 27.7 42.5 32.5 ct 42.5 35 42 37.39999 40.9 39.8 ct 
39.9 42.1 38.2 44.5 36 47 ct 33.7 49.8 29.9 53.3 24.5 57.7 ct 
20.1 61.6 17.19999 64.2 15.9 65.29999 ct 14.7 66.7 13.7 68 12.8 69.4 ct 
p ef
pom
gr
gs
pum
1907.6 1526.9 t 
0.003 0.003 0.003 c 3.3 46.7 m  3.3 39.6 4.2 33.8 5.5 29.4 ct 
7.1 25 9.3 21.6 12.1 19.3 ct 15 16.9 18.8 15.7 23.2 15.7 ct 
26.4 15.7 29.3 16.4 31.6 17.69999 ct 34.2 18.9 36.2 21 37.7 23.3 ct 
39.4 25.9 40.6 28.7 41.6 32.3 ct 42.5 35.89999 43 40.8 43 46.7 ct 
43 53.8 42.1 59.6 40.8 64 ct 39.3 68.2 37 71.6 34.2 74 ct 
31.3 76.5 27.6 77.7 23.2 77.7 ct 17.19999 77.7 12.7 75.5 9.4 71.4 ct 
5.4 66.4 l  3.3 58.1 l  p
11 46.7 m  11 56.7 12.1 63.3 14.5 66.5 ct 16.9 69.9 19.8 71.4 23.2 71.4 ct 
26.5 71.4 29.4 69.9 31.8 66.5 ct 34.2 63.3 35.2 56.7 35.2 46.7 ct 
35.2 36.7 34.2 30.1 31.8 26.9 ct 29.4 23.5 26.5 22 23 22 ct 
19.6 22 16.9 23.3 14.9 26.2 ct 12.3 29.9 l 
11 36.7 l  p ef
pom
pum
1954.2 1526.9 t 
7.6 76.7 m  7.6 68 l  16 68 l  16 76.7 l  p ef
pom
pum
1977.9 1526.9 t 
3.8 23.8 m  3.8 16.69999 l  43.1 16.69999 l  43.1 22.5 l 
39.3 26.7 35.5 32.1 31.6 38.9 ct 27.9 45.7 24.9 52.8 22.8 59.9 ct 
21.3 65 20.4 70.6 19.9 76.7 ct 12.3 76.7 l 
12.5 71.79999 13.3 66 15.2 59.2 ct 16.9 52.6 19.6 46 22.8 39.8 ct 
26.2 33.5 29.8 28.2 33.5 23.8 ct p ef
pom
pum
2025.3 1526.9 t 
42 30.8 m  34.7 31.5 l  34 28.4 33 26.4 31.8 25 ct 
29.8 23 27.2 21.8 24.3 21.8 ct 22 21.8 19.9 22.5 18.1 23.8 ct 
15.7 25.5 13.8 28.1 12.5 31.3 ct 11.1 34.7 10.5 39.3 10.5 45.3 ct 
12.3 42.6 14.5 40.6 17.1 39.3 ct 19.6 37.89999 22.3 37.2 25.2 37.2 ct 
30.1 37.2 34.3 39.1 37.89999 42.8 ct 41.3 46.4 43.1 51.1 43.1 56.9 ct 
43.1 60.8 42.3 64.29999 40.6 67.5 ct 38.9 70.79999 36.7 73.29999 33.8 75 ct 
31 76.7 27.7 77.7 24.2 77.7 ct 17.9 77.7 12.8 75.29999 8.9 70.79999 ct 
5 66.2 3 58.7 3 48.2 ct 3 36.5 5.2 28.1 9.6 22.6 ct 
13.3 18.1 18.4 15.7 24.9 15.7 ct 29.6 15.7 33.5 17.1 36.5 19.8 ct 
39.6 22.5 l  41.5 26 l  p
11.6 57 m  11.6 59.6 12.1 62 13.2 64.29999 ct 14.3 66.7 15.9 68.4 17.69999 69.7 ct 
19.8 70.9 21.8 71.4 24 71.4 ct 27.1 71.4 29.8 70.29999 32.1 67.7 ct 
34.3 65.2 35.5 61.8 35.5 57.4 ct 35.5 53.1 34.3 49.9 32.1 47.6 ct 
29.9 45 27.1 43.8 23.7 43.8 ct 20.3 43.8 17.4 45 15.2 47.6 ct 
12.8 49.9 l  11.6 53 l  p ef
pom
gr
gs
pum
2190.8 780.8 t 
0.003 0.003 0.003 c 31.5 76.7 m  24 76.7 l  24 29.1 l 
22.1 31 19.8 32.6 16.9 34.3 ct 14 36 11.5 37.2 9.09999 38.1 ct 
9.09999 31 l  13.3 28.9 16.9 26.5 19.9 23.8 ct 
23.2 21.1 25.4 18.4 26.5 15.7 ct 31.5 15.7 l 
p ef
pom
pum
2237.4 780.8 t 
31.5 76.7 m  24 76.7 l  24 29.1 l  22.1 31 19.8 32.6 16.9 34.3 ct 
14 36 11.5 37.2 9.09999 38.1 ct 9.09999 31 l  13.3 28.9 16.9 26.5 19.9 23.8 ct 
23.2 21.1 25.4 18.4 26.5 15.7 ct 31.5 15.7 l 
p ef
pom
pum
2284.8 780.8 t 
3.3 60.8 m  11.1 60.1 l  11.8 63.8 13.2 66.7 15.2 68.7 ct 
17.4 70.6 19.9 71.4 22.8 71.4 ct 26.4 71.4 29.4 70.29999 32 67.5 ct 
34.5 64.79999 35.7 61.1 35.7 56.7 ct 35.7 52.5 34.5 49.1 32.1 46.7 ct 
29.8 44.2 26.5 43 22.8 43 ct 20.3 43 18.19999 43.5 16.19999 44.7 ct 
14.3 45.7 12.8 47 11.6 48.9 ct 4.7 47.9 l 
10.6 16.69999 l  40.8 16.69999 l  40.8 23.8 l  16.6 23.8 l 
13.3 40.3 l  16.9 37.7 20.8 36.39999 24.7 36.39999 ct 
29.9 36.39999 34.5 38.2 38.1 42 ct 41.8 45.5 43.7 50.3 43.7 56 ct 
43.7 61.6 42 66.4 38.7 70.29999 ct 34.8 75.2 29.6 77.7 22.8 77.7 ct 
17.4 77.7 12.8 76.2 9.4 73 ct 5.9 69.9 l 
3.8 65.79999 l  p ef
pom
pum
2331.3 780.8 t 
7.6 76.7 m  7.6 68 l  16 68 l  16 76.7 l  p ef
pom
pum
2355.09999 780.8 t 
42.5 69.4 m  42.5 76.7 l  2.5 76.7 l  2.3 74.79999 2.7 73.1 3.3 71.4 ct 
4.4 68.7 5.9 66 8.3 63.3 ct 10.5 60.8 13.7 57.7 17.9 54.2 ct 
24.5 48.7 28.9 44.5 31.3 41.3 ct 33.7 38.2 34.8 35.2 34.8 32.5 ct 
34.8 29.4 33.7 26.9 31.6 24.9 ct 29.4 22.8 26.7 22 23.3 22 ct 
19.8 22 16.9 23 14.7 25.2 ct 12.7 27.2 11.5 30.3 11.5 34 ct 
3.8 33.3 l  4.4 27.6 6.4 23.2 9.8 20.3 ct 
13.2 17.19999 17.69999 15.7 23.5 15.7 ct 29.3 15.7 34 17.4 37.39999 20.6 ct 
40.8 23.8 42.5 27.7 42.5 32.5 ct 42.5 35 42 37.39999 40.9 39.8 ct 
39.9 42.1 38.2 44.5 36 47 ct 33.7 49.8 29.9 53.3 24.5 57.7 ct 
20.1 61.6 17.19999 64.2 15.9 65.29999 ct 14.7 66.7 13.7 68 12.8 69.4 ct 
p ef
pom
pum
2402.5 780.8 t 
3.5 60.6 m  10.8 59.6 l  11.6 63.8 13.2 66.9 15.2 68.7 ct 
17.19999 70.6 19.8 71.4 22.8 71.4 ct 26.2 71.4 29.3 70.29999 31.6 67.9 ct 
34 65.5 35.2 62.5 35.2 58.9 ct 35.2 55.5 34.2 52.6 31.8 50.4 ct 
29.6 48.2 26.9 47 23.3 47 ct 22 47 20.3 47.4 18.1 47.9 ct 
18.9 41.3 l  19.4 41.5 19.8 41.5 20.1 41.5 ct 
23.3 41.5 26.2 40.6 28.7 38.9 ct 31.3 37.39999 32.5 34.8 32.5 31.3 ct 
32.5 28.6 31.6 26.4 29.8 24.5 ct 27.9 22.8 25.5 21.8 22.6 21.8 ct 
19.6 21.8 17.19999 22.8 15.4 24.5 ct 13.3 26.4 12.1 29.1 11.6 32.8 ct 
4.2 31.5 l  5 26.4 7.1 22.6 10.5 19.8 ct 
13.7 17.1 17.6 15.7 22.5 15.7 ct 25.7 15.7 28.7 16.4 31.6 17.9 ct 
34.3 19.3 36.5 21.3 37.89999 23.7 ct 39.4 26 40.1 28.7 40.1 31.5 ct 
40.1 34.2 39.4 36.5 38.1 38.6 ct 36.7 40.8 34.5 42.5 31.8 43.8 ct 
35.39999 44.7 38.2 46.4 40.1 48.9 ct 42.1 51.4 43.1 54.8 43.1 58.7 ct 
43.1 64 41.1 68.6 37.39999 72.1 ct 33.5 75.79999 28.6 77.7 22.6 77.7 ct 
17.4 77.7 13 76 9.4 73 ct 5.9 69.7 l  3.8 65.7 l 
p ef
pom
gr
gs
pum
2508.3 339 t 
0.003 0.003 0.003 c 42.5 69.4 m  42.5 76.7 l  2.5 76.7 l 
2.3 74.79999 2.7 73.1 3.3 71.4 ct 4.4 68.7 5.9 66 8.3 63.3 ct 
10.5 60.8 13.7 57.7 17.9 54.2 ct 24.5 48.7 28.9 44.5 31.3 41.3 ct 
33.7 38.2 34.8 35.2 34.8 32.5 ct 34.8 29.4 33.7 26.9 31.6 24.9 ct 
29.4 22.8 26.7 22 23.3 22 ct 19.8 22 16.9 23 14.7 25.2 ct 
12.7 27.2 11.5 30.3 11.5 34 ct 3.8 33.3 l 
4.4 27.6 6.4 23.2 9.8 20.3 ct 13.2 17.19999 17.69999 15.7 23.5 15.7 ct 
29.3 15.7 34 17.4 37.39999 20.6 ct 40.8 23.8 42.5 27.7 42.5 32.5 ct 
42.5 35 42 37.39999 40.9 39.8 ct 39.9 42.1 38.2 44.5 36 47 ct 
33.7 49.8 29.9 53.3 24.5 57.7 ct 20.1 61.6 17.19999 64.2 15.9 65.29999 ct 
14.7 66.7 13.7 68 12.8 69.4 ct p ef
pom
pum
2554.9 339 t 
31.5 76.7 m  24 76.7 l  24 29.1 l  22.1 31 19.8 32.6 16.9 34.3 ct 
14 36 11.5 37.2 9.09999 38.1 ct 9.09999 31 l  13.3 28.9 16.9 26.5 19.9 23.8 ct 
23.2 21.1 25.4 18.4 26.5 15.7 ct 31.5 15.7 l 
p ef
pom
pum
2602.3 339 t 
3.3 60.8 m  11.1 60.1 l  11.8 63.8 13.2 66.7 15.2 68.7 ct 
17.4 70.6 19.9 71.4 22.8 71.4 ct 26.4 71.4 29.4 70.29999 32 67.5 ct 
34.5 64.79999 35.7 61.1 35.7 56.7 ct 35.7 52.5 34.5 49.1 32.1 46.7 ct 
29.8 44.2 26.5 43 22.8 43 ct 20.3 43 18.19999 43.5 16.19999 44.7 ct 
14.3 45.7 12.8 47 11.6 48.9 ct 4.7 47.9 l 
10.6 16.69999 l  40.8 16.69999 l  40.8 23.8 l  16.6 23.8 l 
13.3 40.3 l  16.9 37.7 20.8 36.39999 24.7 36.39999 ct 
29.9 36.39999 34.5 38.2 38.1 42 ct 41.8 45.5 43.7 50.3 43.7 56 ct 
43.7 61.6 42 66.4 38.7 70.29999 ct 34.8 75.2 29.6 77.7 22.8 77.7 ct 
17.4 77.7 12.8 76.2 9.4 73 ct 5.9 69.9 l 
3.8 65.79999 l  p ef
pom
pum
2648.8 339 t 
3.3 60.8 m  11.1 60.1 l  11.8 63.8 13.2 66.7 15.2 68.7 ct 
17.4 70.6 19.9 71.4 22.8 71.4 ct 26.4 71.4 29.4 70.29999 32 67.5 ct 
34.5 64.79999 35.7 61.1 35.7 56.7 ct 35.7 52.5 34.5 49.1 32.1 46.7 ct 
29.8 44.2 26.5 43 22.8 43 ct 20.3 43 18.19999 43.5 16.19999 44.7 ct 
14.3 45.7 12.8 47 11.6 48.9 ct 4.7 47.9 l 
10.6 16.69999 l  40.8 16.69999 l  40.8 23.8 l  16.6 23.8 l 
13.3 40.3 l  16.9 37.7 20.8 36.39999 24.7 36.39999 ct 
29.9 36.39999 34.5 38.2 38.1 42 ct 41.8 45.5 43.7 50.3 43.7 56 ct 
43.7 61.6 42 66.4 38.7 70.29999 ct 34.8 75.2 29.6 77.7 22.8 77.7 ct 
17.4 77.7 12.8 76.2 9.4 73 ct 5.9 69.9 l 
3.8 65.79999 l  p ef
pom
pum
2696.3 339 t 
7.6 76.7 m  7.6 68 l  16 68 l  16 76.7 l  p ef
pom
pum
2720 339 t 
3.8 23.8 m  3.8 16.69999 l  43.1 16.69999 l  43.1 22.5 l 
39.3 26.7 35.5 32.1 31.6 38.9 ct 27.9 45.7 24.9 52.8 22.8 59.9 ct 
21.3 65 20.4 70.6 19.9 76.7 ct 12.3 76.7 l 
12.5 71.79999 13.3 66 15.2 59.2 ct 16.9 52.6 19.6 46 22.8 39.8 ct 
26.2 33.5 29.8 28.2 33.5 23.8 ct p ef
pom
pum
2766.5 339 t 
3.3 46.7 m  3.3 39.6 4.2 33.8 5.5 29.4 ct 
7.1 25 9.3 21.6 12.1 19.3 ct 15 16.9 18.8 15.7 23.2 15.7 ct 
26.4 15.7 29.3 16.4 31.6 17.69999 ct 34.2 18.9 36.2 21 37.7 23.3 ct 
39.4 25.9 40.6 28.7 41.6 32.3 ct 42.5 35.89999 43 40.8 43 46.7 ct 
43 53.8 42.1 59.6 40.8 64 ct 39.3 68.2 37 71.6 34.2 74 ct 
31.3 76.5 27.6 77.7 23.2 77.7 ct 17.19999 77.7 12.7 75.5 9.4 71.4 ct 
5.4 66.4 l  3.3 58.1 l  p
11 46.7 m  11 56.7 12.1 63.3 14.5 66.5 ct 16.9 69.9 19.8 71.4 23.2 71.4 ct 
26.5 71.4 29.4 69.9 31.8 66.5 ct 34.2 63.3 35.2 56.7 35.2 46.7 ct 
35.2 36.7 34.2 30.1 31.8 26.9 ct 29.4 23.5 26.5 22 23 22 ct 
19.6 22 16.9 23.3 14.9 26.2 ct 12.3 29.9 l 
11 36.7 l  p ef
pom
gr
gr
0 1969 t 
pom
count op_count sub {pop} repeat countdictstack dict_count sub {end} repeat b4_inc_state restore
%%PageTrailer
%%Trailer
%%EOF
