#FIG 3.2
Landscape
Center
Inches
Letter  
100.00
Single
-2
1200 2
2 2 0 1 0 7 50 0 -1 0.000 0 0 -1 0 0 5
	 1125 1050 1500 1050 1500 1425 1125 1425 1125 1050
2 2 0 1 0 7 50 0 -1 0.000 0 0 -1 0 0 5
	 375 1050 1125 1050 1125 1425 375 1425 375 1050
2 2 0 1 0 7 50 0 0 0.000 0 0 -1 0 0 5
	 1500 1050 2625 1050 2625 1425 1500 1425 1500 1050
2 1 0 1 0 7 50 0 0 0.000 0 0 -1 0 0 2
	 1275 1200 1275 750
2 1 0 1 0 7 50 0 0 0.000 0 0 -1 0 0 2
	 1650 1725 1650 1275
2 2 0 1 0 7 50 0 -1 0.000 0 0 -1 0 0 5
	 2625 1050 3375 1050 3375 1425 2625 1425 2625 1050
2 2 0 1 0 7 50 0 -1 0.000 0 0 -1 0 0 5
	 3375 2700 4125 2700 4125 3075 3375 3075 3375 2700
2 2 0 1 0 7 50 0 -1 0.000 0 0 -1 0 0 5
	 4125 1050 4875 1050 4875 1425 4125 1425 4125 1050
2 2 0 1 0 7 50 0 0 0.000 0 0 -1 0 0 5
	 4875 1050 5250 1050 5250 1425 4875 1425 4875 1050
2 2 0 1 0 7 50 0 -1 0.000 0 0 -1 0 0 5
	 5250 1050 5625 1050 5625 1425 5250 1425 5250 1050
2 2 0 1 0 7 50 0 -1 0.000 0 0 -1 0 0 5
	 5625 1050 6375 1050 6375 1425 5625 1425 5625 1050
2 1 0 1 0 7 50 0 0 0.000 0 0 -1 0 0 2
	 3750 3375 3750 2925
2 1 0 1 0 7 50 0 0 0.000 0 0 -1 0 0 2
	 5025 1725 5025 1275
2 1 0 1 0 7 50 0 0 0.000 0 0 -1 0 0 2
	 5400 1200 5400 750
2 1 1 1 0 7 50 0 -1 4.000 0 0 -1 0 0 2
	 3375 1425 3375 2700
2 1 1 1 0 7 50 0 -1 4.000 0 0 -1 0 0 2
	 4125 1425 4125 2700
4 0 0 50 0 0 12 0.0000 4 180 1680 1125 675 cause loading of class\001
4 0 0 50 0 0 12 0.0000 4 180 3435 4425 675 finish instruction that caused loading of class\001
4 0 0 50 0 0 12 0.0000 4 135 1260 4950 1950 set context back\001
4 0 0 50 0 0 12 0.0000 4 135 2250 900 2175 set context to class initializer\001
4 0 0 50 0 0 12 0.0000 4 135 1080 900 1950 load class and\001
4 0 0 50 0 0 12 0.0000 4 135 1395 3675 3600 access static field\001
4 0 0 50 0 0 12 0.0000 4 135 1035 2250 2625 thread switch\001
