%!PS-Adobe-2.0 EPSF-2.0
%%Title: /home/zboris/semesterarbeit/doku/netopenclose.fig
%%Creator: fig2dev Version 3.2 Patchlevel 4
%%CreationDate: Sun Mar 20 21:10:42 2005
%%For: zboris@linux (Boris Z.)
%%BoundingBox: 0 0 248 273
%%Magnification: 1.0000
%%EndComments
/$F2psDict 200 dict def
$F2psDict begin
$F2psDict /mtrx matrix put
/col-1 {0 setgray} bind def
/col0 {0.000 0.000 0.000 srgb} bind def
/col1 {0.000 0.000 1.000 srgb} bind def
/col2 {0.000 1.000 0.000 srgb} bind def
/col3 {0.000 1.000 1.000 srgb} bind def
/col4 {1.000 0.000 0.000 srgb} bind def
/col5 {1.000 0.000 1.000 srgb} bind def
/col6 {1.000 1.000 0.000 srgb} bind def
/col7 {1.000 1.000 1.000 srgb} bind def
/col8 {0.000 0.000 0.560 srgb} bind def
/col9 {0.000 0.000 0.690 srgb} bind def
/col10 {0.000 0.000 0.820 srgb} bind def
/col11 {0.530 0.810 1.000 srgb} bind def
/col12 {0.000 0.560 0.000 srgb} bind def
/col13 {0.000 0.690 0.000 srgb} bind def
/col14 {0.000 0.820 0.000 srgb} bind def
/col15 {0.000 0.560 0.560 srgb} bind def
/col16 {0.000 0.690 0.690 srgb} bind def
/col17 {0.000 0.820 0.820 srgb} bind def
/col18 {0.560 0.000 0.000 srgb} bind def
/col19 {0.690 0.000 0.000 srgb} bind def
/col20 {0.820 0.000 0.000 srgb} bind def
/col21 {0.560 0.000 0.560 srgb} bind def
/col22 {0.690 0.000 0.690 srgb} bind def
/col23 {0.820 0.000 0.820 srgb} bind def
/col24 {0.500 0.190 0.000 srgb} bind def
/col25 {0.630 0.250 0.000 srgb} bind def
/col26 {0.750 0.380 0.000 srgb} bind def
/col27 {1.000 0.500 0.500 srgb} bind def
/col28 {1.000 0.630 0.630 srgb} bind def
/col29 {1.000 0.750 0.750 srgb} bind def
/col30 {1.000 0.880 0.880 srgb} bind def
/col31 {1.000 0.840 0.000 srgb} bind def

end
save
newpath 0 273 moveto 0 0 lineto 248 0 lineto 248 273 lineto closepath clip newpath
-258.1 426.4 translate
1 -1 scale

/cp {closepath} bind def
/ef {eofill} bind def
/gr {grestore} bind def
/gs {gsave} bind def
/sa {save} bind def
/rs {restore} bind def
/l {lineto} bind def
/m {moveto} bind def
/rm {rmoveto} bind def
/n {newpath} bind def
/s {stroke} bind def
/sh {show} bind def
/slc {setlinecap} bind def
/slj {setlinejoin} bind def
/slw {setlinewidth} bind def
/srgb {setrgbcolor} bind def
/rot {rotate} bind def
/sc {scale} bind def
/sd {setdash} bind def
/ff {findfont} bind def
/sf {setfont} bind def
/scf {scalefont} bind def
/sw {stringwidth} bind def
/tr {translate} bind def
/tnt {dup dup currentrgbcolor
  4 -2 roll dup 1 exch sub 3 -1 roll mul add
  4 -2 roll dup 1 exch sub 3 -1 roll mul add
  4 -2 roll dup 1 exch sub 3 -1 roll mul add srgb}
  bind def
/shd {dup dup currentrgbcolor 4 -2 roll mul 4 -2 roll mul
  4 -2 roll mul srgb} bind def
 /DrawEllipse {
	/endangle exch def
	/startangle exch def
	/yrad exch def
	/xrad exch def
	/y exch def
	/x exch def
	/savematrix mtrx currentmatrix def
	x y tr xrad yrad sc 0 0 1 startangle endangle arc
	closepath
	savematrix setmatrix
	} def

/$F2psBegin {$F2psDict begin /$F2psEnteredState save def} def
/$F2psEnd {$F2psEnteredState restore end} def

$F2psBegin
10 setmiterlimit
0 slj 0 slc
 0.06299 0.06299 sc
%
% Fig objects follow
%
% 
% here starts figure with depth 50
% Ellipse
7.500 slw
n 7110 6660 101 101 0 360 DrawEllipse gs col0 s gr

% Polyline
n 5460 6300 m 5355 6300 5355 6555 105 arcto 4 {pop} repeat
  5355 6660 5790 6660 105 arcto 4 {pop} repeat
  5895 6660 5895 6405 105 arcto 4 {pop} repeat
  5895 6300 5460 6300 105 arcto 4 {pop} repeat
 cp gs col0 s gr 
% Polyline
gs  clippath
4110 6720 m 4170 6720 l 4170 6569 l 4140 6689 l 4110 6569 l cp
eoclip
n 4140 6300 m
 4140 6705 l gs col0 s gr gr

% arrowhead
n 4110 6569 m 4140 6689 l 4170 6569 l 4110 6569 l  cp gs 0.00 setgray ef gr  col0 s
% Polyline
gs  clippath
7140 6240 m 7080 6240 l 7080 6391 l 7110 6271 l 7140 6391 l cp
eoclip
n 7110 6525 m
 7110 6255 l gs col0 s gr gr

% arrowhead
n 7140 6391 m 7110 6271 l 7080 6391 l 7140 6391 l  cp gs 0.00 setgray ef gr  col0 s
/Helvetica ff 180.00 scf sf
6030 6570 m
gs 1 -1 sc (Milestone) col0 sh gr
/Helvetica ff 180.00 scf sf
4320 6570 m
gs 1 -1 sc (Execution) col0 sh gr
/Helvetica ff 180.00 scf sf
7290 6570 m
gs 1 -1 sc (Rollback) col0 sh gr
% Arc
gs  clippath
5027 4867 m 4981 4829 l 4885 4945 l 4985 4872 l 4931 4983 l cp
eoclip
n 5440.1 5316.1 637.3 101.8 -134.3 arc
gs col0 s gr
 gr

% arrowhead
n 4931 4983 m 4985 4872 l 4885 4945 l 4931 4983 l  cp gs 0.00 setgray ef gr  col0 s
% Arc
gs  clippath
5027 3654 m 4983 3613 l 4879 3723 l 4984 3657 l 4923 3765 l cp
eoclip
n 5542.5 4252.5 817.8 132.0 -132.0 arc
gs col0 s gr
 gr

% arrowhead
n 4923 3765 m 4984 3657 l 4879 3723 l 4923 3765 l  cp gs 0.00 setgray ef gr  col0 s
% Arc
gs  clippath
5775 3539 m 5810 3588 l 5932 3498 l 5818 3545 l 5896 3449 l cp
eoclip
n 6425.9 4280.4 954.9 2.4 -130.6 arcn
gs col0 s gr
 gr

% arrowhead
n 5896 3449 m 5818 3545 l 5932 3498 l 5896 3449 l  cp gs 0.00 setgray ef gr  col0 s
% Ellipse
n 5400 5940 101 101 0 360 DrawEllipse gs col0 s gr

% Ellipse
n 7425 4410 101 101 0 360 DrawEllipse gs col0 s gr

% Polyline
gs  clippath
5370 4650 m 5430 4650 l 5430 4499 l 5400 4619 l 5370 4499 l cp
eoclip
n 5400 3870 m
 5400 4635 l gs col0 s gr gr

% arrowhead
n 5370 4499 m 5400 4619 l 5430 4499 l 5370 4499 l  cp gs 0.00 setgray ef gr  col0 s
% Polyline
gs  clippath
5370 5865 m 5430 5865 l 5430 5714 l 5400 5834 l 5370 5714 l cp
eoclip
n 5400 5085 m
 5400 5850 l gs col0 s gr gr

% arrowhead
n 5370 5714 m 5400 5834 l 5430 5714 l 5370 5714 l  cp gs 0.00 setgray ef gr  col0 s
% Polyline
gs  clippath
5370 3435 m 5430 3435 l 5430 3284 l 5400 3404 l 5370 3284 l cp
eoclip
n 5400 2655 m
 5400 3420 l gs col0 s gr gr

% arrowhead
n 5370 3284 m 5400 3404 l 5430 3284 l 5370 3284 l  cp gs 0.00 setgray ef gr  col0 s
% Polyline
n 5100 3420 m 4995 3420 4995 3765 105 arcto 4 {pop} repeat
  4995 3870 5700 3870 105 arcto 4 {pop} repeat
  5805 3870 5805 3525 105 arcto 4 {pop} repeat
  5805 3420 5100 3420 105 arcto 4 {pop} repeat
 cp gs col0 s gr 
% Polyline
n 5100 4635 m 4995 4635 4995 4980 105 arcto 4 {pop} repeat
  4995 5085 5700 5085 105 arcto 4 {pop} repeat
  5805 5085 5805 4740 105 arcto 4 {pop} repeat
  5805 4635 5100 4635 105 arcto 4 {pop} repeat
 cp gs col0 s gr 
% Polyline
gs  clippath
7292 4398 m 7315 4343 l 7176 4284 l 7275 4359 l 7152 4339 l cp
eoclip
n 5805 3735 m
 7290 4365 l gs col0 s gr gr

% arrowhead
n 7152 4339 m 7275 4359 l 7176 4284 l 7152 4339 l  cp gs 0.00 setgray ef gr  col0 s
/Helvetica ff 180.00 scf sf
5175 2565 m
gs 1 -1 sc (Start) col0 sh gr
/Helvetica ff 180.00 scf sf
5445 4410 m
gs 1 -1 sc (close\(x\)) col0 sh gr
/Helvetica ff 180.00 scf sf
5445 3015 m
gs 1 -1 sc (open\(x\)) col0 sh gr
/Helvetica ff 180.00 scf sf
5445 5580 m
gs 1 -1 sc (open\(z\)) col0 sh gr
/Helvetica ff 180.00 scf sf
6480 3960 m
gs 1 -1 sc (close\(x\)) col0 sh gr
/Helvetica ff 180.00 scf sf
6255 4140 m
gs 1 -1 sc (1.) col0 sh gr
/Helvetica ff 180.00 scf sf
6840 3330 m
gs 1 -1 sc (2.) col0 sh gr
/Helvetica ff 180.00 scf sf
5220 4185 m
gs 1 -1 sc (3.) col0 sh gr
/Helvetica ff 180.00 scf sf
5220 5355 m
gs 1 -1 sc (4.) col0 sh gr
/Helvetica ff 180.00 scf sf
4680 5625 m
gs 1 -1 sc (5.) col0 sh gr
/Helvetica ff 180.00 scf sf
4545 4275 m
gs 1 -1 sc (6.) col0 sh gr
/Helvetica ff 180.00 scf sf
5220 3690 m
gs 1 -1 sc (MS1) col0 sh gr
/Helvetica ff 180.00 scf sf
5220 4905 m
gs 1 -1 sc (MS2) col0 sh gr
% here ends figure;
$F2psEnd
rs
showpage
