%!PS-Adobe-2.0 EPSF-2.0
%%Title: lock-lockmgr.dia
%%Creator: Dia v0.90
%%CreationDate: Mon Feb 10 10:37:09 2003
%%For: pascal
%%Magnification: 1.0000
%%Orientation: Portrait
%%BoundingBox: 0 0 565 377
%%Pages: 1
%%EndComments
%%BeginProlog
/cp {closepath} bind def
/c {curveto} bind def
/f {fill} bind def
/a {arc} bind def
/ef {eofill} bind def
/ex {exch} bind def
/gr {grestore} bind def
/gs {gsave} bind def
/sa {save} bind def
/rs {restore} bind def
/l {lineto} bind def
/m {moveto} bind def
/rm {rmoveto} bind def
/n {newpath} bind def
/s {stroke} bind def
/sh {show} bind def
/slc {setlinecap} bind def
/slj {setlinejoin} bind def
/slw {setlinewidth} bind def
/srgb {setrgbcolor} bind def
/rot {rotate} bind def
/sc {scale} bind def
/sd {setdash} bind def
/ff {findfont} bind def
/sf {setfont} bind def
/scf {scalefont} bind def
/sw {stringwidth pop} bind def
/tr {translate} bind def

/ellipsedict 8 dict def
ellipsedict /mtrx matrix put
/ellipse
{ ellipsedict begin
   /endangle exch def
   /startangle exch def
   /yrad exch def
   /xrad exch def
   /y exch def
   /x exch def   /savematrix mtrx currentmatrix def
   x y tr xrad yrad sc
   0 0 1 startangle endangle arc
   savematrix setmatrix
   end
} def

/mergeprocs {
dup length
3 -1 roll
dup
length
dup
5 1 roll
3 -1 roll
add
array cvx
dup
3 -1 roll
0 exch
putinterval
dup
4 2 roll
putinterval
} bind def
%%EndProlog

%%BeginSetup
%%EndSetup
28.346000 -28.346000 scale
-7.324000 -15.880000 translate

1.000000 1.000000 1.000000 srgb
n 8.490800 2.650000 m 8.490800 4.550000 l 18.109200 4.550000 l 18.109200 2.650000 l f
0.100000 slw
[] 0 sd
[] 0 sd
0 slj
0.000000 0.000000 0.000000 srgb
n 8.490800 2.650000 m 8.490800 4.550000 l 18.109200 4.550000 l 18.109200 2.650000 l cp s
 [ /xi /xi /xi /xi /xi /xi /xi /xi /xi /xi /xi /xi /xi /xi /xi /xi
 /xi /xi /xi /xi /xi /xi /xi /xi /xi /xi /xi /xi /xi /xi /xi /xi
 /J /N /u /k /e /L /o /c /xi /xi /M /a /n /g /r /i
 /s /t /period /T /h /d /one /w /zero /xi /xi /xi /xi /xi /xi /xi
 /xi /xi /xi /xi /xi /xi /xi /xi /xi /xi /xi /xi /xi /xi /xi /xi
 /xi /xi /xi /xi /xi /xi /xi /xi /xi /xi /xi /xi /xi /xi /xi /xi
 /xi /xi /xi /xi /xi /xi /xi /xi /xi /xi /xi /xi /xi /xi /xi /xi
 /xi /xi /xi /xi /xi /xi /xi /xi /xi /xi /xi /xi /xi /xi /xi /xi
 /xi /xi /xi /xi /xi /xi /xi /xi /xi /xi /xi /xi /xi /xi /xi /xi
 /xi /xi /xi /xi /xi /xi /xi /xi /xi /xi /xi /xi /xi /xi /xi /xi
 /xi /xi /xi /xi /xi /xi /xi /xi /xi /xi /xi /xi /xi /xi /xi /xi
 /xi /xi /xi /xi /xi /xi /xi /xi /xi /xi /xi /xi /xi /xi /xi /xi
 /xi /xi /xi /xi /xi /xi /xi /xi /xi /xi /xi /xi /xi /xi /xi /xi
 /xi /xi /xi /xi /xi /xi /xi /xi /xi /xi /xi /xi /xi /xi /xi /xi
 /xi /xi /xi /xi /xi /xi /xi /xi /xi /xi /xi /xi /xi /xi /xi /xi
 /xi /xi /xi /xi /xi /xi /xi /xi /xi /xi /xi /xi /xi /xi /xi /xi
] /e0 exch def
/Courier_e0 undefinefont
/Courier_e0
  /Courier findfont
  dup length dict begin
  {1 index /FID ne {def} {pop pop} ifelse} forall
  /Encoding e0 def
  currentdict end
definefont pop
/Courier_e0 ff 0.800000 scf sf
( !"#$%&'#*+,+-$.) sw
2 div 13.300000 ex sub 3.796491 m ( !"#$%&'#*+,+-$.)
 gs 1 -1 sc sh gr
1.000000 1.000000 1.000000 srgb
n 7.374000 9.450000 m 7.374000 11.350000 l 13.226000 11.350000 l 13.226000 9.450000 l f
0.100000 slw
[] 0 sd
[] 0 sd
0 slj
0.000000 0.000000 0.000000 srgb
n 7.374000 9.450000 m 7.374000 11.350000 l 13.226000 11.350000 l 13.226000 9.450000 l cp s
/Courier_e0 ff 0.800000 scf sf
( !"#$%&'#) sw
2 div 10.300000 ex sub 10.596491 m ( !"#$%&'#)
 gs 1 -1 sc sh gr
0.100000 slw
[] 0 sd
0 slj
0 slc
n 10.305000 13.930000 m 10.305000 13.050000 l 10.300000 13.050000 l 10.300000 11.350000 l s
0.100000 slw
[] 0 sd
0 slj
0 slc
n 10.700000 12.150000 m 10.300000 11.350000 l 9.900000 12.150000 l s
/Courier_e0 ff 0.800000 scf sf
(/,01+,'$) sw
2 div 12.837600 ex sub 13.610000 m (/,01+,'$)
 gs 1 -1 sc sh gr
0.717647 0.717647 0.717647 srgb
n 10.030000 13.930000 m 10.030000 15.830000 l 11.130000 15.830000 l 11.130000 13.930000 l f
0.100000 slw
[] 0 sd
[] 0 sd
0 slj
0.000000 0.000000 0.000000 srgb
n 10.030000 13.930000 m 10.030000 15.830000 l 11.130000 15.830000 l 11.130000 13.930000 l cp s
1.000000 1.000000 1.000000 srgb
n 11.199200 13.930000 m 11.199200 15.830000 l 14.587200 15.830000 l 14.587200 13.930000 l f
0.100000 slw
[] 0 sd
[] 0 sd
0 slj
0.000000 0.000000 0.000000 srgb
n 11.199200 13.930000 m 11.199200 15.830000 l 14.587200 15.830000 l 14.587200 13.930000 l cp s
/Courier_e0 ff 0.800000 scf sf
(22222) sw
2 div 12.893200 ex sub 15.076491 m (22222)
 gs 1 -1 sc sh gr
1.000000 1.000000 1.000000 srgb
n 20.228400 11.400000 m 20.228400 13.300000 l 27.171600 13.300000 l 27.171600 11.400000 l f
0.100000 slw
[] 0 sd
[] 0 sd
0 slj
0.000000 0.000000 0.000000 srgb
n 20.228400 11.400000 m 20.228400 13.300000 l 27.171600 13.300000 l 27.171600 11.400000 l cp s
/Courier_e0 ff 0.800000 scf sf
( !"#$34.$+5) sw
2 div 23.700000 ex sub 12.546491 m ( !"#$34.$+5)
 gs 1 -1 sc sh gr
0.100000 slw
[] 0 sd
0 slj
0 slc
n 10.300000 9.450000 m 10.300000 7.300000 l 13.300000 7.300000 l 13.300000 4.550000 l s
[] 0 sd
0 slj
0 slc
n 13.300000 4.550000 m 13.540000 5.250000 l 13.300000 5.950000 l 13.060000 5.250000 l f
10.300000 10.046491 m /Courier_e0 ff 0.800000 scf sf
(,)
 gs 1 -1 sc sh gr
13.300000 5.146491 m (6)
 gs 1 -1 sc sh gr
0.100000 slw
[] 0 sd
0 slj
0 slc
n 13.300000 10.200000 m 13.300000 10.300000 l 23.700000 10.300000 l 23.700000 11.400000 l s
/Courier_e0 ff 0.800000 scf sf
(&7,$.) sw
2 div 18.500000 ex sub 10.096491 m (&7,$.)
 gs 1 -1 sc sh gr
13.300000 10.796491 m (,)
 gs 1 -1 sc sh gr
23.700000 11.196491 m (8226)
 gs 1 -1 sc sh gr
0.100000 slw
[] 0 sd
0 slj
0 slc
n 11.763000 9.450000 m 11.763000 8.100000 l 26.224000 8.100000 l 26.224000 11.400000 l s
/Courier_e0 ff 0.800000 scf sf
(7+/1%/01) sw
2 div 18.993500 ex sub 7.896491 m (7+/1%/01)
 gs 1 -1 sc sh gr
11.763000 10.046491 m (6)
 gs 1 -1 sc sh gr
26.224000 11.196491 m (,)
 gs 1 -1 sc sh gr
showpage
