#FIG 3.2
Landscape
Center
Inches
A4      
100.00
Single
-2
1200 2
6 1200 1950 3750 3075
6 1350 2100 3600 2925
4 1 0 50 0 16 24 0.0000 4 285 1380 2475 2850 program\001
4 1 0 50 0 16 24 0.0000 4 285 2205 2475 2400 Instrumented\001
-6
2 4 0 1 0 7 50 0 -1 0.000 0 0 7 0 0 5
	 3750 3075 3750 1950 1200 1950 1200 3075 3750 3075
-6
6 5400 1950 9750 3075
6 5700 2100 6750 2400
4 1 0 50 0 16 24 0.0000 4 285 960 6225 2400 Event\001
-6
2 1 0 1 0 7 50 0 -1 0.000 0 0 -1 0 0 2
	 7125 1950 7125 3075
2 4 0 1 0 7 50 0 -1 0.000 0 0 7 0 0 5
	 9750 3075 9750 1950 5400 1950 5400 3075 9750 3075
4 1 0 50 0 16 24 0.0000 4 360 2250 8475 2625 Interpretation\001
4 1 0 50 0 16 24 0.0000 4 360 1335 6225 2850 analysis\001
-6
2 1 0 2 0 7 50 0 -1 0.000 0 0 -1 1 0 2
	1 1 2.00 180.00 240.00
	 3750 2550 5400 2550
4 1 0 50 0 16 24 0.0000 4 285 1140 4575 2325 Events\001
4 1 0 50 0 16 24 0.0000 4 285 1515 7575 1725 Observer\001
