ViewX_Y.<init>:10:Write access to field ViewX_Y.coord by thread 0 (holding 0 locks)
ViewX_Y.<init>:10:Write access to field ViewX_Y.coord by thread 0 (holding 0 locks)
ViewX_Y.run:14:Read access to field ViewX_Y.coord by thread 1 (holding 0 locks)
Coord.setX:28:monitorenter by thread 1
Coord.setX:29:Write access to field Coord.x by thread 1 (holding 1 locks: Coord)
ViewX_Y.run:15:Read access to field ViewX_Y.coord by thread 1 (holding 0 locks)
Coord.setY:34:monitorenter by thread 1
Coord.setY:34:Write access to field Coord.y by thread 1 (holding 1 locks: Coord)
ViewX_Y.run:14:Read access to field ViewX_Y.coord by thread 2 (holding 0 locks)
Coord.setX:28:monitorenter by thread 2
Coord.setX:29:Write access to field Coord.x by thread 2 (holding 1 locks: Coord)
ViewX_Y.run:15:Read access to field ViewX_Y.coord by thread 2 (holding 0 locks)
Coord.setY:34:monitorenter by thread 2
Coord.setY:34:Write access to field Coord.y by thread 2 (holding 1 locks: Coord)
