%!PS-Adobe-2.0 EPSF-2.0
%%Title: /afs/ethz.ch/users/c/cartho/ethz/thesis/jnuke~/design/classes.dia
%%Creator: Dia v0.88.1
%%CreationDate: Tue Aug  7 13:42:39 2001
%%For: a user
%%Magnification: 1.0000
%%Orientation: Portrait
%%BoundingBox: 0 0 473 534
%%Pages: 1
%%BeginSetup
%%EndSetup
%%EndComments
%%BeginProlog
[ /.notdef /.notdef /.notdef /.notdef /.notdef /.notdef /.notdef /.notdef /.notdef /.notdef
/.notdef /.notdef /.notdef /.notdef /.notdef /.notdef /.notdef /.notdef /.notdef /.notdef
/.notdef /.notdef /.notdef /.notdef /.notdef /.notdef /.notdef /.notdef /.notdef /.notdef
/.notdef /.notdef /space /exclam /quotedbl /numbersign /dollar /percent /ampersand /quoteright
/parenleft /parenright /asterisk /plus /comma /hyphen /period /slash /zero /one
/two /three /four /five /six /seven /eight /nine /colon /semicolon
/less /equal /greater /question /at /A /B /C /D /E
/F /G /H /I /J /K /L /M /N /O
/P /Q /R /S /T /U /V /W /X /Y
/Z /bracketleft /backslash /bracketright /asciicircum /underscore /quoteleft /a /b /c
/d /e /f /g /h /i /j /k /l /m
/n /o /p /q /r /s /t /u /v /w
/x /y /z /braceleft /bar /braceright /asciitilde /.notdef /.notdef /.notdef
/.notdef /.notdef /.notdef /.notdef /.notdef /.notdef /.notdef /.notdef /.notdef /.notdef
/.notdef /.notdef /.notdef /.notdef /.notdef /.notdef /.notdef /.notdef /.notdef /.notdef
/.notdef /.notdef /.notdef /.notdef /.notdef /.notdef /.notdef /.notdef /.notdef /.notdef
/space /exclamdown /cent /sterling /currency /yen /brokenbar /section /dieresis /copyright
/ordfeminine /guillemotleft /logicalnot /hyphen /registered /macron /degree /plusminus /twosuperior /threesuperior
/acute /mu /paragraph /periodcentered /cedilla /onesuperior /ordmasculine /guillemotright /onequarter /onehalf
/threequarters /questiondown /Agrave /Aacute /Acircumflex /Atilde /Adieresis /Aring /AE /Ccedilla
/Egrave /Eacute /Ecircumflex /Edieresis /Igrave /Iacute /Icircumflex /Idieresis /Eth /Ntilde
/Ograve /Oacute /Ocircumflex /Otilde /Odieresis /multiply /Oslash /Ugrave /Uacute /Ucircumflex
/Udieresis /Yacute /Thorn /germandbls /agrave /aacute /acircumflex /atilde /adieresis /aring
/ae /ccedilla /egrave /eacute /ecircumflex /edieresis /igrave /iacute /icircumflex /idieresis
/eth /ntilde /ograve /oacute /ocircumflex /otilde /odieresis /divide /oslash /ugrave
/uacute /ucircumflex /udieresis /yacute /thorn /ydieresis] /isolatin1encoding exch def
/Times-Roman-latin1
    /Times-Roman findfont
    dup length dict begin
	{1 index /FID ne {def} {pop pop} ifelse} forall
	/Encoding isolatin1encoding def
    currentdict end
definefont pop
/Times-Italic-latin1
    /Times-Italic findfont
    dup length dict begin
	{1 index /FID ne {def} {pop pop} ifelse} forall
	/Encoding isolatin1encoding def
    currentdict end
definefont pop
/Times-Bold-latin1
    /Times-Bold findfont
    dup length dict begin
	{1 index /FID ne {def} {pop pop} ifelse} forall
	/Encoding isolatin1encoding def
    currentdict end
definefont pop
/Times-BoldItalic-latin1
    /Times-BoldItalic findfont
    dup length dict begin
	{1 index /FID ne {def} {pop pop} ifelse} forall
	/Encoding isolatin1encoding def
    currentdict end
definefont pop
/AvantGarde-Book-latin1
    /AvantGarde-Book findfont
    dup length dict begin
	{1 index /FID ne {def} {pop pop} ifelse} forall
	/Encoding isolatin1encoding def
    currentdict end
definefont pop
/AvantGarde-BookOblique-latin1
    /AvantGarde-BookOblique findfont
    dup length dict begin
	{1 index /FID ne {def} {pop pop} ifelse} forall
	/Encoding isolatin1encoding def
    currentdict end
definefont pop
/AvantGarde-Demi-latin1
    /AvantGarde-Demi findfont
    dup length dict begin
	{1 index /FID ne {def} {pop pop} ifelse} forall
	/Encoding isolatin1encoding def
    currentdict end
definefont pop
/AvantGarde-DemiOblique-latin1
    /AvantGarde-DemiOblique findfont
    dup length dict begin
	{1 index /FID ne {def} {pop pop} ifelse} forall
	/Encoding isolatin1encoding def
    currentdict end
definefont pop
/Bookman-Light-latin1
    /Bookman-Light findfont
    dup length dict begin
	{1 index /FID ne {def} {pop pop} ifelse} forall
	/Encoding isolatin1encoding def
    currentdict end
definefont pop
/Bookman-LightItalic-latin1
    /Bookman-LightItalic findfont
    dup length dict begin
	{1 index /FID ne {def} {pop pop} ifelse} forall
	/Encoding isolatin1encoding def
    currentdict end
definefont pop
/Bookman-Demi-latin1
    /Bookman-Demi findfont
    dup length dict begin
	{1 index /FID ne {def} {pop pop} ifelse} forall
	/Encoding isolatin1encoding def
    currentdict end
definefont pop
/Bookman-DemiItalic-latin1
    /Bookman-DemiItalic findfont
    dup length dict begin
	{1 index /FID ne {def} {pop pop} ifelse} forall
	/Encoding isolatin1encoding def
    currentdict end
definefont pop
/Courier-latin1
    /Courier findfont
    dup length dict begin
	{1 index /FID ne {def} {pop pop} ifelse} forall
	/Encoding isolatin1encoding def
    currentdict end
definefont pop
/Courier-Oblique-latin1
    /Courier-Oblique findfont
    dup length dict begin
	{1 index /FID ne {def} {pop pop} ifelse} forall
	/Encoding isolatin1encoding def
    currentdict end
definefont pop
/Courier-Bold-latin1
    /Courier-Bold findfont
    dup length dict begin
	{1 index /FID ne {def} {pop pop} ifelse} forall
	/Encoding isolatin1encoding def
    currentdict end
definefont pop
/Courier-BoldOblique-latin1
    /Courier-BoldOblique findfont
    dup length dict begin
	{1 index /FID ne {def} {pop pop} ifelse} forall
	/Encoding isolatin1encoding def
    currentdict end
definefont pop
/Helvetica-latin1
    /Helvetica findfont
    dup length dict begin
	{1 index /FID ne {def} {pop pop} ifelse} forall
	/Encoding isolatin1encoding def
    currentdict end
definefont pop
/Helvetica-Oblique-latin1
    /Helvetica-Oblique findfont
    dup length dict begin
	{1 index /FID ne {def} {pop pop} ifelse} forall
	/Encoding isolatin1encoding def
    currentdict end
definefont pop
/Helvetica-Bold-latin1
    /Helvetica-Bold findfont
    dup length dict begin
	{1 index /FID ne {def} {pop pop} ifelse} forall
	/Encoding isolatin1encoding def
    currentdict end
definefont pop
/Helvetica-BoldOblique-latin1
    /Helvetica-BoldOblique findfont
    dup length dict begin
	{1 index /FID ne {def} {pop pop} ifelse} forall
	/Encoding isolatin1encoding def
    currentdict end
definefont pop
/Helvetica-Narrow-latin1
    /Helvetica-Narrow findfont
    dup length dict begin
	{1 index /FID ne {def} {pop pop} ifelse} forall
	/Encoding isolatin1encoding def
    currentdict end
definefont pop
/Helvetica-Narrow-Oblique-latin1
    /Helvetica-Narrow-Oblique findfont
    dup length dict begin
	{1 index /FID ne {def} {pop pop} ifelse} forall
	/Encoding isolatin1encoding def
    currentdict end
definefont pop
/Helvetica-Narrow-Bold-latin1
    /Helvetica-Narrow-Bold findfont
    dup length dict begin
	{1 index /FID ne {def} {pop pop} ifelse} forall
	/Encoding isolatin1encoding def
    currentdict end
definefont pop
/Helvetica-Narrow-BoldOblique-latin1
    /Helvetica-Narrow-BoldOblique findfont
    dup length dict begin
	{1 index /FID ne {def} {pop pop} ifelse} forall
	/Encoding isolatin1encoding def
    currentdict end
definefont pop
/NewCenturySchoolbook-Roman-latin1
    /NewCenturySchoolbook-Roman findfont
    dup length dict begin
	{1 index /FID ne {def} {pop pop} ifelse} forall
	/Encoding isolatin1encoding def
    currentdict end
definefont pop
/NewCenturySchoolbook-Italic-latin1
    /NewCenturySchoolbook-Italic findfont
    dup length dict begin
	{1 index /FID ne {def} {pop pop} ifelse} forall
	/Encoding isolatin1encoding def
    currentdict end
definefont pop
/NewCenturySchoolbook-Bold-latin1
    /NewCenturySchoolbook-Bold findfont
    dup length dict begin
	{1 index /FID ne {def} {pop pop} ifelse} forall
	/Encoding isolatin1encoding def
    currentdict end
definefont pop
/NewCenturySchoolbook-BoldItalic-latin1
    /NewCenturySchoolbook-BoldItalic findfont
    dup length dict begin
	{1 index /FID ne {def} {pop pop} ifelse} forall
	/Encoding isolatin1encoding def
    currentdict end
definefont pop
/Palatino-Roman-latin1
    /Palatino-Roman findfont
    dup length dict begin
	{1 index /FID ne {def} {pop pop} ifelse} forall
	/Encoding isolatin1encoding def
    currentdict end
definefont pop
/Palatino-Italic-latin1
    /Palatino-Italic findfont
    dup length dict begin
	{1 index /FID ne {def} {pop pop} ifelse} forall
	/Encoding isolatin1encoding def
    currentdict end
definefont pop
/Palatino-Bold-latin1
    /Palatino-Bold findfont
    dup length dict begin
	{1 index /FID ne {def} {pop pop} ifelse} forall
	/Encoding isolatin1encoding def
    currentdict end
definefont pop
/Palatino-BoldItalic-latin1
    /Palatino-BoldItalic findfont
    dup length dict begin
	{1 index /FID ne {def} {pop pop} ifelse} forall
	/Encoding isolatin1encoding def
    currentdict end
definefont pop
/Symbol-latin1
    /Symbol findfont
definefont pop
/ZapfChancery-MediumItalic-latin1
    /ZapfChancery-MediumItalic findfont
    dup length dict begin
	{1 index /FID ne {def} {pop pop} ifelse} forall
	/Encoding isolatin1encoding def
    currentdict end
definefont pop
/ZapfDingbats-latin1
    /ZapfDingbats findfont
    dup length dict begin
	{1 index /FID ne {def} {pop pop} ifelse} forall
	/Encoding isolatin1encoding def
    currentdict end
definefont pop
/cp {closepath} bind def
/c {curveto} bind def
/f {fill} bind def
/a {arc} bind def
/ef {eofill} bind def
/ex {exch} bind def
/gr {grestore} bind def
/gs {gsave} bind def
/sa {save} bind def
/rs {restore} bind def
/l {lineto} bind def
/m {moveto} bind def
/rm {rmoveto} bind def
/n {newpath} bind def
/s {stroke} bind def
/sh {show} bind def
/slc {setlinecap} bind def
/slj {setlinejoin} bind def
/slw {setlinewidth} bind def
/srgb {setrgbcolor} bind def
/rot {rotate} bind def
/sc {scale} bind def
/sd {setdash} bind def
/ff {findfont} bind def
/sf {setfont} bind def
/scf {scalefont} bind def
/sw {stringwidth pop} bind def
/tr {translate} bind def

/ellipsedict 8 dict def
ellipsedict /mtrx matrix put
/ellipse
{ ellipsedict begin
   /endangle exch def
   /startangle exch def
   /yrad exch def
   /xrad exch def
   /y exch def
   /x exch def   /savematrix mtrx currentmatrix def
   x y tr xrad yrad sc
   0 0 1 startangle endangle arc
   savematrix setmatrix
   end
} def

/mergeprocs {
dup length
3 -1 roll
dup
length
dup
5 1 roll
3 -1 roll
add
array cvx
dup
3 -1 roll
0 exch
putinterval
dup
4 2 roll
putinterval
} bind def
9.921100 -9.921100 scale
-0.450000 -53.950000 translate
%%EndProlog


0.100000 slw
[] 0 sd
1.000000 1.000000 1.000000 srgb
n 3.500000 2.500000 m 3.500000 3.900000 l 22.722400 3.900000 l 22.722400 2.500000 l f
0.000000 0.000000 0.000000 srgb
n 3.500000 2.500000 m 3.500000 3.900000 l 22.722400 3.900000 l 22.722400 2.500000 l cp s
/Helvetica-Bold-latin1 ff 1.000000 scf sf
(ClassDesc) dup sw 2 div 13.111200 ex sub 3.500000 m gs 1 -1 sc sh gr
1.000000 1.000000 1.000000 srgb
n 3.500000 3.900000 m 3.500000 10.500000 l 22.722400 10.500000 l 22.722400 3.900000 l f
0.000000 0.000000 0.000000 srgb
n 3.500000 3.900000 m 3.500000 10.500000 l 22.722400 10.500000 l 22.722400 3.900000 l cp s
/Courier-latin1 ff 0.800000 scf sf
(-name: UTFString) 3.650000 4.594690 m gs 1 -1 sc sh gr
/Courier-latin1 ff 0.800000 scf sf
(-methods: List <MethodDesc>) 3.650000 5.394690 m gs 1 -1 sc sh gr
/Courier-latin1 ff 0.800000 scf sf
(-fields: List <VarDesc>) 3.650000 6.194690 m gs 1 -1 sc sh gr
/Courier-latin1 ff 0.800000 scf sf
(-superInterfaces: List <InterfaceDesc>) 3.650000 6.994690 m gs 1 -1 sc sh gr
/Courier-latin1 ff 0.800000 scf sf
(-subInterfaces: List <InterfaceDesc>) 3.650000 7.794690 m gs 1 -1 sc sh gr
/Courier-latin1 ff 0.800000 scf sf
(-superClass: ClassDesc) 3.650000 8.594690 m gs 1 -1 sc sh gr
/Courier-latin1 ff 0.800000 scf sf
(-subClasses: List <ClassDesc>) 3.650000 9.394690 m gs 1 -1 sc sh gr
/Courier-latin1 ff 0.800000 scf sf
(-instances: List <InstanceDesc>) 3.650000 10.194690 m gs 1 -1 sc sh gr
1.000000 1.000000 1.000000 srgb
n 3.500000 10.500000 m 3.500000 12.300000 l 22.722400 12.300000 l 22.722400 10.500000 l f
0.000000 0.000000 0.000000 srgb
n 3.500000 10.500000 m 3.500000 12.300000 l 22.722400 12.300000 l 22.722400 10.500000 l cp s
/Courier-latin1 ff 0.800000 scf sf
(+newInstance\(\): InstanceDesc) 3.650000 11.194690 m gs 1 -1 sc sh gr
/Courier-latin1 ff 0.800000 scf sf
(+getInstance\(id:int\): InstanceDesc) 3.650000 11.994690 m gs 1 -1 sc sh gr
0.100000 slw
[] 0 sd
1.000000 1.000000 1.000000 srgb
n 24.000000 1.500000 m 24.000000 2.900000 l 40.798400 2.900000 l 40.798400 1.500000 l f
0.000000 0.000000 0.000000 srgb
n 24.000000 1.500000 m 24.000000 2.900000 l 40.798400 2.900000 l 40.798400 1.500000 l cp s
/Helvetica-Bold-latin1 ff 1.000000 scf sf
(MethodDesc) dup sw 2 div 32.399200 ex sub 2.500000 m gs 1 -1 sc sh gr
1.000000 1.000000 1.000000 srgb
n 24.000000 2.900000 m 24.000000 7.900000 l 40.798400 7.900000 l 40.798400 2.900000 l f
0.000000 0.000000 0.000000 srgb
n 24.000000 2.900000 m 24.000000 7.900000 l 40.798400 7.900000 l 40.798400 2.900000 l cp s
/Courier-latin1 ff 0.800000 scf sf
(-cls: ClassDesc) 24.150000 3.594690 m gs 1 -1 sc sh gr
/Courier-latin1 ff 0.800000 scf sf
(-name: UTFString) 24.150000 4.394690 m gs 1 -1 sc sh gr
/Courier-latin1 ff 0.800000 scf sf
(-signature: MethodSig) 24.150000 5.194690 m gs 1 -1 sc sh gr
/Courier-latin1 ff 0.800000 scf sf
(-localVars: List <VarDesc>) 24.150000 5.994690 m gs 1 -1 sc sh gr
/Courier-latin1 ff 0.800000 scf sf
(-methodCFG: CFG) 24.150000 6.794690 m gs 1 -1 sc sh gr
/Courier-latin1 ff 0.800000 scf sf
(-eHandlers: List <ClassDesc, CFG>) 24.150000 7.594690 m gs 1 -1 sc sh gr
0.100000 slw
[] 0 sd
1.000000 1.000000 1.000000 srgb
n 25.000000 12.000000 m 25.000000 13.400000 l 36.465600 13.400000 l 36.465600 12.000000 l f
0.000000 0.000000 0.000000 srgb
n 25.000000 12.000000 m 25.000000 13.400000 l 36.465600 13.400000 l 36.465600 12.000000 l cp s
/Helvetica-BoldOblique-latin1 ff 1.000000 scf sf
(VarDesc) dup sw 2 div 30.732800 ex sub 13.000000 m gs 1 -1 sc sh gr
1.000000 1.000000 1.000000 srgb
n 25.000000 13.400000 m 25.000000 16.000000 l 36.465600 16.000000 l 36.465600 13.400000 l f
0.000000 0.000000 0.000000 srgb
n 25.000000 13.400000 m 25.000000 16.000000 l 36.465600 16.000000 l 36.465600 13.400000 l cp s
/Courier-latin1 ff 0.800000 scf sf
(-name: UTFString) 25.150000 14.094690 m gs 1 -1 sc sh gr
/Courier-latin1 ff 0.800000 scf sf
(-type: ClassDesc) 25.150000 14.894690 m gs 1 -1 sc sh gr
/Courier-latin1 ff 0.800000 scf sf
(-value) 25.150000 15.694690 m gs 1 -1 sc sh gr
1.000000 1.000000 1.000000 srgb
n 25.000000 16.000000 m 25.000000 17.000000 l 36.465600 17.000000 l 36.465600 16.000000 l f
0.000000 0.000000 0.000000 srgb
n 25.000000 16.000000 m 25.000000 17.000000 l 36.465600 17.000000 l 36.465600 16.000000 l cp s
/Courier-Oblique-latin1 ff 0.800000 scf sf
(+equals\(VarDesc\): bool) 25.150000 16.694690 m gs 1 -1 sc sh gr
0.100000 slw
[] 0 sd
1.000000 1.000000 1.000000 srgb
n 0.500000 16.500000 m 0.500000 17.900000 l 16.328800 17.900000 l 16.328800 16.500000 l f
0.000000 0.000000 0.000000 srgb
n 0.500000 16.500000 m 0.500000 17.900000 l 16.328800 17.900000 l 16.328800 16.500000 l cp s
/Helvetica-Bold-latin1 ff 1.000000 scf sf
(InstanceDesc) dup sw 2 div 8.414400 ex sub 17.500000 m gs 1 -1 sc sh gr
1.000000 1.000000 1.000000 srgb
n 0.500000 17.900000 m 0.500000 22.100000 l 16.328800 22.100000 l 16.328800 17.900000 l f
0.000000 0.000000 0.000000 srgb
n 0.500000 17.900000 m 0.500000 22.100000 l 16.328800 22.100000 l 16.328800 17.900000 l cp s
/Courier-latin1 ff 0.800000 scf sf
(-id: int) 0.650000 18.594690 m gs 1 -1 sc sh gr
/Courier-latin1 ff 0.800000 scf sf
(-type: ClassDesc) 0.650000 19.394690 m gs 1 -1 sc sh gr
/Courier-latin1 ff 0.800000 scf sf
(-lockOwner: ThreadDesc) 0.650000 20.194690 m gs 1 -1 sc sh gr
/Courier-latin1 ff 0.800000 scf sf
(-instanceFields: List <VarDesc>) 0.650000 20.994690 m gs 1 -1 sc sh gr
/Courier-latin1 ff 0.800000 scf sf
(-waitList: List <ThreadDesc>) 0.650000 21.794690 m gs 1 -1 sc sh gr
0.100000 slw
[] 0 sd
1.000000 1.000000 1.000000 srgb
n 20.500000 21.000000 m 20.500000 22.400000 l 27.541800 22.400000 l 27.541800 21.000000 l f
0.000000 0.000000 0.000000 srgb
n 20.500000 21.000000 m 20.500000 22.400000 l 27.541800 22.400000 l 27.541800 21.000000 l cp s
/Helvetica-Bold-latin1 ff 1.000000 scf sf
(PrimVarDesc) dup sw 2 div 24.020900 ex sub 22.000000 m gs 1 -1 sc sh gr
0.100000 slw
[] 0 sd
1.000000 1.000000 1.000000 srgb
n 23.500000 23.500000 m 23.500000 24.900000 l 33.026400 24.900000 l 33.026400 23.500000 l f
0.000000 0.000000 0.000000 srgb
n 23.500000 23.500000 m 23.500000 24.900000 l 33.026400 24.900000 l 33.026400 23.500000 l cp s
/Helvetica-Bold-latin1 ff 1.000000 scf sf
(ArrayDesc) dup sw 2 div 28.263200 ex sub 24.500000 m gs 1 -1 sc sh gr
1.000000 1.000000 1.000000 srgb
n 23.500000 24.900000 m 23.500000 25.900000 l 33.026400 25.900000 l 33.026400 24.900000 l f
0.000000 0.000000 0.000000 srgb
n 23.500000 24.900000 m 23.500000 25.900000 l 33.026400 25.900000 l 33.026400 24.900000 l cp s
/Courier-latin1 ff 0.800000 scf sf
(-elements: VarDesc) 23.650000 25.594690 m gs 1 -1 sc sh gr
0.100000 slw
[] 0 sd
0 slj
0 slc
n 30.732800 17.000000 m 30.732800 19.000000 l 24.020900 19.000000 l 24.020900 21.000000 l s
0 slj
1.000000 1.000000 1.000000 srgb
n 31.132800 17.800000 m 30.732800 17.000000 l 30.332800 17.800000 l f
0.100000 slw
[] 0 sd
0 slj
0.000000 0.000000 0.000000 srgb
n 31.132800 17.800000 m 30.732800 17.000000 l 30.332800 17.800000 l cp s
/Courier-latin1 ff 0.800000 scf sf
0.100000 slw
[] 0 sd
0 slj
0 slc
n 30.732800 17.000000 m 30.732800 19.000000 l 28.263200 19.000000 l 28.263200 23.500000 l s
0 slj
1.000000 1.000000 1.000000 srgb
n 31.132800 17.800000 m 30.732800 17.000000 l 30.332800 17.800000 l f
0.100000 slw
[] 0 sd
0 slj
0.000000 0.000000 0.000000 srgb
n 31.132800 17.800000 m 30.732800 17.000000 l 30.332800 17.800000 l cp s
/Courier-latin1 ff 0.800000 scf sf
0.100000 slw
[] 0 sd
1.000000 1.000000 1.000000 srgb
n 29.000000 21.000000 m 29.000000 22.400000 l 33.799600 22.400000 l 33.799600 21.000000 l f
0.000000 0.000000 0.000000 srgb
n 29.000000 21.000000 m 29.000000 22.400000 l 33.799600 22.400000 l 33.799600 21.000000 l cp s
/Helvetica-Bold-latin1 ff 1.000000 scf sf
(RefDesc) dup sw 2 div 31.399800 ex sub 22.000000 m gs 1 -1 sc sh gr
0.100000 slw
[] 0 sd
0 slj
0 slc
n 30.732800 17.000000 m 30.732800 19.000000 l 31.399800 19.000000 l 31.399800 21.000000 l s
0 slj
1.000000 1.000000 1.000000 srgb
n 31.132800 17.800000 m 30.732800 17.000000 l 30.332800 17.800000 l f
0.100000 slw
[] 0 sd
0 slj
0.000000 0.000000 0.000000 srgb
n 31.132800 17.800000 m 30.732800 17.000000 l 30.332800 17.800000 l cp s
/Courier-latin1 ff 0.800000 scf sf
0.100000 slw
[] 0 sd
0 slj
0 slc
n 30.732800 12.000000 m 30.732800 12.000000 l 32.399200 12.000000 l 32.399200 7.900000 l s
[] 0 sd
0 slj
0 slc
1.000000 1.000000 1.000000 srgb
n 32.399200 7.900000 m 32.639200 8.600000 l 32.399200 9.300000 l 32.159200 8.600000 l f
0.100000 slw
[] 0 sd
0 slj
0 slc
0.000000 0.000000 0.000000 srgb
n 32.399200 7.900000 m 32.639200 8.600000 l 32.399200 9.300000 l 32.159200 8.600000 l cp s
/Courier-latin1 ff 0.800000 scf sf
0.100000 slw
[] 0 sd
0 slj
0 slc
n 25.000000 13.900000 m 25.000000 14.000000 l 22.722400 14.000000 l 22.722400 12.300000 l s
[] 0 sd
0 slj
0 slc
1.000000 1.000000 1.000000 srgb
n 22.722400 12.300000 m 22.962400 13.000000 l 22.722400 13.700000 l 22.482400 13.000000 l f
0.100000 slw
[] 0 sd
0 slj
0 slc
0.000000 0.000000 0.000000 srgb
n 22.722400 12.300000 m 22.962400 13.000000 l 22.722400 13.700000 l 22.482400 13.000000 l cp s
/Courier-latin1 ff 0.800000 scf sf
0.100000 slw
[] 0 sd
0 slj
0 slc
n 32.399200 1.500000 m 32.399200 1.000000 l 22.722400 1.000000 l 22.722400 2.500000 l s
[] 0 sd
0 slj
0 slc
1.000000 1.000000 1.000000 srgb
n 22.722400 2.500000 m 22.482400 1.800000 l 22.722400 1.100000 l 22.962400 1.800000 l f
0.100000 slw
[] 0 sd
0 slj
0 slc
0.000000 0.000000 0.000000 srgb
n 22.722400 2.500000 m 22.482400 1.800000 l 22.722400 1.100000 l 22.962400 1.800000 l cp s
/Courier-latin1 ff 0.800000 scf sf
0.100000 slw
[] 0 sd
1.000000 1.000000 1.000000 srgb
n 2.196800 32.500000 m 2.196800 33.900000 l 14.632000 33.900000 l 14.632000 32.500000 l f
0.000000 0.000000 0.000000 srgb
n 2.196800 32.500000 m 2.196800 33.900000 l 14.632000 33.900000 l 14.632000 32.500000 l cp s
/Helvetica-Bold-latin1 ff 1.000000 scf sf
(ThreadState) dup sw 2 div 8.414400 ex sub 33.500000 m gs 1 -1 sc sh gr
1.000000 1.000000 1.000000 srgb
n 2.196800 33.900000 m 2.196800 37.300000 l 14.632000 37.300000 l 14.632000 33.900000 l f
0.000000 0.000000 0.000000 srgb
n 2.196800 33.900000 m 2.196800 37.300000 l 14.632000 37.300000 l 14.632000 33.900000 l cp s
/Courier-latin1 ff 0.800000 scf sf
(-locks: List <ClassDesc>) 2.346800 34.594690 m gs 1 -1 sc sh gr
/Courier-latin1 ff 0.800000 scf sf
(-location: LocDesc) 2.346800 35.394690 m gs 1 -1 sc sh gr
/Courier-latin1 ff 0.800000 scf sf
(-runnable: bool) 2.346800 36.194690 m gs 1 -1 sc sh gr
/Courier-latin1 ff 0.800000 scf sf
(-stack: JStack) 2.346800 36.994690 m gs 1 -1 sc sh gr
0.100000 slw
[] 0 sd
0 slj
0 slc
n 8.414400 22.100000 m 8.414400 25.500000 l 8.414400 25.500000 l 8.414400 26.500000 l s
0 slj
1.000000 1.000000 1.000000 srgb
n 8.814400 22.900000 m 8.414400 22.100000 l 8.014400 22.900000 l f
0.100000 slw
[] 0 sd
0 slj
0.000000 0.000000 0.000000 srgb
n 8.814400 22.900000 m 8.414400 22.100000 l 8.014400 22.900000 l cp s
/Courier-latin1 ff 0.800000 scf sf
0.100000 slw
[] 0 sd
1.000000 1.000000 1.000000 srgb
n 3.408800 40.000000 m 3.408800 41.400000 l 13.420000 41.400000 l 13.420000 40.000000 l f
0.000000 0.000000 0.000000 srgb
n 3.408800 40.000000 m 3.408800 41.400000 l 13.420000 41.400000 l 13.420000 40.000000 l cp s
/Helvetica-Bold-latin1 ff 1.000000 scf sf
(LocDesc) dup sw 2 div 8.414400 ex sub 41.000000 m gs 1 -1 sc sh gr
1.000000 1.000000 1.000000 srgb
n 3.408800 41.400000 m 3.408800 44.000000 l 13.420000 44.000000 l 13.420000 41.400000 l f
0.000000 0.000000 0.000000 srgb
n 3.408800 41.400000 m 3.408800 44.000000 l 13.420000 44.000000 l 13.420000 41.400000 l cp s
/Courier-latin1 ff 0.800000 scf sf
(-cls: ClassDesc) 3.558800 42.094690 m gs 1 -1 sc sh gr
/Courier-latin1 ff 0.800000 scf sf
(-method: MethodDesc) 3.558800 42.894690 m gs 1 -1 sc sh gr
/Courier-latin1 ff 0.800000 scf sf
(-loc: CFGNode) 3.558800 43.694690 m gs 1 -1 sc sh gr
0.100000 slw
[] 0 sd
0 slj
0 slc
n 8.414400 40.000000 m 8.414400 38.000000 l 8.414400 38.000000 l 8.414400 37.300000 l s
[] 0 sd
0 slj
0 slc
1.000000 1.000000 1.000000 srgb
n 8.414400 37.300000 m 8.654400 38.000000 l 8.414400 38.700000 l 8.174400 38.000000 l f
0.100000 slw
[] 0 sd
0 slj
0 slc
0.000000 0.000000 0.000000 srgb
n 8.414400 37.300000 m 8.654400 38.000000 l 8.414400 38.700000 l 8.174400 38.000000 l cp s
/Courier-latin1 ff 0.800000 scf sf
0.100000 slw
[] 0 sd
1.000000 1.000000 1.000000 srgb
n 2.196800 26.500000 m 2.196800 27.900000 l 14.632000 27.900000 l 14.632000 26.500000 l f
0.000000 0.000000 0.000000 srgb
n 2.196800 26.500000 m 2.196800 27.900000 l 14.632000 27.900000 l 14.632000 26.500000 l cp s
/Helvetica-Bold-latin1 ff 1.000000 scf sf
(ThreadDesc) dup sw 2 div 8.414400 ex sub 27.500000 m gs 1 -1 sc sh gr
1.000000 1.000000 1.000000 srgb
n 2.196800 27.900000 m 2.196800 29.700000 l 14.632000 29.700000 l 14.632000 27.900000 l f
0.000000 0.000000 0.000000 srgb
n 2.196800 27.900000 m 2.196800 29.700000 l 14.632000 29.700000 l 14.632000 27.900000 l cp s
/Courier-latin1 ff 0.800000 scf sf
(+setState\(ThreadState\)) 2.346800 28.594690 m gs 1 -1 sc sh gr
/Courier-latin1 ff 0.800000 scf sf
(+getState\(\): ThreadState) 2.346800 29.394690 m gs 1 -1 sc sh gr
0.100000 slw
[] 0 sd
0 slj
0 slc
n 8.414400 32.500000 m 8.414400 31.500000 l 8.414400 31.500000 l 8.414400 29.700000 l s
[] 0 sd
0 slj
0 slc
1.000000 1.000000 1.000000 srgb
n 8.414400 29.700000 m 8.654400 30.400000 l 8.414400 31.100000 l 8.174400 30.400000 l f
0.100000 slw
[] 0 sd
0 slj
0 slc
0.000000 0.000000 0.000000 srgb
n 8.414400 29.700000 m 8.654400 30.400000 l 8.414400 31.100000 l 8.174400 30.400000 l cp s
/Courier-latin1 ff 0.800000 scf sf
0.100000 slw
[] 0 sd
1.000000 1.000000 1.000000 srgb
n 24.863200 28.500000 m 24.863200 29.900000 l 35.359200 29.900000 l 35.359200 28.500000 l f
0.000000 0.000000 0.000000 srgb
n 24.863200 28.500000 m 24.863200 29.900000 l 35.359200 29.900000 l 35.359200 28.500000 l cp s
/Helvetica-Bold-latin1 ff 1.000000 scf sf
(CFG) dup sw 2 div 30.111200 ex sub 29.500000 m gs 1 -1 sc sh gr
1.000000 1.000000 1.000000 srgb
n 24.863200 29.900000 m 24.863200 31.700000 l 35.359200 31.700000 l 35.359200 29.900000 l f
0.000000 0.000000 0.000000 srgb
n 24.863200 29.900000 m 24.863200 31.700000 l 35.359200 31.700000 l 35.359200 29.900000 l cp s
/Courier-latin1 ff 0.800000 scf sf
(-method: methodDesc) 25.013200 30.594690 m gs 1 -1 sc sh gr
/Courier-latin1 ff 0.800000 scf sf
(-EntryPoint: CFGNode) 25.013200 31.394690 m gs 1 -1 sc sh gr
0.100000 slw
[] 0 sd
1.000000 1.000000 1.000000 srgb
n 20.500000 34.500000 m 20.500000 35.900000 l 39.722400 35.900000 l 39.722400 34.500000 l f
0.000000 0.000000 0.000000 srgb
n 20.500000 34.500000 m 20.500000 35.900000 l 39.722400 35.900000 l 39.722400 34.500000 l cp s
/Helvetica-Bold-latin1 ff 1.000000 scf sf
(CFGNode) dup sw 2 div 30.111200 ex sub 35.500000 m gs 1 -1 sc sh gr
1.000000 1.000000 1.000000 srgb
n 20.500000 35.900000 m 20.500000 38.500000 l 39.722400 38.500000 l 39.722400 35.900000 l f
0.000000 0.000000 0.000000 srgb
n 20.500000 35.900000 m 20.500000 38.500000 l 39.722400 38.500000 l 39.722400 35.900000 l cp s
/Courier-latin1 ff 0.800000 scf sf
(-root: CFG) 20.650000 36.594690 m gs 1 -1 sc sh gr
/Courier-latin1 ff 0.800000 scf sf
(-successors: List <Condition, CFGNode>) 20.650000 37.394690 m gs 1 -1 sc sh gr
/Courier-latin1 ff 0.800000 scf sf
(-operations: Tree <Operation>) 20.650000 38.194690 m gs 1 -1 sc sh gr
0.100000 slw
[] 0 sd
0 slj
0 slc
n 20.500000 38.500000 m 20.500000 39.000000 l 14.632000 39.000000 l 14.632000 37.300000 l s
[] 0 sd
0 slj
0 slc
1.000000 1.000000 1.000000 srgb
n 14.632000 37.300000 m 14.872000 38.000000 l 14.632000 38.700000 l 14.392000 38.000000 l f
0.100000 slw
[] 0 sd
0 slj
0 slc
0.000000 0.000000 0.000000 srgb
n 14.632000 37.300000 m 14.872000 38.000000 l 14.632000 38.700000 l 14.392000 38.000000 l cp s
/Courier-latin1 ff 0.800000 scf sf
0.100000 slw
[] 0 sd
0 slj
0 slc
n 30.111200 41.500000 m 30.111200 39.000000 l 30.111200 39.000000 l 30.111200 38.500000 l s
[] 0 sd
0 slj
0 slc
1.000000 1.000000 1.000000 srgb
n 30.111200 38.500000 m 30.351200 39.200000 l 30.111200 39.900000 l 29.871200 39.200000 l f
0.100000 slw
[] 0 sd
0 slj
0 slc
0.000000 0.000000 0.000000 srgb
n 30.111200 38.500000 m 30.351200 39.200000 l 30.111200 39.900000 l 29.871200 39.200000 l cp s
/Courier-latin1 ff 0.800000 scf sf
0.100000 slw
[] 0 sd
0 slj
0 slc
n 30.111200 34.500000 m 30.111200 33.000000 l 30.111200 33.000000 l 30.111200 31.700000 l s
[] 0 sd
0 slj
0 slc
1.000000 1.000000 1.000000 srgb
n 30.111200 31.700000 m 30.351200 32.400000 l 30.111200 33.100000 l 29.871200 32.400000 l f
0.100000 slw
[] 0 sd
0 slj
0 slc
0.000000 0.000000 0.000000 srgb
n 30.111200 31.700000 m 30.351200 32.400000 l 30.111200 33.100000 l 29.871200 32.400000 l cp s
/Courier-latin1 ff 0.800000 scf sf
0.100000 slw
[] 0 sd
0 slj
0 slc
n 40.798400 5.800000 m 40.798400 27.000000 l 30.111200 27.000000 l 30.111200 28.500000 l s
/Courier-latin1 ff 0.800000 scf sf
(consists of) 40.798400 6.394690 m gs 1 -1 sc sh gr
(1) 40.798400 7.194690 m gs 1 -1 sc sh gr
(belongs to) 30.111200 27.494690 m gs 1 -1 sc sh gr
(1) 30.111200 28.294690 m gs 1 -1 sc sh gr
0.100000 slw
[] 0 sd
1.000000 1.000000 1.000000 srgb
n 2.439200 47.500000 m 2.439200 48.900000 l 14.389600 48.900000 l 14.389600 47.500000 l f
0.000000 0.000000 0.000000 srgb
n 2.439200 47.500000 m 2.439200 48.900000 l 14.389600 48.900000 l 14.389600 47.500000 l cp s
/Helvetica-Bold-latin1 ff 1.000000 scf sf
(JStack) dup sw 2 div 8.414400 ex sub 48.500000 m gs 1 -1 sc sh gr
1.000000 1.000000 1.000000 srgb
n 2.439200 48.900000 m 2.439200 49.900000 l 14.389600 49.900000 l 14.389600 48.900000 l f
0.000000 0.000000 0.000000 srgb
n 2.439200 48.900000 m 2.439200 49.900000 l 14.389600 49.900000 l 14.389600 48.900000 l cp s
/Courier-latin1 ff 0.800000 scf sf
(-values: List <VarDesc>) 2.589200 49.594690 m gs 1 -1 sc sh gr
0.100000 slw
[] 0 sd
0 slj
0 slc
n 2.439200 47.500000 m 2.439200 47.500000 l 2.196800 47.500000 l 2.196800 37.300000 l s
[] 0 sd
0 slj
0 slc
1.000000 1.000000 1.000000 srgb
n 2.196800 37.300000 m 2.436800 38.000000 l 2.196800 38.700000 l 1.956800 38.000000 l f
0.100000 slw
[] 0 sd
0 slj
0 slc
0.000000 0.000000 0.000000 srgb
n 2.196800 37.300000 m 2.436800 38.000000 l 2.196800 38.700000 l 1.956800 38.000000 l cp s
/Courier-latin1 ff 0.800000 scf sf
0.100000 slw
[] 0 sd
0 slj
0 slc
n 18.000000 17.000000 m 18.000000 41.500000 l 14.389600 41.500000 l 14.389600 47.500000 l s
[] 0 sd
0 slj
0 slc
1.000000 1.000000 1.000000 srgb
n 14.389600 47.500000 m 14.149600 46.800000 l 14.389600 46.100000 l 14.629600 46.800000 l f
0.100000 slw
[] 0 sd
0 slj
0 slc
0.000000 0.000000 0.000000 srgb
n 14.389600 47.500000 m 14.149600 46.800000 l 14.389600 46.100000 l 14.629600 46.800000 l cp s
/Courier-latin1 ff 0.800000 scf sf
0.100000 slw
[] 0 sd
[] 0 sd
0 slc
n 18.000000 17.000000 m 25.000000 17.000000 l s
0.100000 slw
[] 0 sd
1.000000 1.000000 1.000000 srgb
n 38.500000 13.000000 m 42.878400 13.000000 l 43.478400 13.600000 l 43.478400 15.500000 l 38.500000 15.500000 l f
0.000000 0.000000 0.000000 srgb
n 38.500000 13.000000 m 42.878400 13.000000 l 43.478400 13.600000 l 43.478400 15.500000 l 38.500000 15.500000 l cp s
0.050000 slw
n 42.878400 13.000000 m 42.878400 13.600000 l 43.478400 13.600000 l s
/Courier-latin1 ff 0.800000 scf sf
(Accessor) 38.850000 14.244690 m gs 1 -1 sc sh gr
(graph) 38.850000 15.044690 m gs 1 -1 sc sh gr
0.100000 slw
[] 0 sd
[] 0 sd
0 slc
n 36.465600 12.700000 m 38.500000 14.250000 l s
0.100000 slw
[] 0 sd
1.000000 1.000000 1.000000 srgb
n 34.500000 21.000000 m 34.500000 22.400000 l 41.360000 22.400000 l 41.360000 21.000000 l f
0.000000 0.000000 0.000000 srgb
n 34.500000 21.000000 m 34.500000 22.400000 l 41.360000 22.400000 l 41.360000 21.000000 l cp s
/Helvetica-Bold-latin1 ff 1.000000 scf sf
(NDBoolDesc) dup sw 2 div 37.930000 ex sub 22.000000 m gs 1 -1 sc sh gr
0.100000 slw
[] 0 sd
0 slj
0 slc
n 30.732800 17.000000 m 30.732800 19.000000 l 37.930000 19.000000 l 37.930000 21.000000 l s
0 slj
1.000000 1.000000 1.000000 srgb
n 31.132800 17.800000 m 30.732800 17.000000 l 30.332800 17.800000 l f
0.100000 slw
[] 0 sd
0 slj
0.000000 0.000000 0.000000 srgb
n 31.132800 17.800000 m 30.732800 17.000000 l 30.332800 17.800000 l cp s
/Courier-latin1 ff 0.800000 scf sf
0.100000 slw
[] 0 sd
1.000000 1.000000 1.000000 srgb
n 38.500000 16.500000 m 43.848000 16.500000 l 44.448000 17.100000 l 44.448000 19.000000 l 38.500000 19.000000 l f
0.000000 0.000000 0.000000 srgb
n 38.500000 16.500000 m 43.848000 16.500000 l 44.448000 17.100000 l 44.448000 19.000000 l 38.500000 19.000000 l cp s
0.050000 slw
n 43.848000 16.500000 m 43.848000 17.100000 l 44.448000 17.100000 l s
/Courier-latin1 ff 0.800000 scf sf
(Delegated) 38.850000 17.744690 m gs 1 -1 sc sh gr
(to checker) 38.850000 18.544690 m gs 1 -1 sc sh gr
0.100000 slw
[] 0 sd
[] 0 sd
0 slc
n 36.465600 16.500000 m 38.500000 17.750000 l s
0.100000 slw
[] 0 sd
[] 0 sd
0 slc
n 39.480000 43.400000 m 41.500000 44.750000 l s
0.100000 slw
[] 0 sd
0 slj
0 slc
n 8.414400 16.500000 m 8.414400 14.000000 l 13.111200 14.000000 l 13.111200 12.300000 l s
/Courier-latin1 ff 0.800000 scf sf
(is_of_type) 8.414400 17.094690 m gs 1 -1 sc sh gr
(n) 8.414400 17.894690 m gs 1 -1 sc sh gr
(has_instances) 13.111200 12.894690 m gs 1 -1 sc sh gr
(1) 13.111200 13.694690 m gs 1 -1 sc sh gr
0.100000 slw
[] 0 sd
0 slj
0 slc
n 8.414400 44.000000 m 8.414400 45.500000 l 20.500000 45.500000 l 20.500000 38.500000 l s
[] 0 sd
0 slj
0 slc
1.000000 1.000000 1.000000 srgb
n 20.500000 38.500000 m 20.740000 39.200000 l 20.500000 39.900000 l 20.260000 39.200000 l f
0.100000 slw
[] 0 sd
0 slj
0 slc
0.000000 0.000000 0.000000 srgb
n 20.500000 38.500000 m 20.740000 39.200000 l 20.500000 39.900000 l 20.260000 39.200000 l cp s
/Courier-latin1 ff 0.800000 scf sf
0.100000 slw
[] 0 sd
1.000000 1.000000 1.000000 srgb
n 20.742400 41.500000 m 20.742400 42.900000 l 39.480000 42.900000 l 39.480000 41.500000 l f
0.000000 0.000000 0.000000 srgb
n 20.742400 41.500000 m 20.742400 42.900000 l 39.480000 42.900000 l 39.480000 41.500000 l cp s
/Helvetica-BoldOblique-latin1 ff 1.000000 scf sf
(Operation) dup sw 2 div 30.111200 ex sub 42.500000 m gs 1 -1 sc sh gr
1.000000 1.000000 1.000000 srgb
n 20.742400 42.900000 m 20.742400 43.900000 l 39.480000 43.900000 l 39.480000 42.900000 l f
0.000000 0.000000 0.000000 srgb
n 20.742400 42.900000 m 20.742400 43.900000 l 39.480000 43.900000 l 39.480000 42.900000 l cp s
/Courier-Oblique-latin1 ff 0.800000 scf sf
(+eval\(state:Threadstate\): ThreadState) 20.892400 43.594690 m gs 1 -1 sc sh gr
0.100000 slw
[] 0 sd
1.000000 1.000000 1.000000 srgb
n 17.000000 47.500000 m 17.000000 48.900000 l 28.950400 48.900000 l 28.950400 47.500000 l f
0.000000 0.000000 0.000000 srgb
n 17.000000 47.500000 m 17.000000 48.900000 l 28.950400 48.900000 l 28.950400 47.500000 l cp s
/Helvetica-Bold-latin1 ff 1.000000 scf sf
(ByteCodeOperation) dup sw 2 div 22.975200 ex sub 48.500000 m gs 1 -1 sc sh gr
1.000000 1.000000 1.000000 srgb
n 17.000000 48.900000 m 17.000000 49.900000 l 28.950400 49.900000 l 28.950400 48.900000 l f
0.000000 0.000000 0.000000 srgb
n 17.000000 48.900000 m 17.000000 49.900000 l 28.950400 49.900000 l 28.950400 48.900000 l cp s
/Courier-latin1 ff 0.800000 scf sf
(-operation: Tree <BCOp>) 17.150000 49.594690 m gs 1 -1 sc sh gr
0.100000 slw
[] 0 sd
0 slj
0 slc
n 30.111200 43.900000 m 30.111200 45.500000 l 36.732800 45.500000 l 36.732800 47.500000 l s
0 slj
1.000000 1.000000 1.000000 srgb
n 30.511200 44.700000 m 30.111200 43.900000 l 29.711200 44.700000 l f
0.100000 slw
[] 0 sd
0 slj
0.000000 0.000000 0.000000 srgb
n 30.511200 44.700000 m 30.111200 43.900000 l 29.711200 44.700000 l cp s
/Courier-latin1 ff 0.800000 scf sf
0.100000 slw
[] 0 sd
0 slj
0 slc
n 30.111200 43.900000 m 30.111200 45.500000 l 22.975200 45.500000 l 22.975200 47.500000 l s
0 slj
1.000000 1.000000 1.000000 srgb
n 30.511200 44.700000 m 30.111200 43.900000 l 29.711200 44.700000 l f
0.100000 slw
[] 0 sd
0 slj
0.000000 0.000000 0.000000 srgb
n 30.511200 44.700000 m 30.111200 43.900000 l 29.711200 44.700000 l cp s
/Courier-latin1 ff 0.800000 scf sf
0.100000 slw
[] 0 sd
1.000000 1.000000 1.000000 srgb
n 38.000000 28.500000 m 47.408200 28.500000 l 48.008200 29.100000 l 48.008200 32.900000 l 38.000000 32.900000 l f
0.000000 0.000000 0.000000 srgb
n 38.000000 28.500000 m 47.408200 28.500000 l 48.008200 29.100000 l 48.008200 32.900000 l 38.000000 32.900000 l cp s
0.050000 slw
n 47.408200 28.500000 m 47.408200 29.100000 l 48.008200 29.100000 l s
/Courier-latin1 ff 0.700000 scf sf
(- Operation as tree) 38.350000 29.670354 m gs 1 -1 sc sh gr
(- Condition \(for) 38.350000 30.370354 m gs 1 -1 sc sh gr
(  bytecode\)  eval-) 38.350000 31.070354 m gs 1 -1 sc sh gr
(  uates return value) 38.350000 31.770354 m gs 1 -1 sc sh gr
(  \(top stack element\)) 38.350000 32.470354 m gs 1 -1 sc sh gr
0.100000 slw
[] 0 sd
1.000000 1.000000 1.000000 srgb
n 34.500000 51.500000 m 34.500000 52.900000 l 47.904800 52.900000 l 47.904800 51.500000 l f
0.000000 0.000000 0.000000 srgb
n 34.500000 51.500000 m 34.500000 52.900000 l 47.904800 52.900000 l 47.904800 51.500000 l cp s
/Helvetica-Bold-latin1 ff 1.000000 scf sf
(ByteCodeCondition) dup sw 2 div 41.202400 ex sub 52.500000 m gs 1 -1 sc sh gr
1.000000 1.000000 1.000000 srgb
n 34.500000 52.900000 m 34.500000 53.900000 l 47.904800 53.900000 l 47.904800 52.900000 l f
0.000000 0.000000 0.000000 srgb
n 34.500000 52.900000 m 34.500000 53.900000 l 47.904800 53.900000 l 47.904800 52.900000 l cp s
/Courier-latin1 ff 0.800000 scf sf
(+eval\(param:VarDesc\): bool) 34.650000 53.594690 m gs 1 -1 sc sh gr
0.100000 slw
[] 0 sd
0 slj
0 slc
n 41.202400 51.500000 m 41.202400 40.500000 l 39.722400 40.500000 l 39.722400 37.200000 l s
[] 0 sd
0 slj
0 slc
1.000000 1.000000 1.000000 srgb
n 39.722400 37.200000 m 39.962400 37.900000 l 39.722400 38.600000 l 39.482400 37.900000 l f
0.100000 slw
[] 0 sd
0 slj
0 slc
0.000000 0.000000 0.000000 srgb
n 39.722400 37.200000 m 39.962400 37.900000 l 39.722400 38.600000 l 39.482400 37.900000 l cp s
/Courier-latin1 ff 0.800000 scf sf
0.100000 slw
[] 0 sd
1.000000 1.000000 1.000000 srgb
n 41.500000 43.500000 m 46.848000 43.500000 l 47.448000 44.100000 l 47.448000 46.000000 l 41.500000 46.000000 l f
0.000000 0.000000 0.000000 srgb
n 41.500000 43.500000 m 46.848000 43.500000 l 47.448000 44.100000 l 47.448000 46.000000 l 41.500000 46.000000 l cp s
0.050000 slw
n 46.848000 43.500000 m 46.848000 44.100000 l 47.448000 44.100000 l s
/Courier-latin1 ff 0.800000 scf sf
(Delegated) 41.850000 44.744690 m gs 1 -1 sc sh gr
(to checker) 41.850000 45.544690 m gs 1 -1 sc sh gr
0.100000 slw
[] 0 sd
[] 0 sd
0 slj
0 slc
n 39.722400 35.200000 m 47.500000 34.000000 29.000000 33.500000 38.000000 30.700000 c s
0.100000 slw
[] 0 sd
1.000000 1.000000 1.000000 srgb
n 31.000000 47.500000 m 31.000000 48.900000 l 42.465600 48.900000 l 42.465600 47.500000 l f
0.000000 0.000000 0.000000 srgb
n 31.000000 47.500000 m 31.000000 48.900000 l 42.465600 48.900000 l 42.465600 47.500000 l cp s
/Helvetica-Bold-latin1 ff 1.000000 scf sf
(JavaOperation) dup sw 2 div 36.732800 ex sub 48.500000 m gs 1 -1 sc sh gr
1.000000 1.000000 1.000000 srgb
n 31.000000 48.900000 m 31.000000 49.900000 l 42.465600 49.900000 l 42.465600 48.900000 l f
0.000000 0.000000 0.000000 srgb
n 31.000000 48.900000 m 31.000000 49.900000 l 42.465600 49.900000 l 42.465600 48.900000 l cp s
/Courier-latin1 ff 0.800000 scf sf
(-statement: SyntaxTree) 31.150000 49.594690 m gs 1 -1 sc sh gr
showpage
