#FIG 3.2
Landscape
Center
Inches
Letter  
100.00
Single
-2
1200 2
2 2 0 1 0 7 50 0 -1 0.000 0 0 -1 0 0 5
	 900 1500 2400 1500 2400 2100 900 2100 900 1500
2 2 0 1 0 7 50 0 -1 0.000 0 0 -1 0 0 5
	 900 2100 2400 2100 2400 2400 900 2400 900 2100
2 2 0 1 0 7 50 0 -1 0.000 0 0 -1 0 0 5
	 900 2400 2400 2400 2400 2700 900 2700 900 2400
2 2 0 1 0 7 50 0 -1 0.000 0 0 -1 0 0 5
	 900 2700 2400 2700 2400 3000 900 3000 900 2700
2 2 0 1 0 7 50 0 -1 0.000 0 0 -1 0 0 5
	 900 3000 2400 3000 2400 3300 900 3300 900 3000
2 2 0 1 0 7 50 0 -1 0.000 0 0 -1 0 0 5
	 900 3900 2400 3900 2400 4500 900 4500 900 3900
2 2 0 1 0 7 50 0 -1 0.000 0 0 -1 0 0 5
	 900 4500 2400 4500 2400 4800 900 4800 900 4500
2 2 0 1 0 7 50 0 -1 0.000 0 0 -1 0 0 5
	 900 3300 2400 3300 2400 3900 900 3900 900 3300
2 1 0 1 0 7 50 0 -1 0.000 0 0 -1 0 0 8
	 2325 1200 2400 1275 2400 1500 900 1500 900 1200 2325 1200
	 2325 1275 2400 1275
4 0 0 50 0 0 12 0.0000 4 135 1260 1050 4725 Class Attributes\001
4 0 0 50 0 0 12 0.0000 4 135 675 1050 4275 Methods\001
4 0 0 50 0 0 12 0.0000 4 135 465 1050 3675 Fields\001
4 0 0 50 0 0 12 0.0000 4 135 780 1050 3225 Interfaces\001
4 0 0 50 0 0 12 0.0000 4 180 915 1050 2925 Super Class\001
4 0 0 50 0 0 12 0.0000 4 135 810 1050 2625 This Class\001
4 0 0 50 0 0 12 0.0000 4 180 1050 1050 2325 Access Flags\001
4 0 0 50 0 0 12 0.0000 4 135 1065 1050 1875 Constant Pool\001
4 0 0 50 0 0 12 0.0000 4 135 555 1050 1425 Header\001
