%!PS-Adobe-2.0 EPSF-2.0
%%Title: filerollback.fig
%%Creator: fig2dev Version 3.2 Patchlevel 4
%%CreationDate: Mon Mar 21 20:11:23 2005
%%For: zboris@linux (Boris Z.)
%%BoundingBox: 0 0 364 177
%%Magnification: 1.0000
%%EndComments
/$F2psDict 200 dict def
$F2psDict begin
$F2psDict /mtrx matrix put
/col-1 {0 setgray} bind def
/col0 {0.000 0.000 0.000 srgb} bind def
/col1 {0.000 0.000 1.000 srgb} bind def
/col2 {0.000 1.000 0.000 srgb} bind def
/col3 {0.000 1.000 1.000 srgb} bind def
/col4 {1.000 0.000 0.000 srgb} bind def
/col5 {1.000 0.000 1.000 srgb} bind def
/col6 {1.000 1.000 0.000 srgb} bind def
/col7 {1.000 1.000 1.000 srgb} bind def
/col8 {0.000 0.000 0.560 srgb} bind def
/col9 {0.000 0.000 0.690 srgb} bind def
/col10 {0.000 0.000 0.820 srgb} bind def
/col11 {0.530 0.810 1.000 srgb} bind def
/col12 {0.000 0.560 0.000 srgb} bind def
/col13 {0.000 0.690 0.000 srgb} bind def
/col14 {0.000 0.820 0.000 srgb} bind def
/col15 {0.000 0.560 0.560 srgb} bind def
/col16 {0.000 0.690 0.690 srgb} bind def
/col17 {0.000 0.820 0.820 srgb} bind def
/col18 {0.560 0.000 0.000 srgb} bind def
/col19 {0.690 0.000 0.000 srgb} bind def
/col20 {0.820 0.000 0.000 srgb} bind def
/col21 {0.560 0.000 0.560 srgb} bind def
/col22 {0.690 0.000 0.690 srgb} bind def
/col23 {0.820 0.000 0.820 srgb} bind def
/col24 {0.500 0.190 0.000 srgb} bind def
/col25 {0.630 0.250 0.000 srgb} bind def
/col26 {0.750 0.380 0.000 srgb} bind def
/col27 {1.000 0.500 0.500 srgb} bind def
/col28 {1.000 0.630 0.630 srgb} bind def
/col29 {1.000 0.750 0.750 srgb} bind def
/col30 {1.000 0.880 0.880 srgb} bind def
/col31 {1.000 0.840 0.000 srgb} bind def

end
save
newpath 0 177 moveto 0 0 lineto 364 0 lineto 364 177 lineto closepath clip newpath
-102.0 320.3 translate
1 -1 scale

/cp {closepath} bind def
/ef {eofill} bind def
/gr {grestore} bind def
/gs {gsave} bind def
/sa {save} bind def
/rs {restore} bind def
/l {lineto} bind def
/m {moveto} bind def
/rm {rmoveto} bind def
/n {newpath} bind def
/s {stroke} bind def
/sh {show} bind def
/slc {setlinecap} bind def
/slj {setlinejoin} bind def
/slw {setlinewidth} bind def
/srgb {setrgbcolor} bind def
/rot {rotate} bind def
/sc {scale} bind def
/sd {setdash} bind def
/ff {findfont} bind def
/sf {setfont} bind def
/scf {scalefont} bind def
/sw {stringwidth} bind def
/tr {translate} bind def
/tnt {dup dup currentrgbcolor
  4 -2 roll dup 1 exch sub 3 -1 roll mul add
  4 -2 roll dup 1 exch sub 3 -1 roll mul add
  4 -2 roll dup 1 exch sub 3 -1 roll mul add srgb}
  bind def
/shd {dup dup currentrgbcolor 4 -2 roll mul 4 -2 roll mul
  4 -2 roll mul srgb} bind def
/$F2psBegin {$F2psDict begin /$F2psEnteredState save def} def
/$F2psEnd {$F2psEnteredState restore end} def

$F2psBegin
10 setmiterlimit
0 slj 0 slc
 0.06299 0.06299 sc
%
% Fig objects follow
%
% 
% here starts figure with depth 50
% Polyline
7.500 slw
n 2835 3375 m 4230 3375 l 4230 3105 l 2835 3105 l
 cp gs col0 s gr 
% Polyline
n 2250 3375 m
 7380 3375 l gs col0 s gr 
% Polyline
n 5580 3375 m 6975 3375 l 6975 3105 l 5580 3105 l
 cp gs col0 s gr 
/Helvetica ff 180.00 scf sf
2745 3600 m
gs 1 -1 sc (10) col0 sh gr
/Helvetica ff 180.00 scf sf
4140 3600 m
gs 1 -1 sc (30) col0 sh gr
/Helvetica ff 180.00 scf sf
5490 3600 m
gs 1 -1 sc (50) col0 sh gr
/Helvetica ff 180.00 scf sf
6885 3600 m
gs 1 -1 sc (70) col0 sh gr
% Polyline
n 2250 2295 m
 7380 2295 l gs col0 s gr 
% Polyline
n 2835 4545 m 5175 4545 l 5175 4275 l 2835 4275 l
 cp gs col0 s gr 
% Polyline
n 2835 4860 m 4230 4860 l 4230 4590 l 2835 4590 l
 cp gs col0 s gr 
% Polyline
n 2250 4860 m
 7380 4860 l gs col0 s gr 
% Polyline
n 5580 4860 m 6975 4860 l 6975 4590 l 5580 4590 l
 cp gs col0 s gr 
% Polyline
n 6300 4545 m 7200 4545 l 7200 4275 l 6300 4275 l
 cp gs col0 s gr 
% Polyline
15.000 slw
n 2835 4185 m
 5175 4185 l gs col4 s gr 
% Polyline
n 2250 4770 m
 2790 4770 l gs col4 s gr 
% Polyline
n 5220 4770 m
 5535 4770 l gs col4 s gr 
% Polyline
n 5580 4500 m
 6255 4500 l gs col4 s gr 
% Polyline
n 6300 4185 m
 7200 4185 l gs col4 s gr 
/Helvetica ff 180.00 scf sf
2745 2520 m
gs 1 -1 sc (10) col0 sh gr
/Helvetica ff 180.00 scf sf
4140 2520 m
gs 1 -1 sc (30) col0 sh gr
/Helvetica ff 180.00 scf sf
6885 2520 m
gs 1 -1 sc (70) col0 sh gr
/Helvetica ff 180.00 scf sf
5490 2520 m
gs 1 -1 sc (50) col0 sh gr
/Helvetica ff 180.00 scf sf
2745 5085 m
gs 1 -1 sc (10) col0 sh gr
/Helvetica ff 180.00 scf sf
4140 5085 m
gs 1 -1 sc (30) col0 sh gr
/Helvetica ff 180.00 scf sf
5490 5085 m
gs 1 -1 sc (50) col0 sh gr
/Helvetica ff 180.00 scf sf
6885 5085 m
gs 1 -1 sc (70) col0 sh gr
/Helvetica ff 180.00 scf sf
1620 3465 m
gs 1 -1 sc (MS1) col0 sh gr
/Helvetica ff 180.00 scf sf
1620 4905 m
gs 1 -1 sc (MS2) col0 sh gr
% here ends figure;
$F2psEnd
rs
showpage
