%!PS-Adobe-2.0 EPSF-2.0
%%Title: rollback-delegate.dia
%%Creator: Dia v0.90
%%CreationDate: Fri Feb 28 10:49:27 2003
%%For: pascal
%%Magnification: 1.0000
%%Orientation: Portrait
%%BoundingBox: 0 0 1217 495
%%Pages: 1
%%EndComments
%%BeginProlog
/cp {closepath} bind def
/c {curveto} bind def
/f {fill} bind def
/a {arc} bind def
/ef {eofill} bind def
/ex {exch} bind def
/gr {grestore} bind def
/gs {gsave} bind def
/sa {save} bind def
/rs {restore} bind def
/l {lineto} bind def
/m {moveto} bind def
/rm {rmoveto} bind def
/n {newpath} bind def
/s {stroke} bind def
/sh {show} bind def
/slc {setlinecap} bind def
/slj {setlinejoin} bind def
/slw {setlinewidth} bind def
/srgb {setrgbcolor} bind def
/rot {rotate} bind def
/sc {scale} bind def
/sd {setdash} bind def
/ff {findfont} bind def
/sf {setfont} bind def
/scf {scalefont} bind def
/sw {stringwidth pop} bind def
/tr {translate} bind def

/ellipsedict 8 dict def
ellipsedict /mtrx matrix put
/ellipse
{ ellipsedict begin
   /endangle exch def
   /startangle exch def
   /yrad exch def
   /xrad exch def
   /y exch def
   /x exch def   /savematrix mtrx currentmatrix def
   x y tr xrad yrad sc
   0 0 1 startangle endangle arc
   savematrix setmatrix
   end
} def

/mergeprocs {
dup length
3 -1 roll
dup
length
dup
5 1 roll
3 -1 roll
add
array cvx
dup
3 -1 roll
0 exch
putinterval
dup
4 2 roll
putinterval
} bind def
%%EndProlog

%%BeginSetup
%%EndSetup
28.346000 -28.346000 scale
-1.550000 -18.300019 translate

0.863636 0.863636 0.863636 srgb
n 1.600000 5.950019 m 1.600000 18.250019 l 44.400000 18.250019 l 44.400000 5.950019 l f
0.100000 slw
[] 0 sd
[] 0 sd
0 slj
0.000000 0.000000 0.000000 srgb
n 1.600000 5.950019 m 1.600000 18.250019 l 44.400000 18.250019 l 44.400000 5.950019 l cp s
1.000000 1.000000 1.000000 srgb
n 25.670000 15.780019 m 25.670000 17.680019 l 33.106000 17.680019 l 33.106000 15.780019 l f
0.100000 slw
[] 0 sd
[] 0 sd
0 slj
0.000000 0.000000 0.000000 srgb
n 25.670000 15.780019 m 25.670000 17.680019 l 33.106000 17.680019 l 33.106000 15.780019 l cp s
 [ /xi /xi /xi /xi /xi /xi /xi /xi /xi /xi /xi /xi /xi /xi /xi /xi
 /xi /xi /xi /xi /xi /xi /xi /xi /xi /xi /xi /xi /xi /xi /xi /xi
 /J /N /u /k /e /W /a /i /xi /xi /t /s /S /c /F /r
 /m /T /h /d /L /o /M /n /g /H /p /l /comma /space /b /v
 /R /E /one /xi /xi /xi /xi /xi /xi /xi /xi /xi /xi /xi /xi /xi
 /xi /xi /xi /xi /xi /xi /xi /xi /xi /xi /xi /xi /xi /xi /xi /xi
 /xi /xi /xi /xi /xi /xi /xi /xi /xi /xi /xi /xi /xi /xi /xi /xi
 /xi /xi /xi /xi /xi /xi /xi /xi /xi /xi /xi /xi /xi /xi /xi /xi
 /xi /xi /xi /xi /xi /xi /xi /xi /xi /xi /xi /xi /xi /xi /xi /xi
 /xi /xi /xi /xi /xi /xi /xi /xi /xi /xi /xi /xi /xi /xi /xi /xi
 /xi /xi /xi /xi /xi /xi /xi /xi /xi /xi /xi /xi /xi /xi /xi /xi
 /xi /xi /xi /xi /xi /xi /xi /xi /xi /xi /xi /xi /xi /xi /xi /xi
 /xi /xi /xi /xi /xi /xi /xi /xi /xi /xi /xi /xi /xi /xi /xi /xi
 /xi /xi /xi /xi /xi /xi /xi /xi /xi /xi /xi /xi /xi /xi /xi /xi
 /xi /xi /xi /xi /xi /xi /xi /xi /xi /xi /xi /xi /xi /xi /xi /xi
 /xi /xi /xi /xi /xi /xi /xi /xi /xi /xi /xi /xi /xi /xi /xi /xi
] /e0 exch def
/Courier_e0 undefinefont
/Courier_e0
  /Courier findfont
  dup length dict begin
  {1 index /FID ne {def} {pop pop} ifelse} forall
  /Encoding e0 def
  currentdict end
definefont pop
/Courier_e0 ff 0.800000 scf sf
( !"#$%&'*+$*) sw
2 div 29.388000 ex sub 16.926510 m ( !"#$%&'*+$*)
 gs 1 -1 sc sh gr
1.000000 1.000000 1.000000 srgb
n 34.770000 15.680019 m 34.770000 17.580019 l 43.842800 17.580019 l 43.842800 15.680019 l f
0.100000 slw
[] 0 sd
[] 0 sd
0 slj
0.000000 0.000000 0.000000 srgb
n 34.770000 15.680019 m 34.770000 17.580019 l 43.842800 17.580019 l 43.842800 15.680019 l cp s
/Courier_e0 ff 0.800000 scf sf
( !"#$,*&-#./&0$) sw
2 div 39.306400 ex sub 16.826510 m ( !"#$,*&-#./&0$)
 gs 1 -1 sc sh gr
1.000000 1.000000 1.000000 srgb
n 35.770000 11.180019 m 35.770000 13.080019 l 42.713200 13.080019 l 42.713200 11.180019 l f
0.100000 slw
[] 0 sd
[] 0 sd
0 slj
0.000000 0.000000 0.000000 srgb
n 35.770000 11.180019 m 35.770000 13.080019 l 42.713200 13.080019 l 42.713200 11.180019 l cp s
/Courier_e0 ff 0.800000 scf sf
( !"#$12/$&3) sw
2 div 39.241600 ex sub 12.326510 m ( !"#$12/$&3)
 gs 1 -1 sc sh gr
1.000000 1.000000 1.000000 srgb
n 2.290800 10.950000 m 2.290800 12.850000 l 11.909200 12.850000 l 11.909200 10.950000 l f
0.100000 slw
[] 0 sd
[] 0 sd
0 slj
0.000000 0.000000 0.000000 srgb
n 2.290800 10.950000 m 2.290800 12.850000 l 11.909200 12.850000 l 11.909200 10.950000 l cp s
/Courier_e0 ff 0.800000 scf sf
( !"#$45-#6&7&8$/) sw
2 div 7.100000 ex sub 12.096491 m ( !"#$45-#6&7&8$/)
 gs 1 -1 sc sh gr
1.000000 1.000000 1.000000 srgb
n 23.485600 10.950000 m 23.485600 12.850000 l 34.714400 12.850000 l 34.714400 10.950000 l f
0.100000 slw
[] 0 sd
[] 0 sd
0 slj
0.000000 0.000000 0.000000 srgb
n 23.485600 10.950000 m 23.485600 12.850000 l 34.714400 12.850000 l 34.714400 10.950000 l cp s
/Courier_e0 ff 0.800000 scf sf
( !"#$%&'*+$*6&7&8$/) sw
2 div 29.100000 ex sub 12.096491 m ( !"#$%&'*+$*6&7&8$/)
 gs 1 -1 sc sh gr
1.000000 1.000000 1.000000 srgb
n 12.888200 10.950000 m 12.888200 12.850000 l 22.506600 12.850000 l 22.506600 10.950000 l f
0.100000 slw
[] 0 sd
[] 0 sd
0 slj
0.000000 0.000000 0.000000 srgb
n 12.888200 10.950000 m 12.888200 12.850000 l 22.506600 12.850000 l 22.506600 10.950000 l cp s
/Courier_e0 ff 0.800000 scf sf
( !"#$9$&:6&7&8$/) sw
2 div 17.697400 ex sub 12.096491 m ( !"#$9$&:6&7&8$/)
 gs 1 -1 sc sh gr
0.100000 slw
[] 0 sd
[] 0 sd
0 slj
0 slc
n 23.000000 6.850000 m 23.000000 9.100019 l 7.100000 9.100019 l 7.100000 10.950000 l s
0 slj
n 6.700000 10.150000 m 7.100000 10.950000 l 7.500000 10.150000 l f
/Courier_e0 ff 0.800000 scf sf
(+$*6';$+*57$<=/5;;>&-#<=/$05?$6';$+*57$) sw
2 div 23.000000 ex sub 1.500000 m (+$*6';$+*57$<=/5;;>&-#<=/$05?$6';$+*57$)
 gs 1 -1 sc sh gr
0.100000 slw
[] 0 sd
[] 0 sd
0 slj
0 slc
n 23.000000 6.850000 m 23.000000 9.100019 l 17.697400 9.100019 l 17.697400 10.950000 l s
0 slj
n 17.297400 10.150000 m 17.697400 10.950000 l 18.097400 10.150000 l f
0.100000 slw
[] 0 sd
[] 0 sd
0 slj
0 slc
n 23.000000 6.850000 m 23.000000 9.100019 l 29.100000 9.100019 l 29.100000 10.950000 l s
0 slj
n 28.700000 10.150000 m 29.100000 10.950000 l 29.500000 10.150000 l f
1.000000 1.000000 1.000000 srgb
n 35.528400 10.950000 m 35.528400 12.850000 l 42.471600 12.850000 l 42.471600 10.950000 l f
0.100000 slw
[] 0 sd
[] 0 sd
0 slj
0.000000 0.000000 0.000000 srgb
n 35.528400 10.950000 m 35.528400 12.850000 l 42.471600 12.850000 l 42.471600 10.950000 l cp s
/Courier_e0 ff 0.800000 scf sf
( !"#$12/$&3) sw
2 div 39.000000 ex sub 12.096491 m ( !"#$12/$&3)
 gs 1 -1 sc sh gr
1.000000 1.000000 1.000000 srgb
n 34.463600 15.450011 m 34.463600 17.350011 l 43.536400 17.350011 l 43.536400 15.450011 l f
0.100000 slw
[] 0 sd
[] 0 sd
0 slj
0.000000 0.000000 0.000000 srgb
n 34.463600 15.450011 m 34.463600 17.350011 l 43.536400 17.350011 l 43.536400 15.450011 l cp s
/Courier_e0 ff 0.800000 scf sf
( !"#$,*&-#./&0$) sw
2 div 39.000000 ex sub 16.596502 m ( !"#$,*&-#./&0$)
 gs 1 -1 sc sh gr
0.100000 slw
[] 0 sd
[] 0 sd
0 slj
0 slc
n 29.100000 10.950000 m 29.100000 9.100011 l 39.000000 9.100011 l 39.000000 10.950000 l s
0 slj
n 38.600000 10.150000 m 39.000000 10.950000 l 39.400000 10.150000 l f
0.100000 slw
[] 0 sd
[] 0 sd
0 slc
n 39.000000 12.850000 m 39.000000 15.450011 l s
0 slj
n 38.600000 14.650011 m 39.000000 15.450011 l 39.400000 14.650011 l f
1.000000 1.000000 1.000000 srgb
n 16.329600 4.950000 m 16.329600 6.850000 l 29.670400 6.850000 l 29.670400 4.950000 l f
0.100000 slw
[] 0 sd
[] 0 sd
0 slj
0.000000 0.000000 0.000000 srgb
n 16.329600 4.950000 m 16.329600 6.850000 l 29.670400 6.850000 l 29.670400 4.950000 l cp s
/Courier_e0 ff 0.800000 scf sf
( !"#$@"7*'0$A7?'/570$7*) sw
2 div 23.000000 ex sub 6.096491 m ( !"#$@"7*'0$A7?'/570$7*)
 gs 1 -1 sc sh gr
0.100000 slw
[] 0 sd
[] 0 sd
0 slc
n 23.020000 2.180019 m 23.000000 4.950000 l s
0 slj
n 22.605786 4.147133 m 23.000000 4.950000 l 23.405766 4.152909 l f
1.000000 1.000000 1.000000 srgb
n 25.388400 15.480019 m 25.388400 17.380019 l 32.824400 17.380019 l 32.824400 15.480019 l f
0.100000 slw
[] 0 sd
[] 0 sd
0 slj
0.000000 0.000000 0.000000 srgb
n 25.388400 15.480019 m 25.388400 17.380019 l 32.824400 17.380019 l 32.824400 15.480019 l cp s
/Courier_e0 ff 0.800000 scf sf
( !"#$%&'*+$*) sw
2 div 29.106400 ex sub 16.626510 m ( !"#$%&'*+$*)
 gs 1 -1 sc sh gr
0.100000 slw
[] 0 sd
[] 0 sd
0 slc
n 29.100000 12.850000 m 29.106400 15.480019 l s
0 slj
n 28.704454 14.680994 m 29.106400 15.480019 l 29.504452 14.679048 l f
1.000000 1.000000 1.000000 srgb
n 4.443600 15.780019 m 4.443600 17.680019 l 10.295600 17.680019 l 10.295600 15.780019 l f
0.100000 slw
[] 0 sd
[] 0 sd
0 slj
0.000000 0.000000 0.000000 srgb
n 4.443600 15.780019 m 4.443600 17.680019 l 10.295600 17.680019 l 10.295600 15.780019 l cp s
/Courier_e0 ff 0.800000 scf sf
( !"#$45-#) sw
2 div 7.369600 ex sub 16.926510 m ( !"#$45-#)
 gs 1 -1 sc sh gr
1.000000 1.000000 1.000000 srgb
n 4.174000 15.480019 m 4.174000 17.380019 l 10.026000 17.380019 l 10.026000 15.480019 l f
0.100000 slw
[] 0 sd
[] 0 sd
0 slj
0.000000 0.000000 0.000000 srgb
n 4.174000 15.480019 m 4.174000 17.380019 l 10.026000 17.380019 l 10.026000 15.480019 l cp s
/Courier_e0 ff 0.800000 scf sf
( !"#$45-#) sw
2 div 7.100000 ex sub 16.626510 m ( !"#$45-#)
 gs 1 -1 sc sh gr
0.100000 slw
[] 0 sd
[] 0 sd
0 slc
n 7.100000 12.850000 m 7.100000 15.480019 l s
0 slj
n 6.700000 14.680019 m 7.100000 15.480019 l 7.500000 14.680019 l f
/Courier_e0 ff 0.800000 scf sf
(7) sw
2 div 39.850000 ex sub 10.550019 m (7)
 gs 1 -1 sc sh gr
/Courier_e0 ff 0.800000 scf sf
(7) sw
2 div 39.850000 ex sub 15.050019 m (7)
 gs 1 -1 sc sh gr
/Courier_e0 ff 0.800000 scf sf
(7) sw
2 div 30.000000 ex sub 15.150019 m (7)
 gs 1 -1 sc sh gr
/Courier_e0 ff 0.800000 scf sf
(7) sw
2 div 8.000000 ex sub 14.950019 m (7)
 gs 1 -1 sc sh gr
/Courier_e0 ff 0.800000 scf sf
(B) sw
2 div 8.000000 ex sub 10.650019 m (B)
 gs 1 -1 sc sh gr
/Courier_e0 ff 0.800000 scf sf
(B) sw
2 div 18.600000 ex sub 10.650019 m (B)
 gs 1 -1 sc sh gr
/Courier_e0 ff 0.800000 scf sf
(B) sw
2 div 30.000000 ex sub 10.650019 m (B)
 gs 1 -1 sc sh gr
showpage
