(classPool
(JNukeClass "IntOps" "IntOps.java"
  (JNukeMethod "IntOps.<init>" (JNukeSignature "V" (JNukeVector))
  (JNukeByteCodes
    (JNukeRByteCode 0 "r0 = Get" l0 (line 3))
    (JNukeRByteCode 1 "     InvokeSpecial" (JNukeMethod "java/lang/Object.<init>" (JNukeSignature "V" (JNukeVector))) r0)
    (JNukeRByteCode 2 "r0 = Const" int 2 (line 7))
    (JNukeRByteCode 3 "l1 = Get" r0)
    (JNukeRByteCode 4 "r0 = Const" int 3 (line 8))
    (JNukeRByteCode 5 "l2 = Get" r0)
    (JNukeRByteCode 6 "<r0, r1> = Const" long 2 (line 9))
    (JNukeRByteCode 7 "<l3, l4> = Get" r0 r1)
    (JNukeRByteCode 8 "<r0, r1> = Const" long 3 (line 10))
    (JNukeRByteCode 9 "<l5, l6> = Get" r0 r1)
    (JNukeRByteCode 10 "r0 = GetStatic" "java/lang/System" (pair "out" "Ljava/io/PrintStream;") (line 12))
    (JNukeRByteCode 11 "r1 = Get" l1)
    (JNukeRByteCode 12 "r2 = Get" l2)
    (JNukeRByteCode 13 "r1 = Prim" iadd r1 r2)
    (JNukeRByteCode 14 "     InvokeVirtual" (JNukeMethod "java/io/PrintStream.println" (JNukeSignature "V" (JNukeVector "I"))) r0 r1)
    (JNukeRByteCode 15 "r0 = GetStatic" "java/lang/System" (pair "out" "Ljava/io/PrintStream;") (line 13))
    (JNukeRByteCode 16 "r1 = Get" l1)
    (JNukeRByteCode 17 "r2 = Get" l2)
    (JNukeRByteCode 18 "r1 = Prim" iand r1 r2)
    (JNukeRByteCode 19 "     InvokeVirtual" (JNukeMethod "java/io/PrintStream.println" (JNukeSignature "V" (JNukeVector "I"))) r0 r1)
    (JNukeRByteCode 20 "r0 = GetStatic" "java/lang/System" (pair "out" "Ljava/io/PrintStream;") (line 14))
    (JNukeRByteCode 21 "r1 = Get" l1)
    (JNukeRByteCode 22 "r2 = Get" l2)
    (JNukeRByteCode 23 "     Cond" if_icmpne 26 r1 r2)
    (JNukeRByteCode 24 "r1 = Const" int 1)
    (JNukeRByteCode 25 "     Goto" 27)
    (JNukeRByteCode 26 "r1 = Const" int 0)
    (JNukeRByteCode 27 "     InvokeVirtual" (JNukeMethod "java/io/PrintStream.println" (JNukeSignature "V" (JNukeVector "Z"))) r0 r1)
    (JNukeRByteCode 28 "r0 = GetStatic" "java/lang/System" (pair "out" "Ljava/io/PrintStream;") (line 15))
    (JNukeRByteCode 29 "r1 = Get" l1)
    (JNukeRByteCode 30 "r2 = Get" l2)
    (JNukeRByteCode 31 "     Cond" if_icmple 34 r1 r2)
    (JNukeRByteCode 32 "r1 = Const" int 1)
    (JNukeRByteCode 33 "     Goto" 35)
    (JNukeRByteCode 34 "r1 = Const" int 0)
    (JNukeRByteCode 35 "     InvokeVirtual" (JNukeMethod "java/io/PrintStream.println" (JNukeSignature "V" (JNukeVector "Z"))) r0 r1)
    (JNukeRByteCode 36 "r0 = GetStatic" "java/lang/System" (pair "out" "Ljava/io/PrintStream;") (line 16))
    (JNukeRByteCode 37 "r1 = Get" l1)
    (JNukeRByteCode 38 "r2 = Get" l2)
    (JNukeRByteCode 39 "     Cond" if_icmplt 42 r1 r2)
    (JNukeRByteCode 40 "r1 = Const" int 1)
    (JNukeRByteCode 41 "     Goto" 43)
    (JNukeRByteCode 42 "r1 = Const" int 0)
    (JNukeRByteCode 43 "     InvokeVirtual" (JNukeMethod "java/io/PrintStream.println" (JNukeSignature "V" (JNukeVector "Z"))) r0 r1)
    (JNukeRByteCode 44 "r0 = GetStatic" "java/lang/System" (pair "out" "Ljava/io/PrintStream;") (line 17))
    (JNukeRByteCode 45 "r1 = Get" l1)
    (JNukeRByteCode 46 "r2 = Get" l2)
    (JNukeRByteCode 47 "     Cond" if_icmpge 50 r1 r2)
    (JNukeRByteCode 48 "r1 = Const" int 1)
    (JNukeRByteCode 49 "     Goto" 51)
    (JNukeRByteCode 50 "r1 = Const" int 0)
    (JNukeRByteCode 51 "     InvokeVirtual" (JNukeMethod "java/io/PrintStream.println" (JNukeSignature "V" (JNukeVector "Z"))) r0 r1)
    (JNukeRByteCode 52 "r0 = GetStatic" "java/lang/System" (pair "out" "Ljava/io/PrintStream;") (line 18))
    (JNukeRByteCode 53 "r1 = Get" l1)
    (JNukeRByteCode 54 "r2 = Get" l2)
    (JNukeRByteCode 55 "     Cond" if_icmpgt 58 r1 r2)
    (JNukeRByteCode 56 "r1 = Const" int 1)
    (JNukeRByteCode 57 "     Goto" 59)
    (JNukeRByteCode 58 "r1 = Const" int 0)
    (JNukeRByteCode 59 "     InvokeVirtual" (JNukeMethod "java/io/PrintStream.println" (JNukeSignature "V" (JNukeVector "Z"))) r0 r1)
    (JNukeRByteCode 60 "r0 = GetStatic" "java/lang/System" (pair "out" "Ljava/io/PrintStream;") (line 19))
    (JNukeRByteCode 61 "r1 = Get" l1)
    (JNukeRByteCode 62 "r2 = Get" l2)
    (JNukeRByteCode 63 "r1 = Prim" idiv r1 r2)
    (JNukeRByteCode 64 "     InvokeVirtual" (JNukeMethod "java/io/PrintStream.println" (JNukeSignature "V" (JNukeVector "I"))) r0 r1)
    (JNukeRByteCode 65 "r0 = GetStatic" "java/lang/System" (pair "out" "Ljava/io/PrintStream;") (line 20))
    (JNukeRByteCode 66 "r1 = Get" l1)
    (JNukeRByteCode 67 "r2 = Get" l2)
    (JNukeRByteCode 68 "r1 = Prim" imul r1 r2)
    (JNukeRByteCode 69 "     InvokeVirtual" (JNukeMethod "java/io/PrintStream.println" (JNukeSignature "V" (JNukeVector "I"))) r0 r1)
    (JNukeRByteCode 70 "r0 = GetStatic" "java/lang/System" (pair "out" "Ljava/io/PrintStream;") (line 21))
    (JNukeRByteCode 71 "r1 = Get" l1)
    (JNukeRByteCode 72 "r1 = Prim" ineg r1)
    (JNukeRByteCode 73 "     InvokeVirtual" (JNukeMethod "java/io/PrintStream.println" (JNukeSignature "V" (JNukeVector "I"))) r0 r1)
    (JNukeRByteCode 74 "r0 = GetStatic" "java/lang/System" (pair "out" "Ljava/io/PrintStream;") (line 22))
    (JNukeRByteCode 75 "r1 = Get" l1)
    (JNukeRByteCode 76 "r2 = Get" l2)
    (JNukeRByteCode 77 "r1 = Prim" ior r1 r2)
    (JNukeRByteCode 78 "     InvokeVirtual" (JNukeMethod "java/io/PrintStream.println" (JNukeSignature "V" (JNukeVector "I"))) r0 r1)
    (JNukeRByteCode 79 "r0 = GetStatic" "java/lang/System" (pair "out" "Ljava/io/PrintStream;") (line 23))
    (JNukeRByteCode 80 "r1 = Get" l1)
    (JNukeRByteCode 81 "r2 = Get" l2)
    (JNukeRByteCode 82 "r1 = Prim" irem r1 r2)
    (JNukeRByteCode 83 "     InvokeVirtual" (JNukeMethod "java/io/PrintStream.println" (JNukeSignature "V" (JNukeVector "I"))) r0 r1)
    (JNukeRByteCode 84 "r0 = GetStatic" "java/lang/System" (pair "out" "Ljava/io/PrintStream;") (line 24))
    (JNukeRByteCode 85 "r1 = Get" l1)
    (JNukeRByteCode 86 "r2 = Get" l2)
    (JNukeRByteCode 87 "r1 = Prim" ishl r1 r2)
    (JNukeRByteCode 88 "     InvokeVirtual" (JNukeMethod "java/io/PrintStream.println" (JNukeSignature "V" (JNukeVector "I"))) r0 r1)
    (JNukeRByteCode 89 "r0 = GetStatic" "java/lang/System" (pair "out" "Ljava/io/PrintStream;") (line 25))
    (JNukeRByteCode 90 "r1 = Get" l1)
    (JNukeRByteCode 91 "r2 = Get" l2)
    (JNukeRByteCode 92 "r1 = Prim" ishr r1 r2)
    (JNukeRByteCode 93 "     InvokeVirtual" (JNukeMethod "java/io/PrintStream.println" (JNukeSignature "V" (JNukeVector "I"))) r0 r1)
    (JNukeRByteCode 94 "r0 = GetStatic" "java/lang/System" (pair "out" "Ljava/io/PrintStream;") (line 26))
    (JNukeRByteCode 95 "r1 = Get" l1)
    (JNukeRByteCode 96 "r2 = Get" l2)
    (JNukeRByteCode 97 "r1 = Prim" isub r1 r2)
    (JNukeRByteCode 98 "     InvokeVirtual" (JNukeMethod "java/io/PrintStream.println" (JNukeSignature "V" (JNukeVector "I"))) r0 r1)
    (JNukeRByteCode 99 "r0 = GetStatic" "java/lang/System" (pair "out" "Ljava/io/PrintStream;") (line 27))
    (JNukeRByteCode 100 "r1 = Get" l1)
    (JNukeRByteCode 101 "r2 = Get" l2)
    (JNukeRByteCode 102 "r1 = Prim" iushr r1 r2)
    (JNukeRByteCode 103 "     InvokeVirtual" (JNukeMethod "java/io/PrintStream.println" (JNukeSignature "V" (JNukeVector "I"))) r0 r1)
    (JNukeRByteCode 104 "r0 = GetStatic" "java/lang/System" (pair "out" "Ljava/io/PrintStream;") (line 28))
    (JNukeRByteCode 105 "r1 = Get" l1)
    (JNukeRByteCode 106 "r2 = Get" l2)
    (JNukeRByteCode 107 "r1 = Prim" ixor r1 r2)
    (JNukeRByteCode 108 "     InvokeVirtual" (JNukeMethod "java/io/PrintStream.println" (JNukeSignature "V" (JNukeVector "I"))) r0 r1)
    (JNukeRByteCode 109 "r0 = GetStatic" "java/lang/System" (pair "out" "Ljava/io/PrintStream;") (line 30))
    (JNukeRByteCode 110 "<r1, r2> = Get" l3 l4)
    (JNukeRByteCode 111 "<r3, r4> = Get" l5 l6)
    (JNukeRByteCode 112 "<r1, r2> = Prim" ladd r1 r2 r3 r4)
    (JNukeRByteCode 113 "     InvokeVirtual" (JNukeMethod "java/io/PrintStream.println" (JNukeSignature "V" (JNukeVector "J"))) r0 r1 r2)
    (JNukeRByteCode 114 "r0 = GetStatic" "java/lang/System" (pair "out" "Ljava/io/PrintStream;") (line 31))
    (JNukeRByteCode 115 "<r1, r2> = Get" l3 l4)
    (JNukeRByteCode 116 "<r3, r4> = Get" l5 l6)
    (JNukeRByteCode 117 "<r1, r2> = Prim" land r1 r2 r3 r4)
    (JNukeRByteCode 118 "     InvokeVirtual" (JNukeMethod "java/io/PrintStream.println" (JNukeSignature "V" (JNukeVector "J"))) r0 r1 r2)
    (JNukeRByteCode 119 "r0 = GetStatic" "java/lang/System" (pair "out" "Ljava/io/PrintStream;") (line 32))
    (JNukeRByteCode 120 "<r1, r2> = Get" l3 l4)
    (JNukeRByteCode 121 "<r3, r4> = Get" l5 l6)
    (JNukeRByteCode 122 "r1 = Prim" lcmp r1 r2 r3 r4)
    (JNukeRByteCode 123 "     Cond" ifne 126 r1)
    (JNukeRByteCode 124 "r1 = Const" int 1)
    (JNukeRByteCode 125 "     Goto" 127)
    (JNukeRByteCode 126 "r1 = Const" int 0)
    (JNukeRByteCode 127 "     InvokeVirtual" (JNukeMethod "java/io/PrintStream.println" (JNukeSignature "V" (JNukeVector "Z"))) r0 r1)
    (JNukeRByteCode 128 "r0 = GetStatic" "java/lang/System" (pair "out" "Ljava/io/PrintStream;") (line 33))
    (JNukeRByteCode 129 "<r1, r2> = Get" l3 l4)
    (JNukeRByteCode 130 "<r3, r4> = Get" l5 l6)
    (JNukeRByteCode 131 "<r1, r2> = Prim" ldiv r1 r2 r3 r4)
    (JNukeRByteCode 132 "     InvokeVirtual" (JNukeMethod "java/io/PrintStream.println" (JNukeSignature "V" (JNukeVector "J"))) r0 r1 r2)
    (JNukeRByteCode 133 "r0 = GetStatic" "java/lang/System" (pair "out" "Ljava/io/PrintStream;") (line 34))
    (JNukeRByteCode 134 "<r1, r2> = Get" l3 l4)
    (JNukeRByteCode 135 "<r3, r4> = Get" l5 l6)
    (JNukeRByteCode 136 "<r1, r2> = Prim" lmul r1 r2 r3 r4)
    (JNukeRByteCode 137 "     InvokeVirtual" (JNukeMethod "java/io/PrintStream.println" (JNukeSignature "V" (JNukeVector "J"))) r0 r1 r2)
    (JNukeRByteCode 138 "r0 = GetStatic" "java/lang/System" (pair "out" "Ljava/io/PrintStream;") (line 35))
    (JNukeRByteCode 139 "<r1, r2> = Get" l3 l4)
    (JNukeRByteCode 140 "<r1, r2> = Prim" lneg r1 r2)
    (JNukeRByteCode 141 "     InvokeVirtual" (JNukeMethod "java/io/PrintStream.println" (JNukeSignature "V" (JNukeVector "J"))) r0 r1 r2)
    (JNukeRByteCode 142 "r0 = GetStatic" "java/lang/System" (pair "out" "Ljava/io/PrintStream;") (line 36))
    (JNukeRByteCode 143 "<r1, r2> = Get" l3 l4)
    (JNukeRByteCode 144 "<r3, r4> = Get" l5 l6)
    (JNukeRByteCode 145 "<r1, r2> = Prim" lor r1 r2 r3 r4)
    (JNukeRByteCode 146 "     InvokeVirtual" (JNukeMethod "java/io/PrintStream.println" (JNukeSignature "V" (JNukeVector "J"))) r0 r1 r2)
    (JNukeRByteCode 147 "r0 = GetStatic" "java/lang/System" (pair "out" "Ljava/io/PrintStream;") (line 37))
    (JNukeRByteCode 148 "<r1, r2> = Get" l3 l4)
    (JNukeRByteCode 149 "<r3, r4> = Get" l5 l6)
    (JNukeRByteCode 150 "<r1, r2> = Prim" lrem r1 r2 r3 r4)
    (JNukeRByteCode 151 "     InvokeVirtual" (JNukeMethod "java/io/PrintStream.println" (JNukeSignature "V" (JNukeVector "J"))) r0 r1 r2)
    (JNukeRByteCode 152 "r0 = GetStatic" "java/lang/System" (pair "out" "Ljava/io/PrintStream;") (line 38))
    (JNukeRByteCode 153 "<r1, r2> = Get" l3 l4)
    (JNukeRByteCode 154 "<r3, r4> = Get" l5 l6)
    (JNukeRByteCode 155 "r3 = Prim" l2i r3 r4)
    (JNukeRByteCode 156 "<r1, r2> = Prim" lshl r1 r2 r3)
    (JNukeRByteCode 157 "     InvokeVirtual" (JNukeMethod "java/io/PrintStream.println" (JNukeSignature "V" (JNukeVector "J"))) r0 r1 r2)
    (JNukeRByteCode 158 "r0 = GetStatic" "java/lang/System" (pair "out" "Ljava/io/PrintStream;") (line 39))
    (JNukeRByteCode 159 "<r1, r2> = Get" l3 l4)
    (JNukeRByteCode 160 "<r3, r4> = Get" l5 l6)
    (JNukeRByteCode 161 "r3 = Prim" l2i r3 r4)
    (JNukeRByteCode 162 "<r1, r2> = Prim" lshr r1 r2 r3)
    (JNukeRByteCode 163 "     InvokeVirtual" (JNukeMethod "java/io/PrintStream.println" (JNukeSignature "V" (JNukeVector "J"))) r0 r1 r2)
    (JNukeRByteCode 164 "r0 = GetStatic" "java/lang/System" (pair "out" "Ljava/io/PrintStream;") (line 40))
    (JNukeRByteCode 165 "<r1, r2> = Get" l3 l4)
    (JNukeRByteCode 166 "<r3, r4> = Get" l5 l6)
    (JNukeRByteCode 167 "<r1, r2> = Prim" lsub r1 r2 r3 r4)
    (JNukeRByteCode 168 "     InvokeVirtual" (JNukeMethod "java/io/PrintStream.println" (JNukeSignature "V" (JNukeVector "J"))) r0 r1 r2)
    (JNukeRByteCode 169 "r0 = GetStatic" "java/lang/System" (pair "out" "Ljava/io/PrintStream;") (line 41))
    (JNukeRByteCode 170 "<r1, r2> = Get" l3 l4)
    (JNukeRByteCode 171 "<r3, r4> = Get" l5 l6)
    (JNukeRByteCode 172 "r3 = Prim" l2i r3 r4)
    (JNukeRByteCode 173 "<r1, r2> = Prim" lushr r1 r2 r3)
    (JNukeRByteCode 174 "     InvokeVirtual" (JNukeMethod "java/io/PrintStream.println" (JNukeSignature "V" (JNukeVector "J"))) r0 r1 r2)
    (JNukeRByteCode 175 "r0 = GetStatic" "java/lang/System" (pair "out" "Ljava/io/PrintStream;") (line 42))
    (JNukeRByteCode 176 "<r1, r2> = Get" l3 l4)
    (JNukeRByteCode 177 "<r3, r4> = Get" l5 l6)
    (JNukeRByteCode 178 "<r1, r2> = Prim" lxor r1 r2 r3 r4)
    (JNukeRByteCode 179 "     InvokeVirtual" (JNukeMethod "java/io/PrintStream.println" (JNukeSignature "V" (JNukeVector "J"))) r0 r1 r2)
    (JNukeRByteCode 180 "     Return" void (line 43))
))
)
)
