%!PS-Adobe-2.0 EPSF-2.0
%%Title: revlockexampleII.dia
%%Creator: Dia v0.90
%%CreationDate: Tue Mar 11 08:52:56 2003
%%For: pascal
%%Magnification: 1.0000
%%Orientation: Portrait
%%BoundingBox: 0 0 868 444
%%Pages: 1
%%EndComments
%%BeginProlog
/cp {closepath} bind def
/c {curveto} bind def
/f {fill} bind def
/a {arc} bind def
/ef {eofill} bind def
/ex {exch} bind def
/gr {grestore} bind def
/gs {gsave} bind def
/sa {save} bind def
/rs {restore} bind def
/l {lineto} bind def
/m {moveto} bind def
/rm {rmoveto} bind def
/n {newpath} bind def
/s {stroke} bind def
/sh {show} bind def
/slc {setlinecap} bind def
/slj {setlinejoin} bind def
/slw {setlinewidth} bind def
/srgb {setrgbcolor} bind def
/rot {rotate} bind def
/sc {scale} bind def
/sd {setdash} bind def
/ff {findfont} bind def
/sf {setfont} bind def
/scf {scalefont} bind def
/sw {stringwidth pop} bind def
/tr {translate} bind def

/ellipsedict 8 dict def
ellipsedict /mtrx matrix put
/ellipse
{ ellipsedict begin
   /endangle exch def
   /startangle exch def
   /yrad exch def
   /xrad exch def
   /y exch def
   /x exch def   /savematrix mtrx currentmatrix def
   x y tr xrad yrad sc
   0 0 1 startangle endangle arc
   savematrix setmatrix
   end
} def

/mergeprocs {
dup length
3 -1 roll
dup
length
dup
5 1 roll
3 -1 roll
add
array cvx
dup
3 -1 roll
0 exch
putinterval
dup
4 2 roll
putinterval
} bind def
%%EndProlog

%%BeginSetup
%%EndSetup
28.346000 -28.346000 scale
5.493502 -18.100000 translate

1.000000 1.000000 1.000000 srgb
n 11.391800 2.500000 m 11.391800 4.400000 l 13.451000 4.400000 l 13.451000 2.500000 l f
0.100000 slw
[] 0 sd
[] 0 sd
0 slj
0.000000 0.000000 0.000000 srgb
n 11.391800 2.500000 m 11.391800 4.400000 l 13.451000 4.400000 l 13.451000 2.500000 l cp s
 [ /xi /xi /xi /xi /xi /xi /xi /xi /xi /xi /xi /xi /xi /xi /xi /xi
 /xi /xi /xi /xi /xi /xi /xi /xi /xi /xi /xi /xi /xi /xi /xi /xi
 /T /one /zero /period /space /c /a /n /xi /xi /o /t /b /i /three /w
 /h /s /e /l /d /k /four /y /two /xi /xi /xi /xi /xi /xi /xi
 /xi /xi /xi /xi /xi /xi /xi /xi /xi /xi /xi /xi /xi /xi /xi /xi
 /xi /xi /xi /xi /xi /xi /xi /xi /xi /xi /xi /xi /xi /xi /xi /xi
 /xi /xi /xi /xi /xi /xi /xi /xi /xi /xi /xi /xi /xi /xi /xi /xi
 /xi /xi /xi /xi /xi /xi /xi /xi /xi /xi /xi /xi /xi /xi /xi /xi
 /xi /xi /xi /xi /xi /xi /xi /xi /xi /xi /xi /xi /xi /xi /xi /xi
 /xi /xi /xi /xi /xi /xi /xi /xi /xi /xi /xi /xi /xi /xi /xi /xi
 /xi /xi /xi /xi /xi /xi /xi /xi /xi /xi /xi /xi /xi /xi /xi /xi
 /xi /xi /xi /xi /xi /xi /xi /xi /xi /xi /xi /xi /xi /xi /xi /xi
 /xi /xi /xi /xi /xi /xi /xi /xi /xi /xi /xi /xi /xi /xi /xi /xi
 /xi /xi /xi /xi /xi /xi /xi /xi /xi /xi /xi /xi /xi /xi /xi /xi
 /xi /xi /xi /xi /xi /xi /xi /xi /xi /xi /xi /xi /xi /xi /xi /xi
 /xi /xi /xi /xi /xi /xi /xi /xi /xi /xi /xi /xi /xi /xi /xi /xi
] /e0 exch def
/Courier_e0 undefinefont
/Courier_e0
  /Courier findfont
  dup length dict begin
  {1 index /FID ne {def} {pop pop} ifelse} forall
  /Encoding e0 def
  currentdict end
definefont pop
/Courier_e0 ff 0.800000 scf sf
( !) sw
2 div 12.421400 ex sub 3.646491 m ( !)
 gs 1 -1 sc sh gr
1.000000 1.000000 1.000000 srgb
n 11.405000 16.150000 m 11.405000 18.050000 l 13.437800 18.050000 l 13.437800 16.150000 l f
0.100000 slw
[] 0 sd
[] 0 sd
0 slj
0.000000 0.000000 0.000000 srgb
n 11.405000 16.150000 m 11.405000 18.050000 l 13.437800 18.050000 l 13.437800 16.150000 l cp s
/Courier_e0 ff 0.800000 scf sf
( ") sw
2 div 12.421400 ex sub 17.296491 m ( ")
 gs 1 -1 sc sh gr
0.100000 slw
[] 0 sd
[] 0 sd
0 slc
n 12.538841 10.754670 7.361402 7.361402 277.117874 348.404334 ellipse s
0 slj
n 19.197361 8.571729 m 19.750000 9.275000 l 19.981033 8.410926 l f
0.100000 slw
[] 0 sd
[] 0 sd
0 slc
n 12.526593 9.780006 7.376491 7.376491 11.693144 82.904214 ellipse s
0 slj
n 14.182261 16.604241 m 13.437800 17.100000 l 14.281084 17.398114 l f
0.100000 slw
[] 0 sd
[] 0 sd
0 slc
n 12.323585 10.083336 7.076537 7.076537 97.458449 170.214753 ellipse s
0 slj
n 5.880145 12.006413 m 5.350000 11.286034 l 5.091784 12.142378 l f
0.100000 slw
[] 0 sd
[] 0 sd
0 slc
n 12.311428 10.451930 7.062064 7.062064 189.684210 262.517643 ellipse s
0 slj
n 10.650700 3.950771 m 11.391800 3.450000 l 10.546524 3.157583 l f
/Helvetica_e0 undefinefont
/Helvetica_e0
  /Helvetica findfont
  dup length dict begin
  {1 index /FID ne {def} {pop pop} ifelse} forall
  /Encoding e0 def
  currentdict end
definefont pop
/Helvetica_e0 ff 0.800000 scf sf
(!#$$%&''*+$*,+&-') sw
2 div 20.550098 ex sub 5.050010 m (!#$$%&''*+$*,+&-')
 gs 1 -1 sc sh gr
/Helvetica_e0 ff 0.800000 scf sf
(.#$/0*12$3&1+$0234$3*%5$-1) sw
2 div 1.405698 ex sub 14.766501 m (.#$/0*12$3&1+$0234$3*%5$-1)
 gs 1 -1 sc sh gr
/Helvetica_e0 ff 0.800000 scf sf
(6#$3*%524$,7) sw
2 div 5.005698 ex sub 5.066501 m (6#$3*%524$,7)
 gs 1 -1 sc sh gr
1.000000 1.000000 1.000000 srgb
n 19.750000 10.275000 1.000000 1.000000 0 360 ellipse f
0.100000 slw
[] 0 sd
[] 0 sd
0 slj
0.000000 0.000000 0.000000 srgb
n 19.750000 10.275000 1.000000 1.000000 0 360 ellipse cp s
/Courier_e0 ff 0.800000 scf sf
(&) sw
2 div 19.750000 ex sub 10.471491 m (&)
 gs 1 -1 sc sh gr
1.000000 1.000000 1.000000 srgb
n 5.350000 10.275000 1.011034 1.011034 0 360 ellipse f
0.100000 slw
[] 0 sd
[] 0 sd
0 slj
0.000000 0.000000 0.000000 srgb
n 5.350000 10.275000 1.011034 1.011034 0 360 ellipse cp s
/Courier_e0 ff 0.800000 scf sf
(,) sw
2 div 5.350000 ex sub 10.471491 m (,)
 gs 1 -1 sc sh gr
/Helvetica_e0 ff 0.800000 scf sf
(8#$3*%524$,7) sw
2 div 21.005698 ex sub 14.666501 m (8#$3*%524$,7)
 gs 1 -1 sc sh gr
showpage
