%!PS-Adobe-2.0 EPSF-2.0
%%Title: netconcept.fig
%%Creator: fig2dev Version 3.2 Patchlevel 4
%%CreationDate: Mon Mar 14 20:48:27 2005
%%For: zboris@linux (Boris Z.)
%%BoundingBox: 0 0 433 137
%%Magnification: 1.0000
%%EndComments
/$F2psDict 200 dict def
$F2psDict begin
$F2psDict /mtrx matrix put
/col-1 {0 setgray} bind def
/col0 {0.000 0.000 0.000 srgb} bind def
/col1 {0.000 0.000 1.000 srgb} bind def
/col2 {0.000 1.000 0.000 srgb} bind def
/col3 {0.000 1.000 1.000 srgb} bind def
/col4 {1.000 0.000 0.000 srgb} bind def
/col5 {1.000 0.000 1.000 srgb} bind def
/col6 {1.000 1.000 0.000 srgb} bind def
/col7 {1.000 1.000 1.000 srgb} bind def
/col8 {0.000 0.000 0.560 srgb} bind def
/col9 {0.000 0.000 0.690 srgb} bind def
/col10 {0.000 0.000 0.820 srgb} bind def
/col11 {0.530 0.810 1.000 srgb} bind def
/col12 {0.000 0.560 0.000 srgb} bind def
/col13 {0.000 0.690 0.000 srgb} bind def
/col14 {0.000 0.820 0.000 srgb} bind def
/col15 {0.000 0.560 0.560 srgb} bind def
/col16 {0.000 0.690 0.690 srgb} bind def
/col17 {0.000 0.820 0.820 srgb} bind def
/col18 {0.560 0.000 0.000 srgb} bind def
/col19 {0.690 0.000 0.000 srgb} bind def
/col20 {0.820 0.000 0.000 srgb} bind def
/col21 {0.560 0.000 0.560 srgb} bind def
/col22 {0.690 0.000 0.690 srgb} bind def
/col23 {0.820 0.000 0.820 srgb} bind def
/col24 {0.500 0.190 0.000 srgb} bind def
/col25 {0.630 0.250 0.000 srgb} bind def
/col26 {0.750 0.380 0.000 srgb} bind def
/col27 {1.000 0.500 0.500 srgb} bind def
/col28 {1.000 0.630 0.630 srgb} bind def
/col29 {1.000 0.750 0.750 srgb} bind def
/col30 {1.000 0.880 0.880 srgb} bind def
/col31 {1.000 0.840 0.000 srgb} bind def

end
save
newpath 0 137 moveto 0 0 lineto 433 0 lineto 433 137 lineto closepath clip newpath
-104.9 294.8 translate
1 -1 scale

/cp {closepath} bind def
/ef {eofill} bind def
/gr {grestore} bind def
/gs {gsave} bind def
/sa {save} bind def
/rs {restore} bind def
/l {lineto} bind def
/m {moveto} bind def
/rm {rmoveto} bind def
/n {newpath} bind def
/s {stroke} bind def
/sh {show} bind def
/slc {setlinecap} bind def
/slj {setlinejoin} bind def
/slw {setlinewidth} bind def
/srgb {setrgbcolor} bind def
/rot {rotate} bind def
/sc {scale} bind def
/sd {setdash} bind def
/ff {findfont} bind def
/sf {setfont} bind def
/scf {scalefont} bind def
/sw {stringwidth} bind def
/tr {translate} bind def
/tnt {dup dup currentrgbcolor
  4 -2 roll dup 1 exch sub 3 -1 roll mul add
  4 -2 roll dup 1 exch sub 3 -1 roll mul add
  4 -2 roll dup 1 exch sub 3 -1 roll mul add srgb}
  bind def
/shd {dup dup currentrgbcolor 4 -2 roll mul 4 -2 roll mul
  4 -2 roll mul srgb} bind def
/reencdict 12 dict def /ReEncode { reencdict begin
/newcodesandnames exch def /newfontname exch def /basefontname exch def
/basefontdict basefontname findfont def /newfont basefontdict maxlength dict def
basefontdict { exch dup /FID ne { dup /Encoding eq
{ exch dup length array copy newfont 3 1 roll put }
{ exch newfont 3 1 roll put } ifelse } { pop pop } ifelse } forall
newfont /FontName newfontname put newcodesandnames aload pop
128 1 255 { newfont /Encoding get exch /.notdef put } for
newcodesandnames length 2 idiv { newfont /Encoding get 3 1 roll put } repeat
newfontname newfont definefont pop end } def
/isovec [
8#055 /minus 8#200 /grave 8#201 /acute 8#202 /circumflex 8#203 /tilde
8#204 /macron 8#205 /breve 8#206 /dotaccent 8#207 /dieresis
8#210 /ring 8#211 /cedilla 8#212 /hungarumlaut 8#213 /ogonek 8#214 /caron
8#220 /dotlessi 8#230 /oe 8#231 /OE
8#240 /space 8#241 /exclamdown 8#242 /cent 8#243 /sterling
8#244 /currency 8#245 /yen 8#246 /brokenbar 8#247 /section 8#250 /dieresis
8#251 /copyright 8#252 /ordfeminine 8#253 /guillemotleft 8#254 /logicalnot
8#255 /hyphen 8#256 /registered 8#257 /macron 8#260 /degree 8#261 /plusminus
8#262 /twosuperior 8#263 /threesuperior 8#264 /acute 8#265 /mu 8#266 /paragraph
8#267 /periodcentered 8#270 /cedilla 8#271 /onesuperior 8#272 /ordmasculine
8#273 /guillemotright 8#274 /onequarter 8#275 /onehalf
8#276 /threequarters 8#277 /questiondown 8#300 /Agrave 8#301 /Aacute
8#302 /Acircumflex 8#303 /Atilde 8#304 /Adieresis 8#305 /Aring
8#306 /AE 8#307 /Ccedilla 8#310 /Egrave 8#311 /Eacute
8#312 /Ecircumflex 8#313 /Edieresis 8#314 /Igrave 8#315 /Iacute
8#316 /Icircumflex 8#317 /Idieresis 8#320 /Eth 8#321 /Ntilde 8#322 /Ograve
8#323 /Oacute 8#324 /Ocircumflex 8#325 /Otilde 8#326 /Odieresis 8#327 /multiply
8#330 /Oslash 8#331 /Ugrave 8#332 /Uacute 8#333 /Ucircumflex
8#334 /Udieresis 8#335 /Yacute 8#336 /Thorn 8#337 /germandbls 8#340 /agrave
8#341 /aacute 8#342 /acircumflex 8#343 /atilde 8#344 /adieresis 8#345 /aring
8#346 /ae 8#347 /ccedilla 8#350 /egrave 8#351 /eacute
8#352 /ecircumflex 8#353 /edieresis 8#354 /igrave 8#355 /iacute
8#356 /icircumflex 8#357 /idieresis 8#360 /eth 8#361 /ntilde 8#362 /ograve
8#363 /oacute 8#364 /ocircumflex 8#365 /otilde 8#366 /odieresis 8#367 /divide
8#370 /oslash 8#371 /ugrave 8#372 /uacute 8#373 /ucircumflex
8#374 /udieresis 8#375 /yacute 8#376 /thorn 8#377 /ydieresis] def
/Helvetica /Helvetica-iso isovec ReEncode
/$F2psBegin {$F2psDict begin /$F2psEnteredState save def} def
/$F2psEnd {$F2psEnteredState restore end} def

$F2psBegin
10 setmiterlimit
0 slj 0 slc
 0.06299 0.06299 sc
%
% Fig objects follow
%
% 
% here starts figure with depth 50
% Polyline
7.500 slw
n 4905 4005 m 4950 4005 l 4950 4095 l 4905 4095 l
 cp gs col0 s gr 
% Polyline
n 4995 4005 m 5040 4005 l 5040 4095 l 4995 4095 l
 cp gs col0 s gr 
% Polyline
n 5085 4005 m 5130 4005 l 5130 4095 l 5085 4095 l
 cp gs col0 s gr 
% Polyline
n 5175 4005 m 5220 4005 l 5220 4095 l 5175 4095 l
 cp gs col0 s gr 
% Polyline
n 5265 4005 m 5310 4005 l 5310 4095 l 5265 4095 l
 cp gs col0 s gr 
% Polyline
n 5355 4005 m 5400 4005 l 5400 4095 l 5355 4095 l
 cp gs col0 s gr 
% Polyline
n 5445 4005 m 5490 4005 l 5490 4095 l 5445 4095 l
 cp gs col0 s gr 
% Polyline
n 4770 3960 m 5535 3960 l 5535 4230 l 4770 4230 l
 cp gs col0 s gr 
% Polyline
n 4815 4005 m 4860 4005 l 4860 4095 l 4815 4095 l
 cp gs col0 s gr 
% Polyline
n 2160 2520 m 3330 2520 l 3330 4320 l 2160 4320 l
 cp gs col0 s gr 
% Polyline
n 7020 2520 m 8190 2520 l 8190 4320 l 7020 4320 l
 cp gs col0 s gr 
% Polyline
n 2205 2565 m 3285 2565 l 3285 2880 l 2205 2880 l
 cp gs col0 s gr 
% Polyline
n 2205 2925 m 3285 2925 l 3285 3240 l 2205 3240 l
 cp gs col0 s gr 
% Polyline
n 7065 2565 m 8145 2565 l 8145 2880 l 7065 2880 l
 cp gs col0 s gr 
% Polyline
n 7065 2925 m 8145 2925 l 8145 3240 l 7065 3240 l
 cp gs col0 s gr 
% Polyline
n 2880 3330 m 3285 3330 l 3285 3375 l 2880 3375 l
 cp gs col0 s gr 
% Polyline
n 7740 3330 m 8145 3330 l 8145 3375 l 7740 3375 l
 cp gs col0 s gr 
% Polyline
n 3330 3825 m 4860 3825 l
 4860 3960 l gs col0 s gr 
% Polyline
n 5040 3960 m 5040 3825 l
 7020 3825 l gs col0 s gr 
% Polyline
gs  clippath
6945 3540 m 6945 3480 l 6794 3480 l 6914 3510 l 6794 3540 l cp
3405 3480 m 3405 3540 l 3556 3540 l 3436 3510 l 3556 3480 l cp
eoclip
n 3420 3510 m
 6930 3510 l gs col0 s gr gr

% arrowhead
n 3556 3480 m 3436 3510 l 3556 3540 l 3556 3480 l  cp gs 0.00 setgray ef gr  col0 s
% arrowhead
n 6794 3540 m 6914 3510 l 6794 3480 l 6794 3540 l  cp gs 0.00 setgray ef gr  col0 s
% Polyline
n 8055 3420 m 8145 3420 l 8145 3510 l 8055 3510 l
 cp gs col0 s gr 
% Polyline
n 3195 3420 m 3285 3420 l 3285 3510 l 3195 3510 l
 cp gs col0 s gr 
/Helvetica-iso ff 180.00 scf sf
1665 4635 m
gs 1 -1 sc (Getestete Applikation unter JNuke) col0 sh gr
/Helvetica-iso ff 180.00 scf sf
4230 3465 m
gs 1 -1 sc (Netzwerk-Kommunikation) col0 sh gr
/Helvetica-iso ff 180.00 scf sf
6795 4635 m
gs 1 -1 sc (Entfernte Applikation) col0 sh gr
% here ends figure;
$F2psEnd
rs
showpage
