%!PS-Adobe-2.0 EPSF-2.0
%%Title: /home/zboris/semesterarbeit/doku/rollback.fig
%%Creator: fig2dev Version 3.2 Patchlevel 4
%%CreationDate: Sun Mar 20 21:06:06 2005
%%For: zboris@linux (Boris Z.)
%%BoundingBox: 0 0 248 273
%%Magnification: 1.0000
%%EndComments
/$F2psDict 200 dict def
$F2psDict begin
$F2psDict /mtrx matrix put
/col-1 {0 setgray} bind def
/col0 {0.000 0.000 0.000 srgb} bind def
/col1 {0.000 0.000 1.000 srgb} bind def
/col2 {0.000 1.000 0.000 srgb} bind def
/col3 {0.000 1.000 1.000 srgb} bind def
/col4 {1.000 0.000 0.000 srgb} bind def
/col5 {1.000 0.000 1.000 srgb} bind def
/col6 {1.000 1.000 0.000 srgb} bind def
/col7 {1.000 1.000 1.000 srgb} bind def
/col8 {0.000 0.000 0.560 srgb} bind def
/col9 {0.000 0.000 0.690 srgb} bind def
/col10 {0.000 0.000 0.820 srgb} bind def
/col11 {0.530 0.810 1.000 srgb} bind def
/col12 {0.000 0.560 0.000 srgb} bind def
/col13 {0.000 0.690 0.000 srgb} bind def
/col14 {0.000 0.820 0.000 srgb} bind def
/col15 {0.000 0.560 0.560 srgb} bind def
/col16 {0.000 0.690 0.690 srgb} bind def
/col17 {0.000 0.820 0.820 srgb} bind def
/col18 {0.560 0.000 0.000 srgb} bind def
/col19 {0.690 0.000 0.000 srgb} bind def
/col20 {0.820 0.000 0.000 srgb} bind def
/col21 {0.560 0.000 0.560 srgb} bind def
/col22 {0.690 0.000 0.690 srgb} bind def
/col23 {0.820 0.000 0.820 srgb} bind def
/col24 {0.500 0.190 0.000 srgb} bind def
/col25 {0.630 0.250 0.000 srgb} bind def
/col26 {0.750 0.380 0.000 srgb} bind def
/col27 {1.000 0.500 0.500 srgb} bind def
/col28 {1.000 0.630 0.630 srgb} bind def
/col29 {1.000 0.750 0.750 srgb} bind def
/col30 {1.000 0.880 0.880 srgb} bind def
/col31 {1.000 0.840 0.000 srgb} bind def

end
save
newpath 0 273 moveto 0 0 lineto 248 0 lineto 248 273 lineto closepath clip newpath
-3.0 276.2 translate
1 -1 scale

/cp {closepath} bind def
/ef {eofill} bind def
/gr {grestore} bind def
/gs {gsave} bind def
/sa {save} bind def
/rs {restore} bind def
/l {lineto} bind def
/m {moveto} bind def
/rm {rmoveto} bind def
/n {newpath} bind def
/s {stroke} bind def
/sh {show} bind def
/slc {setlinecap} bind def
/slj {setlinejoin} bind def
/slw {setlinewidth} bind def
/srgb {setrgbcolor} bind def
/rot {rotate} bind def
/sc {scale} bind def
/sd {setdash} bind def
/ff {findfont} bind def
/sf {setfont} bind def
/scf {scalefont} bind def
/sw {stringwidth} bind def
/tr {translate} bind def
/tnt {dup dup currentrgbcolor
  4 -2 roll dup 1 exch sub 3 -1 roll mul add
  4 -2 roll dup 1 exch sub 3 -1 roll mul add
  4 -2 roll dup 1 exch sub 3 -1 roll mul add srgb}
  bind def
/shd {dup dup currentrgbcolor 4 -2 roll mul 4 -2 roll mul
  4 -2 roll mul srgb} bind def
 /DrawEllipse {
	/endangle exch def
	/startangle exch def
	/yrad exch def
	/xrad exch def
	/y exch def
	/x exch def
	/savematrix mtrx currentmatrix def
	x y tr xrad yrad sc 0 0 1 startangle endangle arc
	closepath
	savematrix setmatrix
	} def

/$F2psBegin {$F2psDict begin /$F2psEnteredState save def} def
/$F2psEnd {$F2psEnteredState restore end} def

$F2psBegin
10 setmiterlimit
0 slj 0 slc
 0.06299 0.06299 sc
%
% Fig objects follow
%
% 
% here starts figure with depth 50
% Polyline
7.500 slw
n 1410 3915 m 1305 3915 1305 4170 105 arcto 4 {pop} repeat
  1305 4275 1740 4275 105 arcto 4 {pop} repeat
  1845 4275 1845 4020 105 arcto 4 {pop} repeat
  1845 3915 1410 3915 105 arcto 4 {pop} repeat
 cp gs col0 s gr 
/Helvetica ff 180.00 scf sf
1980 4185 m
gs 1 -1 sc (Milestone) col0 sh gr
% Polyline
gs  clippath
3090 3855 m 3030 3855 l 3030 4006 l 3060 3886 l 3090 4006 l cp
eoclip
n 3060 4140 m
 3060 3870 l gs col0 s gr gr

% arrowhead
n 3090 4006 m 3060 3886 l 3030 4006 l 3090 4006 l  cp gs 0.00 setgray ef gr  col0 s
/Helvetica ff 180.00 scf sf
3240 4185 m
gs 1 -1 sc (Rollback) col0 sh gr
% Polyline
gs  clippath
60 4335 m 120 4335 l 120 4184 l 90 4304 l 60 4184 l cp
eoclip
n 90 3915 m
 90 4320 l gs col0 s gr gr

% arrowhead
n 60 4184 m 90 4304 l 120 4184 l 60 4184 l  cp gs 0.00 setgray ef gr  col0 s
/Helvetica ff 180.00 scf sf
270 4185 m
gs 1 -1 sc (Execution) col0 sh gr
% Arc
gs  clippath
1427 2482 m 1381 2444 l 1285 2560 l 1385 2487 l 1331 2598 l cp
eoclip
n 1840.1 2931.1 637.3 101.8 -134.3 arc
gs col0 s gr
 gr

% arrowhead
n 1331 2598 m 1385 2487 l 1285 2560 l 1331 2598 l  cp gs 0.00 setgray ef gr  col0 s
% Arc
gs  clippath
1427 1269 m 1383 1228 l 1279 1338 l 1384 1272 l 1323 1380 l cp
eoclip
n 1942.5 1867.5 817.8 132.0 -132.0 arc
gs col0 s gr
 gr

% arrowhead
n 1323 1380 m 1384 1272 l 1279 1338 l 1323 1380 l  cp gs 0.00 setgray ef gr  col0 s
% Arc
gs  clippath
2188 2400 m 2191 2460 l 2342 2452 l 2221 2429 l 2339 2392 l cp
eoclip
n 2303.5 3046.8 624.6 31.7 -99.1 arcn
gs col0 s gr
 gr

% arrowhead
n 2339 2392 m 2221 2429 l 2342 2452 l 2339 2392 l  cp gs 0.00 setgray ef gr  col0 s
% Arc
gs  clippath
2187 1141 m 2192 1201 l 2343 1189 l 2221 1169 l 2338 1129 l cp
eoclip
n 2339.9 2019.7 860.4 6.4 -99.0 arcn
gs col0 s gr
 gr

% arrowhead
n 2338 1129 m 2221 1169 l 2343 1189 l 2338 1129 l  cp gs 0.00 setgray ef gr  col0 s
% Ellipse
n 1800 3555 101 101 0 360 DrawEllipse gs col0 s gr

% Ellipse
n 2745 3375 101 101 0 360 DrawEllipse gs col0 s gr

% Ellipse
n 3105 2160 101 101 0 360 DrawEllipse gs col0 s gr

% Ellipse
n 3060 4275 101 101 0 360 DrawEllipse gs col0 s gr

% Polyline
gs  clippath
1770 2265 m 1830 2265 l 1830 2114 l 1800 2234 l 1770 2114 l cp
eoclip
n 1800 1485 m
 1800 2250 l gs col0 s gr gr

% arrowhead
n 1770 2114 m 1800 2234 l 1830 2114 l 1770 2114 l  cp gs 0.00 setgray ef gr  col0 s
% Polyline
gs  clippath
1770 3480 m 1830 3480 l 1830 3329 l 1800 3449 l 1770 3329 l cp
eoclip
n 1800 2700 m
 1800 3465 l gs col0 s gr gr

% arrowhead
n 1770 3329 m 1800 3449 l 1830 3329 l 1770 3329 l  cp gs 0.00 setgray ef gr  col0 s
% Polyline
gs  clippath
1770 1050 m 1830 1050 l 1830 899 l 1800 1019 l 1770 899 l cp
eoclip
n 1800 270 m
 1800 1035 l gs col0 s gr gr

% arrowhead
n 1770 899 m 1800 1019 l 1830 899 l 1770 899 l  cp gs 0.00 setgray ef gr  col0 s
% Polyline
gs  clippath
2682 3313 m 2733 3282 l 2655 3152 l 2692 3271 l 2603 3184 l cp
eoclip
n 2205 2475 m
 2700 3285 l gs col0 s gr gr

% arrowhead
n 2603 3184 m 2692 3271 l 2655 3152 l 2603 3184 l  cp gs 0.00 setgray ef gr  col0 s
% Polyline
gs  clippath
3049 2146 m 3091 2104 l 2985 1997 l 3049 2104 l 2942 2040 l cp
eoclip
n 2205 1260 m
 3060 2115 l gs col0 s gr gr

% arrowhead
n 2942 2040 m 3049 2104 l 2985 1997 l 2942 2040 l  cp gs 0.00 setgray ef gr  col0 s
% Polyline
n 1500 1035 m 1395 1035 1395 1380 105 arcto 4 {pop} repeat
  1395 1485 2100 1485 105 arcto 4 {pop} repeat
  2205 1485 2205 1140 105 arcto 4 {pop} repeat
  2205 1035 1500 1035 105 arcto 4 {pop} repeat
 cp gs col0 s gr 
% Polyline
n 1500 2250 m 1395 2250 1395 2595 105 arcto 4 {pop} repeat
  1395 2700 2100 2700 105 arcto 4 {pop} repeat
  2205 2700 2205 2355 105 arcto 4 {pop} repeat
  2205 2250 1500 2250 105 arcto 4 {pop} repeat
 cp gs col0 s gr 
/Helvetica ff 180.00 scf sf
1575 180 m
gs 1 -1 sc (Start) col0 sh gr
/Helvetica ff 180.00 scf sf
1710 1350 m
gs 1 -1 sc (MS1) col0 sh gr
/Helvetica ff 180.00 scf sf
1710 2565 m
gs 1 -1 sc (MS2) col0 sh gr
/Helvetica ff 180.00 scf sf
1620 1890 m
gs 1 -1 sc (1.) col0 sh gr
/Helvetica ff 180.00 scf sf
1665 3105 m
gs 1 -1 sc (2.) col0 sh gr
/Helvetica ff 180.00 scf sf
1035 3195 m
gs 1 -1 sc (3.) col0 sh gr
/Helvetica ff 180.00 scf sf
2925 2790 m
gs 1 -1 sc (4.) col0 sh gr
/Helvetica ff 180.00 scf sf
945 1935 m
gs 1 -1 sc (5.) col0 sh gr
/Helvetica ff 180.00 scf sf
3015 1395 m
gs 1 -1 sc (6.) col0 sh gr
% here ends figure;
$F2psEnd
rs
showpage
