(classPool
(JNukeClass "Figure16_9" "Figure16_9.java"
  (JNukeMethod "Figure16_9.<init>" (JNukeSignature "V" (JNukeVector))
  (JNukeByteCodes
    (JNukeAByteCode 0 "Load" ref 0x0 (line 1))
    (JNukeAByteCode 1 "InvokeSpecial" (JNukeMethod "java/lang/Object.<init>" (JNukeSignature "V" (JNukeVector))))
    (JNukeAByteCode 2 "Return" void)
))
  (JNukeMethod "Figure16_9.m" (JNukeSignature "I" (JNukeVector "Z"))
  (JNukeEHandlers
    (JNukeEHandlerDesc (JNukeMethod "Figure16_9.m" (JNukeSignature "I" (JNukeVector "Z"))) "<Any exception>" 0 3 24)
    (JNukeEHandlerDesc (JNukeMethod "Figure16_9.m" (JNukeSignature "I" (JNukeVector "Z"))) "<Any exception>" 8 13 24)
    (JNukeEHandlerDesc (JNukeMethod "Figure16_9.m" (JNukeSignature "I" (JNukeVector "Z"))) "<Any exception>" 18 18 24)
    (JNukeEHandlerDesc (JNukeMethod "Figure16_9.m" (JNukeSignature "I" (JNukeVector "Z"))) "<Any exception>" 23 23 24)
  )
  (JNukeByteCodes
    (JNukeAByteCode 0 "Load" int 0x0 (line 6))
    (JNukeAByteCode 1 "Cond" ifeq 10)
    (JNukeAByteCode 2 "Const" int 1)
    (JNukeAByteCode 3 "Store" int 0x2)
      (JNukeAByteCode 4 "Load" int 0x0 (line 9))
      (JNukeAByteCode 5 "Cond" ifeq 8)
      (JNukeAByteCode 6 "Const" int 3)
      (JNukeAByteCode 7 "Store" int 0x1)
    (JNukeAByteCode 8 "Load" int 0x2 (line 6))
    (JNukeAByteCode 9 "Return" int)
    (JNukeAByteCode 10 "Const" int 2 (line 7))
    (JNukeAByteCode 11 "Store" int 0x1)
    (JNukeAByteCode 12 "Load" int 0x0 (line 8))
    (JNukeAByteCode 13 "Cond" ifeq 19)
      (JNukeAByteCode 14 "Load" int 0x0 (line 9))
      (JNukeAByteCode 15 "Cond" ifeq 18)
      (JNukeAByteCode 16 "Const" int 3)
      (JNukeAByteCode 17 "Store" int 0x1)
    (JNukeAByteCode 18 "Goto" 33 (line 8))
      (JNukeAByteCode 19 "Load" int 0x0 (line 9))
      (JNukeAByteCode 20 "Cond" ifeq 23)
      (JNukeAByteCode 21 "Const" int 3)
      (JNukeAByteCode 22 "Store" int 0x1)
    (JNukeAByteCode 23 "Goto" 31 (line 8))
    (JNukeAByteCode 24 "Store" ref 0x3 (line 9))
      (JNukeAByteCode 25 "Load" int 0x0)
      (JNukeAByteCode 26 "Cond" ifeq 29)
      (JNukeAByteCode 27 "Const" int 3)
      (JNukeAByteCode 28 "Store" int 0x1)
    (JNukeAByteCode 29 "Load" ref 0x3)
    (JNukeAByteCode 30 "Athrow")
    (JNukeAByteCode 31 "Const" int 4 (line 10))
    (JNukeAByteCode 32 "Store" int 0x1)
    (JNukeAByteCode 33 "Load" int 0x1 (line 12))
    (JNukeAByteCode 34 "Return" int)
))
)
)
