(classPool
(JNukeClass "Exit_Jsr" "Exit_Jsr.java"
  (JNukeMethod "Exit_Jsr.<init>" (JNukeSignature "V" (JNukeVector))
  (JNukeByteCodes
    (JNukeRByteCode 0 "r0 = Get" l0 (line 1))
    (JNukeRByteCode 1 "     InvokeSpecial" (JNukeMethod "java/lang/Object.<init>" (JNukeSignature "V" (JNukeVector))) r0)
    (JNukeRByteCode 2 "     Return" void)
))
  (JNukeMethod "Exit_Jsr.m" (JNukeSignature "V" (JNukeVector "I"))
  (JNukeEHandlers
    (JNukeEHandlerDesc (JNukeMethod "Exit_Jsr.m" (JNukeSignature "V" (JNukeVector "I"))) "<Any exception>" 0 0 3)
    (JNukeEHandlerDesc (JNukeMethod "Exit_Jsr.m" (JNukeSignature "V" (JNukeVector "I"))) "<Any exception>" 3 3 3)
  )
  (JNukeByteCodes
    (JNukeRByteCode 0 "     Inc" l1 0x1 (line 4))
      (JNukeRByteCode 1 "     Inc" l1 0xffffffff (line 5))
    (JNukeRByteCode 2 "     Goto" 7 (line 4))
    (JNukeRByteCode 3 "l2 = Get" r0 (line 6))
      (JNukeRByteCode 4 "     Inc" l1 0xffffffff)
    (JNukeRByteCode 5 "r0 = Const" int 1)
    (JNukeRByteCode 6 "     InvokeStatic" (JNukeMethod "java/lang/System.exit" (JNukeSignature "V" (JNukeVector "I"))) r0)
    (JNukeRByteCode 7 "r0 = Const" int 1 (line 8))
    (JNukeRByteCode 8 "     InvokeStatic" (JNukeMethod "java/lang/System.exit" (JNukeSignature "V" (JNukeVector "I"))) r0)
    (JNukeRByteCode 9 "     Return" void (line 9))
))
)
)
