%!PS-Adobe-2.0 EPSF-2.0
%%Title: design.dia
%%Creator: Dia v0.90
%%CreationDate: Thu Mar  6 10:21:35 2003
%%For: pascal
%%Magnification: 1.0000
%%Orientation: Portrait
%%BoundingBox: 0 0 1545 971
%%Pages: 1
%%EndComments
%%BeginProlog
/cp {closepath} bind def
/c {curveto} bind def
/f {fill} bind def
/a {arc} bind def
/ef {eofill} bind def
/ex {exch} bind def
/gr {grestore} bind def
/gs {gsave} bind def
/sa {save} bind def
/rs {restore} bind def
/l {lineto} bind def
/m {moveto} bind def
/rm {rmoveto} bind def
/n {newpath} bind def
/s {stroke} bind def
/sh {show} bind def
/slc {setlinecap} bind def
/slj {setlinejoin} bind def
/slw {setlinewidth} bind def
/srgb {setrgbcolor} bind def
/rot {rotate} bind def
/sc {scale} bind def
/sd {setdash} bind def
/ff {findfont} bind def
/sf {setfont} bind def
/scf {scalefont} bind def
/sw {stringwidth pop} bind def
/tr {translate} bind def

/ellipsedict 8 dict def
ellipsedict /mtrx matrix put
/ellipse
{ ellipsedict begin
   /endangle exch def
   /startangle exch def
   /yrad exch def
   /xrad exch def
   /y exch def
   /x exch def   /savematrix mtrx currentmatrix def
   x y tr xrad yrad sc
   0 0 1 startangle endangle arc
   savematrix setmatrix
   end
} def

/mergeprocs {
dup length
3 -1 roll
dup
length
dup
5 1 roll
3 -1 roll
add
array cvx
dup
3 -1 roll
0 exch
putinterval
dup
4 2 roll
putinterval
} bind def
%%EndProlog

%%BeginSetup
%%EndSetup
28.346000 -28.346000 scale
22.558625 -27.700010 translate

1.000000 1.000000 1.000000 srgb
n -11.208624 -6.499990 m -11.208624 -1.199990 l 14.491376 -1.199990 l 14.491376 -6.499990 l f
0.100000 slw
[0.200000] 0 sd
[0.200000] 0 sd
0 slj
0.000000 0.000000 0.000000 srgb
n -11.208624 -6.499990 m -11.208624 -1.199990 l 14.491376 -1.199990 l 14.491376 -6.499990 l cp s
1.000000 1.000000 1.000000 srgb
n -22.508625 3.550010 m -22.508625 27.650010 l 31.891375 27.650010 l 31.891375 3.550010 l f
0.100000 slw
[0.200000] 0 sd
[0.200000] 0 sd
0 slj
0.000000 0.000000 0.000000 srgb
n -22.508625 3.550010 m -22.508625 27.650010 l 31.891375 27.650010 l 31.891375 3.550010 l cp s
1.000000 1.000000 1.000000 srgb
n 2.817200 8.480000 m 2.817200 10.380000 l 13.482800 10.380000 l 13.482800 8.480000 l f
0.100000 slw
[] 0 sd
[] 0 sd
0 slj
0.000000 0.000000 0.000000 srgb
n 2.817200 8.480000 m 2.817200 10.380000 l 13.482800 10.380000 l 13.482800 8.480000 l cp s
 [ /xi /xi /xi /xi /xi /xi /xi /xi /xi /xi /xi /xi /xi /xi /xi /xi
 /xi /xi /xi /xi /xi /xi /xi /xi /xi /xi /xi /xi /xi /xi /xi /xi
 /R /u /n /t /i /m /e /E /xi /xi /v /r /o /B /C /I
 /s /c /H /a /p /M /g /W /L /k /zero /period /one /D /A /y
 /J /N /T /h /d /S /F /l /V /b /two /x /z /space /xi /xi
 /xi /xi /xi /xi /xi /xi /xi /xi /xi /xi /xi /xi /xi /xi /xi /xi
 /xi /xi /xi /xi /xi /xi /xi /xi /xi /xi /xi /xi /xi /xi /xi /xi
 /xi /xi /xi /xi /xi /xi /xi /xi /xi /xi /xi /xi /xi /xi /xi /xi
 /xi /xi /xi /xi /xi /xi /xi /xi /xi /xi /xi /xi /xi /xi /xi /xi
 /xi /xi /xi /xi /xi /xi /xi /xi /xi /xi /xi /xi /xi /xi /xi /xi
 /xi /xi /xi /xi /xi /xi /xi /xi /xi /xi /xi /xi /xi /xi /xi /xi
 /xi /xi /xi /xi /xi /xi /xi /xi /xi /xi /xi /xi /xi /xi /xi /xi
 /xi /xi /xi /xi /xi /xi /xi /xi /xi /xi /xi /xi /xi /xi /xi /xi
 /xi /xi /xi /xi /xi /xi /xi /xi /xi /xi /xi /xi /xi /xi /xi /xi
 /xi /xi /xi /xi /xi /xi /xi /xi /xi /xi /xi /xi /xi /xi /xi /xi
 /xi /xi /xi /xi /xi /xi /xi /xi /xi /xi /xi /xi /xi /xi /xi /xi
] /e0 exch def
/Helvetica_e0 undefinefont
/Helvetica_e0
  /Helvetica findfont
  dup length dict begin
  {1 index /FID ne {def} {pop pop} ifelse} forall
  /Encoding e0 def
  currentdict end
definefont pop
/Helvetica_e0 ff 0.800000 scf sf
( !"#$%&'"*$+,"%&"#) sw
2 div 8.150000 ex sub 9.626491 m ( !"#$%&'"*$+,"%&"#)
 gs 1 -1 sc sh gr
1.000000 1.000000 1.000000 srgb
n 22.556000 14.680000 m 22.556000 16.580000 l 31.109600 16.580000 l 31.109600 14.680000 l f
0.100000 slw
[] 0 sd
[] 0 sd
0 slj
0.000000 0.000000 0.000000 srgb
n 22.556000 14.680000 m 22.556000 16.580000 l 31.109600 16.580000 l 31.109600 14.680000 l cp s
/Helvetica_e0 ff 0.800000 scf sf
( -./"0#+!1#$,") sw
2 div 26.832800 ex sub 15.826491 m ( -./"0#+!1#$,")
 gs 1 -1 sc sh gr
0.100000 slw
[1.000000] 0 sd
[0.400000] 0 sd
0 slj
0 slc
n 13.482800 9.430000 m 13.482800 9.400000 l 26.832800 9.400000 l 26.832800 14.680000 l s
0.100000 slw
[] 0 sd
0 slj
0 slc
n 26.582800 13.880000 m 26.832800 14.680000 l 27.082800 13.880000 l s
1.000000 1.000000 1.000000 srgb
n -7.146905 14.680000 m -7.146905 16.580000 l -0.203705 16.580000 l -0.203705 14.680000 l f
0.100000 slw
[] 0 sd
[] 0 sd
0 slj
0.000000 0.000000 0.000000 srgb
n -7.146905 14.680000 m -7.146905 16.580000 l -0.203705 16.580000 l -0.203705 14.680000 l cp s
/Helvetica_e0 ff 0.800000 scf sf
(2&3453"36&+) sw
2 div -3.675305 ex sub 15.826491 m (2&3453"36&+)
 gs 1 -1 sc sh gr
1.000000 1.000000 1.000000 srgb
n 3.855600 14.680000 m 3.855600 16.580000 l 12.444400 16.580000 l 12.444400 14.680000 l f
0.100000 slw
[] 0 sd
[] 0 sd
0 slj
0.000000 0.000000 0.000000 srgb
n 3.855600 14.680000 m 3.855600 16.580000 l 12.444400 16.580000 l 12.444400 14.680000 l cp s
/Helvetica_e0 ff 0.800000 scf sf
(73$#0&#53"36&+) sw
2 div 8.150000 ex sub 15.826491 m (73$#0&#53"36&+)
 gs 1 -1 sc sh gr
1.000000 1.000000 1.000000 srgb
n 14.033000 14.680000 m 14.033000 16.580000 l 20.967400 16.580000 l 20.967400 14.680000 l f
0.100000 slw
[] 0 sd
[] 0 sd
0 slj
0.000000 0.000000 0.000000 srgb
n 14.033000 14.680000 m 14.033000 16.580000 l 20.967400 16.580000 l 20.967400 14.680000 l cp s
/Helvetica_e0 ff 0.800000 scf sf
(8,1953"36&+) sw
2 div 17.500200 ex sub 15.826491 m (8,1953"36&+)
 gs 1 -1 sc sh gr
0.100000 slw
[] 0 sd
0 slj
0 slc
n 8.150000 14.680000 m 8.150000 12.750000 l 8.150000 12.750000 l 8.150000 10.380000 l s
[] 0 sd
0 slj
0 slc
n 8.150000 10.380000 m 8.390000 11.080000 l 8.150000 11.780000 l 7.910000 11.080000 l f
0.100000 slw
[] 0 sd
[] 0 sd
0 slj
0 slc
n -3.675305 14.680000 m -3.675305 12.750000 l 17.500200 12.750000 l 17.500200 14.680000 l s
1.000000 1.000000 1.000000 srgb
n 15.905333 20.350000 m 15.905333 22.250000 l 19.073333 22.250000 l 19.073333 20.350000 l f
0.100000 slw
[] 0 sd
[] 0 sd
0 slj
0.000000 0.000000 0.000000 srgb
n 15.905333 20.350000 m 15.905333 22.250000 l 19.073333 22.250000 l 19.073333 20.350000 l cp s
/Helvetica_e0 ff 0.800000 scf sf
(8,19) sw
2 div 17.489333 ex sub 21.496491 m (8,19)
 gs 1 -1 sc sh gr
0.100000 slw
[] 0 sd
0 slj
0 slc
n 17.489333 20.350000 m 17.489333 19.350000 l 17.500200 19.350000 l 17.500200 16.580000 l s
[] 0 sd
0 slj
0 slc
n 17.500200 16.580000 m 17.740200 17.280000 l 17.500200 17.980000 l 17.260200 17.280000 l f
17.489333 20.946491 m /Courier_e0 undefinefont
/Courier_e0
  /Courier findfont
  dup length dict begin
  {1 index /FID ne {def} {pop pop} ifelse} forall
  /Encoding e0 def
  currentdict end
definefont pop
/Courier_e0 ff 0.800000 scf sf
(:;;")
 gs 1 -1 sc sh gr
17.500200 17.176491 m (<)
 gs 1 -1 sc sh gr
1.000000 1.000000 1.000000 srgb
n 5.483600 20.350000 m 5.483600 22.250000 l 10.816400 22.250000 l 10.816400 20.350000 l f
0.100000 slw
[] 0 sd
[] 0 sd
0 slj
0.000000 0.000000 0.000000 srgb
n 5.483600 20.350000 m 5.483600 22.250000 l 10.816400 22.250000 l 10.816400 20.350000 l cp s
/Helvetica_e0 ff 0.800000 scf sf
(73$#8$0#) sw
2 div 8.150000 ex sub 21.496491 m (73$#8$0#)
 gs 1 -1 sc sh gr
0.100000 slw
[] 0 sd
0 slj
0 slc
n 8.150000 20.350000 m 8.150000 19.430000 l 8.150000 19.430000 l 8.150000 16.580000 l s
[] 0 sd
0 slj
0 slc
n 8.150000 16.580000 m 8.390000 17.280000 l 8.150000 17.980000 l 7.910000 17.280000 l f
8.150000 20.946491 m /Courier_e0 ff 0.800000 scf sf
(:;;")
 gs 1 -1 sc sh gr
8.150000 17.176491 m (<)
 gs 1 -1 sc sh gr
1.000000 1.000000 1.000000 srgb
n -2.997941 20.350000 m -2.997941 22.250000 l 4.411659 22.250000 l 4.411659 20.350000 l f
0.100000 slw
[] 0 sd
[] 0 sd
0 slj
0.000000 0.000000 0.000000 srgb
n -2.997941 20.350000 m -2.997941 22.250000 l 4.411659 22.250000 l 4.411659 20.350000 l cp s
/Helvetica_e0 ff 0.800000 scf sf
(/"0#3"1&=&01) sw
2 div 0.706859 ex sub 21.496491 m (/"0#3"1&=&01)
 gs 1 -1 sc sh gr
1.000000 1.000000 1.000000 srgb
n -14.242683 20.350000 m -14.242683 22.250000 l -4.069883 22.250000 l -4.069883 20.350000 l f
0.100000 slw
[] 0 sd
[] 0 sd
0 slj
0.000000 0.000000 0.000000 srgb
n -14.242683 20.350000 m -14.242683 22.250000 l -4.069883 22.250000 l -4.069883 20.350000 l cp s
/Helvetica_e0 ff 0.800000 scf sf
(>++3?/"0#3"1&=&01) sw
2 div -9.156283 ex sub 21.496491 m (>++3?/"0#3"1&=&01)
 gs 1 -1 sc sh gr
0.100000 slw
[] 0 sd
0 slj
0 slc
n 0.706859 20.350000 m 0.706859 18.850000 l -3.675305 18.850000 l -3.675305 16.580000 l s
[] 0 sd
0 slj
0 slc
n -3.675305 16.580000 m -3.435305 17.280000 l -3.675305 17.980000 l -3.915305 17.280000 l f
0.706859 20.946491 m /Courier_e0 ff 0.800000 scf sf
(:;;")
 gs 1 -1 sc sh gr
-3.675305 17.176491 m (<)
 gs 1 -1 sc sh gr
0.100000 slw
[] 0 sd
0 slj
0 slc
n -9.156283 20.350000 m -9.156283 18.850000 l -3.675305 18.850000 l -3.675305 16.580000 l s
[] 0 sd
0 slj
0 slc
n -3.675305 16.580000 m -3.435305 17.280000 l -3.675305 17.980000 l -3.915305 17.280000 l f
-9.156283 20.946491 m /Courier_e0 ff 0.800000 scf sf
(:;;")
 gs 1 -1 sc sh gr
-3.675305 17.176491 m (<)
 gs 1 -1 sc sh gr
1.000000 1.000000 1.000000 srgb
n -21.958624 14.680000 m -21.958624 16.580000 l -15.015424 16.580000 l -15.015424 14.680000 l f
0.100000 slw
[] 0 sd
[] 0 sd
0 slj
0.000000 0.000000 0.000000 srgb
n -21.958624 14.680000 m -21.958624 16.580000 l -15.015424 16.580000 l -15.015424 14.680000 l cp s
/Helvetica_e0 ff 0.800000 scf sf
(@A!9&BC+&3D) sw
2 div -18.487024 ex sub 15.826491 m (@A!9&BC+&3D)
 gs 1 -1 sc sh gr
0.100000 slw
[] 0 sd
0 slj
0 slc
n -18.487024 14.680000 m -18.487024 12.750000 l 8.150000 12.750000 l 8.150000 10.380000 l s
[] 0 sd
0 slj
0 slc
n 8.150000 10.380000 m 8.390000 11.080000 l 8.150000 11.780000 l 7.910000 11.080000 l f
-18.487024 15.276491 m /Courier_e0 ff 0.800000 scf sf
(:;;")
 gs 1 -1 sc sh gr
8.150000 10.976491 m (<)
 gs 1 -1 sc sh gr
1.000000 1.000000 1.000000 srgb
n -21.659424 20.350000 m -21.659424 22.250000 l -15.314624 22.250000 l -15.314624 20.350000 l f
0.100000 slw
[] 0 sd
[] 0 sd
0 slj
0.000000 0.000000 0.000000 srgb
n -21.659424 20.350000 m -21.659424 22.250000 l -15.314624 22.250000 l -15.314624 20.350000 l cp s
/Helvetica_e0 ff 0.800000 scf sf
(E#319F+3%&) sw
2 div -18.487024 ex sub 21.496491 m (E#319F+3%&)
 gs 1 -1 sc sh gr
0.100000 slw
[] 0 sd
0 slj
0 slc
n -18.487024 20.350000 m -18.487024 19.450000 l -18.487024 19.450000 l -18.487024 16.580000 l s
[] 0 sd
0 slj
0 slc
n -18.487024 16.580000 m -18.247024 17.280000 l -18.487024 17.980000 l -18.727024 17.280000 l f
-18.487024 20.946491 m /Courier_e0 ff 0.800000 scf sf
(:;;")
 gs 1 -1 sc sh gr
-18.487024 17.176491 m (<)
 gs 1 -1 sc sh gr
1.000000 1.000000 1.000000 srgb
n -10.813825 8.480000 m -10.813825 10.380000 l -3.870625 10.380000 l -3.870625 8.480000 l f
0.100000 slw
[] 0 sd
[] 0 sd
0 slj
0.000000 0.000000 0.000000 srgb
n -10.813825 8.480000 m -10.813825 10.380000 l -3.870625 10.380000 l -3.870625 8.480000 l cp s
/Helvetica_e0 ff 0.800000 scf sf
(  E1C&D!G&+) sw
2 div -7.342225 ex sub 9.626491 m (  E1C&D!G&+)
 gs 1 -1 sc sh gr
0.100000 slw
[] 0 sd
0 slj
0 slc
n -3.870625 9.430000 m -3.870625 9.400010 l 2.817200 9.400010 l 2.817200 9.430000 l s
1.000000 1.000000 1.000000 srgb
n -9.977825 4.180000 m -9.977825 6.080000 l -4.706625 6.080000 l -4.706625 4.180000 l f
0.100000 slw
[] 0 sd
[] 0 sd
0 slj
0.000000 0.000000 0.000000 srgb
n -9.977825 4.180000 m -9.977825 6.080000 l -4.706625 6.080000 l -4.706625 4.180000 l cp s
/Helvetica_e0 ff 0.800000 scf sf
(E1C&D!G&) sw
2 div -7.342225 ex sub 5.326491 m (E1C&D!G&)
 gs 1 -1 sc sh gr
0.100000 slw
[] 0 sd
0 slj
0 slc
n -7.342225 6.080000 m -7.342225 7.350000 l -7.342225 7.350000 l -7.342225 8.480000 l s
[] 0 sd
0 slj
0 slc
n -7.342225 8.480000 m -7.582225 7.780000 l -7.342225 7.080000 l -7.102225 7.780000 l f
1.000000 1.000000 1.000000 srgb
n -3.051025 25.155010 m -3.051025 27.055010 l 4.446575 27.055010 l 4.446575 25.155010 l f
0.100000 slw
[] 0 sd
[] 0 sd
0 slj
0.000000 0.000000 0.000000 srgb
n -3.051025 25.155010 m -3.051025 27.055010 l 4.446575 27.055010 l 4.446575 25.155010 l cp s
/Helvetica_e0 ff 0.800000 scf sf
(H$+#!3GB3IG&) sw
2 div 0.697775 ex sub 26.301501 m (H$+#!3GB3IG&)
 gs 1 -1 sc sh gr
0.100000 slw
[] 0 sd
0 slj
0 slc
n 0.706859 22.250000 m 0.706859 23.250010 l 0.697775 23.250010 l 0.697775 25.155010 l s
0.706859 22.846491 m /Courier_e0 ff 0.800000 scf sf
(J)
 gs 1 -1 sc sh gr
0.697775 24.951501 m (<)
 gs 1 -1 sc sh gr
1.000000 1.000000 1.000000 srgb
n 5.221776 -4.694990 m 5.221776 -2.794990 l 11.073776 -2.794990 l 11.073776 -4.694990 l f
0.100000 slw
[] 0 sd
[] 0 sd
0 slj
0.000000 0.000000 0.000000 srgb
n 5.221776 -4.694990 m 5.221776 -2.794990 l 11.073776 -2.794990 l 11.073776 -4.694990 l cp s
/Helvetica_e0 ff 0.800000 scf sf
('K$#-G,19) sw
2 div 8.147776 ex sub -3.548499 m ('K$#-G,19)
 gs 1 -1 sc sh gr
0.100000 slw
[] 0 sd
0 slj
0 slc
n 8.147776 -2.794990 m 8.147776 -1.799990 l 8.150000 -1.799990 l 8.150000 8.480000 l s
0.100000 slw
[] 0 sd
0 slj
0 slc
n -7.342225 4.180000 m -7.342225 1.500010 l 6.684776 1.500010 l 6.684776 -2.794990 l s
[] 0 sd
0 slj
0 slc
n 6.684776 -2.794990 m 6.924776 -2.094990 l 6.684776 -1.394990 l 6.444776 -2.094990 l f
1.000000 1.000000 1.000000 srgb
n -8.464224 -4.694990 m -8.464224 -2.794990 l -1.521024 -2.794990 l -1.521024 -4.694990 l f
0.100000 slw
[] 0 sd
[] 0 sd
0 slj
0.000000 0.000000 0.000000 srgb
n -8.464224 -4.694990 m -8.464224 -2.794990 l -1.521024 -2.794990 l -1.521024 -4.694990 l cp s
/Helvetica_e0 ff 0.800000 scf sf
( 8.>"3G?L&+) sw
2 div -4.992624 ex sub -3.548499 m ( 8.>"3G?L&+)
 gs 1 -1 sc sh gr
0.100000 slw
[] 0 sd
0 slj
0 slc
n -1.521024 -3.744990 m -1.521024 -3.699990 l 5.221776 -3.699990 l 5.221776 -3.744990 l s
/Helvetica_e0 ff 0.800000 scf sf
(E?0#&%3#$1ME1C&D!G&+) sw
2 div -5.858624 ex sub -5.699990 m (E?0#&%3#$1ME1C&D!G&+)
 gs 1 -1 sc sh gr
/Helvetica_e0 ff 0.800000 scf sf
(@A!9&MH$+#!3GM531C$"&) sw
2 div -16.857824 ex sub 4.551501 m (@A!9&MH$+#!3GM531C$"&)
 gs 1 -1 sc sh gr
showpage
