%!PS-Adobe-3.0 EPSF-3.0
%%BoundingBox: -4 -4 1140 684
%%BeginProcSet: reencode 1.0 0 
/RE 
{  findfont begin 
  currentdict dup length dict begin 
  {1 index /FID ne {def} {pop pop} ifelse} forall 
  /FontName exch def dup length 0 ne 
  { /Encoding Encoding 256 array copy def 
      0 exch 
      { dup type /nametype eq 
        { Encoding 2 index 2 index put 
          pop 1 add 
        } 
        { exch pop 
        } ifelse 
      } forall 
  } if pop 
  currentdict dup end end 
  /FontName get exch definefont pop 
    } bind def 
%%EndProcSet: reencode 1.0 0 
%%BeginProcSet: ellipse 1.0 0 
/ellipsedict 8 dict def 
ellipsedict /mtrx matrix put 
/ellipse { ellipsedict begin 
/endangle exch def 
/startangle exch def 
/yrad exch def 
/xrad exch def 
/y exch def 
/x exch def 
/savematrix mtrx currentmatrix def 
x y translate 
xrad yrad scale 
0 0 1 0 360 arc 
savematrix setmatrix end } def 
%%EndProcSet: ellipse 1.0 0 
%%EndProlog
%%BeginSetup
/isolatin1encoding 
[ 32 /space /exclam /quotedbl /numbersign /dollar /percent /ampersand /quoteright 
 /parenleft /parenright /asterisk /plus /comma /hyphen /period /slash /zero /one 
 /two /three /four /five /six /seven /eight /nine /colon /semicolon 
 /less /equal /greater /question /at /A /B /C /D /E 
 /F /G /H /I /J /K /L /M /N /O 
 /P /Q /R /S /T /U /V /W /X /Y 
 /Z /bracketleft /backslash /bracketright /asciicircum /underscore /quoteleft /a /b /c 
 /d /e /f /g /h /i /j /k /l /m 
 /n /o /p /q /r /s /t /u /v /w 
 /x /y /z /braceleft /bar /braceright /asciitilde /.notdef /.notdef /.notdef 
 /.notdef /.notdef /.notdef /.notdef /.notdef /.notdef /.notdef /.notdef /.notdef /.notdef 
 /.notdef /.notdef /.notdef /.notdef /.notdef /.notdef /.notdef /.notdef /.notdef /.notdef 
 /.notdef /.notdef /.notdef /.notdef /.notdef /.notdef /.notdef /.notdef /.notdef /.notdef 
 /space /exclamdown /cent /sterling /currency /yen /brokenbar /section /dieresis /copyright 
 /ordfeminine /guillemotleft /logicalnot /hyphen /registered /macron /degree /plusminus /twosuperior /threesuperior 
 /acute /mu /paragraph /periodcentered /cedilla /onesuperior /ordmasculine /guillemotright /onequarter /onehalf 
 /threequarters /questiondown /Agrave /Aacute /Acircumflex /Atilde /Adieresis /Aring /AE /Ccedilla 
 /Egrave /Eacute /Ecircumflex /Edieresis /Igrave /Iacute /Icircumflex /Idieresis /Eth /Ntilde 
 /Ograve /Oacute /Ocircumflex /Otilde /Odieresis /multiply /Oslash /Ugrave /Uacute /Ucircumflex 
 /Udieresis /Yacute /Thorn /germandbls /agrave /aacute /acircumflex /atilde /adieresis /aring 
 /ae /ccedilla /egrave /eacute /ecircumflex /edieresis /igrave /iacute /icircumflex /idieresis 
 /eth /ntilde /ograve /oacute /ocircumflex /otilde /odieresis /divide /oslash /ugrave 
 /uacute /ucircumflex /udieresis /yacute /thorn /ydieresis] def 
%%EndSetup
1 setlinewidth
isolatin1encoding /_Helvetica /Helvetica RE
/_Helvetica findfont
12 scalefont setfont
0.0 0.0 0.0 setrgbcolor
0 680 translate
4 4 translate
1.0 1.0 0.9 setrgbcolor
newpath
440 -80 moveto
440 -360 lineto
576 -360 lineto
576 -504 lineto
416 -504 lineto
416 -680 lineto
1136 -680 lineto
1136 -200 lineto
920 -200 lineto
920 -240 lineto
728 -240 lineto
728 -80 lineto
440 -80 lineto
closepath
eofill
0.0 0.0 0.0 setrgbcolor
newpath
440 -80 moveto
440 -360 lineto
576 -360 lineto
576 -504 lineto
416 -504 lineto
416 -680 lineto
1136 -680 lineto
1136 -200 lineto
920 -200 lineto
920 -240 lineto
728 -240 lineto
728 -80 lineto
440 -80 lineto
stroke
newpath
504 -248 moveto
501 -245 lineto
stroke
newpath
497 -241 moveto
494 -238 lineto
stroke
newpath
490 -234 moveto
487 -231 lineto
stroke
newpath
483 -227 moveto
480 -224 lineto
stroke
newpath
476 -220 moveto
473 -216 lineto
stroke
newpath
469 -213 moveto
466 -209 lineto
stroke
newpath
462 -206 moveto
459 -202 lineto
stroke
newpath
455 -199 moveto
451 -195 lineto
stroke
newpath
448 -192 moveto
444 -188 lineto
stroke
newpath
441 -184 moveto
437 -181 lineto
stroke
newpath
434 -177 moveto
430 -174 lineto
stroke
newpath
427 -170 moveto
423 -167 lineto
stroke
newpath
420 -163 moveto
416 -160 lineto
stroke
newpath
413 -156 moveto
409 -152 lineto
stroke
newpath
405 -149 moveto
402 -145 lineto
stroke
newpath
398 -142 moveto
395 -138 lineto
stroke
newpath
391 -135 moveto
388 -131 lineto
stroke
newpath
384 -127 moveto
381 -124 lineto
stroke
newpath
377 -120 moveto
374 -117 lineto
stroke
newpath
370 -113 moveto
367 -110 lineto
stroke
newpath
363 -106 moveto
359 -103 lineto
stroke
newpath
356 -99 moveto
352 -95 lineto
stroke
newpath
349 -92 moveto
345 -88 lineto
stroke
newpath
342 -85 moveto
338 -81 lineto
stroke
newpath
351 -84 moveto
338 -81 lineto
stroke
newpath
341 -94 moveto
338 -81 lineto
stroke
isolatin1encoding /_Helvetica /Helvetica RE
/_Helvetica findfont
9 scalefont setfont
1.0 1.0 1.0 setrgbcolor
newpath
432 -384 moveto
119 0 rlineto
0 -90 rlineto
-119 0 rlineto
closepath
eofill
0.0 0.0 0.0 setrgbcolor
newpath
432 -384 moveto
119 0 rlineto
0 -90 rlineto
-119 0 rlineto
closepath
stroke
newpath
433 -475 moveto
118 0 rlineto
0 0 rlineto
-118 0 rlineto
closepath
eofill
newpath
552 -385 moveto
0 0 rlineto
0 -90 rlineto
0 0 rlineto
closepath
eofill
1.0 1.0 1.0 setrgbcolor
newpath
432 -384 moveto
119 0 rlineto
0 -20 rlineto
-119 0 rlineto
closepath
eofill
0.0 0.0 0.0 setrgbcolor
newpath
432 -384 moveto
119 0 rlineto
0 -20 rlineto
-119 0 rlineto
closepath
stroke
470 -398 moveto
(JNukeVar) show
1.0 1.0 1.0 setrgbcolor
newpath
432 -404 moveto
119 0 rlineto
0 -53 rlineto
-119 0 rlineto
closepath
eofill
0.0 0.0 0.0 setrgbcolor
newpath
432 -404 moveto
119 0 rlineto
0 -53 rlineto
-119 0 rlineto
closepath
stroke
434 -419 moveto
(name : UCSString) show
434 -436 moveto
(type : UCSString) show
434 -453 moveto
(accessFlags : int) show
1.0 1.0 1.0 setrgbcolor
newpath
432 -457 moveto
119 0 rlineto
0 -17 rlineto
-119 0 rlineto
closepath
eofill
0.0 0.0 0.0 setrgbcolor
newpath
432 -457 moveto
119 0 rlineto
0 -17 rlineto
-119 0 rlineto
closepath
stroke
1.0 1.0 1.0 setrgbcolor
newpath
288 -184 moveto
119 0 rlineto
0 -107 rlineto
-119 0 rlineto
closepath
eofill
0.0 0.0 0.0 setrgbcolor
newpath
288 -184 moveto
119 0 rlineto
0 -107 rlineto
-119 0 rlineto
closepath
stroke
newpath
289 -292 moveto
118 0 rlineto
0 0 rlineto
-118 0 rlineto
closepath
eofill
newpath
408 -185 moveto
0 0 rlineto
0 -107 rlineto
0 0 rlineto
closepath
eofill
1.0 1.0 1.0 setrgbcolor
newpath
288 -184 moveto
119 0 rlineto
0 -20 rlineto
-119 0 rlineto
closepath
eofill
0.0 0.0 0.0 setrgbcolor
newpath
288 -184 moveto
119 0 rlineto
0 -20 rlineto
-119 0 rlineto
closepath
stroke
321 -198 moveto
(JNukeClass) show
1.0 1.0 1.0 setrgbcolor
newpath
288 -204 moveto
119 0 rlineto
0 -70 rlineto
-119 0 rlineto
closepath
eofill
0.0 0.0 0.0 setrgbcolor
newpath
288 -204 moveto
119 0 rlineto
0 -70 rlineto
-119 0 rlineto
closepath
stroke
290 -219 moveto
(name : UCSString) show
290 -236 moveto
(sourceFile : UCSString) show
290 -253 moveto
(classFile : UCSString) show
290 -270 moveto
(accessFlags : int) show
1.0 1.0 1.0 setrgbcolor
newpath
288 -274 moveto
119 0 rlineto
0 -17 rlineto
-119 0 rlineto
closepath
eofill
0.0 0.0 0.0 setrgbcolor
newpath
288 -274 moveto
119 0 rlineto
0 -17 rlineto
-119 0 rlineto
closepath
stroke
1.0 1.0 1.0 setrgbcolor
newpath
960 -232 moveto
135 0 rlineto
0 -63 rlineto
-135 0 rlineto
closepath
eofill
0.0 0.0 0.0 setrgbcolor
newpath
960 -232 moveto
135 0 rlineto
0 -63 rlineto
-135 0 rlineto
closepath
stroke
newpath
961 -296 moveto
134 0 rlineto
0 0 rlineto
-134 0 rlineto
closepath
eofill
newpath
1096 -233 moveto
0 0 rlineto
0 -63 rlineto
0 0 rlineto
closepath
eofill
1.0 1.0 1.0 setrgbcolor
newpath
960 -232 moveto
135 0 rlineto
0 -20 rlineto
-135 0 rlineto
closepath
eofill
0.0 0.0 0.0 setrgbcolor
newpath
960 -232 moveto
135 0 rlineto
0 -20 rlineto
-135 0 rlineto
closepath
stroke
998 -246 moveto
(JNukeInstrBCT) show
1.0 1.0 1.0 setrgbcolor
newpath
960 -252 moveto
135 0 rlineto
0 -22 rlineto
-135 0 rlineto
closepath
eofill
0.0 0.0 0.0 setrgbcolor
newpath
960 -252 moveto
135 0 rlineto
0 -22 rlineto
-135 0 rlineto
closepath
stroke
1.0 1.0 1.0 setrgbcolor
newpath
960 -274 moveto
135 0 rlineto
0 -21 rlineto
-135 0 rlineto
closepath
eofill
0.0 0.0 0.0 setrgbcolor
newpath
960 -274 moveto
135 0 rlineto
0 -21 rlineto
-135 0 rlineto
closepath
stroke
1.0 1.0 1.0 setrgbcolor
newpath
952 -400 moveto
107 0 rlineto
0 -56 rlineto
-107 0 rlineto
closepath
eofill
0.0 0.0 0.0 setrgbcolor
newpath
952 -400 moveto
107 0 rlineto
0 -56 rlineto
-107 0 rlineto
closepath
stroke
newpath
953 -457 moveto
106 0 rlineto
0 0 rlineto
-106 0 rlineto
closepath
eofill
newpath
1060 -401 moveto
0 0 rlineto
0 -56 rlineto
0 0 rlineto
closepath
eofill
1.0 1.0 1.0 setrgbcolor
newpath
952 -400 moveto
107 0 rlineto
0 -20 rlineto
-107 0 rlineto
closepath
eofill
0.0 0.0 0.0 setrgbcolor
newpath
952 -400 moveto
107 0 rlineto
0 -20 rlineto
-107 0 rlineto
closepath
stroke
965 -414 moveto
(JNukeInstrument) show
1.0 1.0 1.0 setrgbcolor
newpath
952 -420 moveto
107 0 rlineto
0 -18 rlineto
-107 0 rlineto
closepath
eofill
0.0 0.0 0.0 setrgbcolor
newpath
952 -420 moveto
107 0 rlineto
0 -18 rlineto
-107 0 rlineto
closepath
stroke
954 -435 moveto
(rules : JNukeInstrRule) show
1.0 1.0 1.0 setrgbcolor
newpath
952 -438 moveto
107 0 rlineto
0 -18 rlineto
-107 0 rlineto
closepath
eofill
0.0 0.0 0.0 setrgbcolor
newpath
952 -438 moveto
107 0 rlineto
0 -18 rlineto
-107 0 rlineto
closepath
stroke
1.0 1.0 1.0 setrgbcolor
newpath
504 -248 moveto
151 0 rlineto
0 -56 rlineto
-151 0 rlineto
closepath
eofill
0.0 0.0 0.0 setrgbcolor
newpath
504 -248 moveto
151 0 rlineto
0 -56 rlineto
-151 0 rlineto
closepath
stroke
newpath
505 -305 moveto
150 0 rlineto
0 0 rlineto
-150 0 rlineto
closepath
eofill
newpath
656 -249 moveto
0 0 rlineto
0 -56 rlineto
0 0 rlineto
closepath
eofill
1.0 1.0 1.0 setrgbcolor
newpath
504 -248 moveto
151 0 rlineto
0 -20 rlineto
-151 0 rlineto
closepath
eofill
0.0 0.0 0.0 setrgbcolor
newpath
504 -248 moveto
151 0 rlineto
0 -20 rlineto
-151 0 rlineto
closepath
stroke
534 -262 moveto
(JNukeConstantPool) show
1.0 1.0 1.0 setrgbcolor
newpath
504 -268 moveto
151 0 rlineto
0 -18 rlineto
-151 0 rlineto
closepath
eofill
0.0 0.0 0.0 setrgbcolor
newpath
504 -268 moveto
151 0 rlineto
0 -18 rlineto
-151 0 rlineto
closepath
stroke
1.0 1.0 1.0 setrgbcolor
newpath
504 -286 moveto
151 0 rlineto
0 -18 rlineto
-151 0 rlineto
closepath
eofill
0.0 0.0 0.0 setrgbcolor
newpath
504 -286 moveto
151 0 rlineto
0 -18 rlineto
-151 0 rlineto
closepath
stroke
1.0 1.0 1.0 setrgbcolor
newpath
448 -600 moveto
143 0 rlineto
0 -56 rlineto
-143 0 rlineto
closepath
eofill
0.0 0.0 0.0 setrgbcolor
newpath
448 -600 moveto
143 0 rlineto
0 -56 rlineto
-143 0 rlineto
closepath
stroke
newpath
449 -657 moveto
142 0 rlineto
0 0 rlineto
-142 0 rlineto
closepath
eofill
newpath
592 -601 moveto
0 0 rlineto
0 -56 rlineto
0 0 rlineto
closepath
eofill
1.0 1.0 1.0 setrgbcolor
newpath
448 -600 moveto
143 0 rlineto
0 -20 rlineto
-143 0 rlineto
closepath
eofill
0.0 0.0 0.0 setrgbcolor
newpath
448 -600 moveto
143 0 rlineto
0 -20 rlineto
-143 0 rlineto
closepath
stroke
478 -614 moveto
(JNukeExecFactory) show
1.0 1.0 1.0 setrgbcolor
newpath
448 -620 moveto
143 0 rlineto
0 -18 rlineto
-143 0 rlineto
closepath
eofill
0.0 0.0 0.0 setrgbcolor
newpath
448 -620 moveto
143 0 rlineto
0 -18 rlineto
-143 0 rlineto
closepath
stroke
1.0 1.0 1.0 setrgbcolor
newpath
448 -638 moveto
143 0 rlineto
0 -18 rlineto
-143 0 rlineto
closepath
eofill
0.0 0.0 0.0 setrgbcolor
newpath
448 -638 moveto
143 0 rlineto
0 -18 rlineto
-143 0 rlineto
closepath
stroke
1.0 1.0 1.0 setrgbcolor
newpath
448 -520 moveto
143 0 rlineto
0 -56 rlineto
-143 0 rlineto
closepath
eofill
0.0 0.0 0.0 setrgbcolor
newpath
448 -520 moveto
143 0 rlineto
0 -56 rlineto
-143 0 rlineto
closepath
stroke
newpath
449 -577 moveto
142 0 rlineto
0 0 rlineto
-142 0 rlineto
closepath
eofill
newpath
592 -521 moveto
0 0 rlineto
0 -56 rlineto
0 0 rlineto
closepath
eofill
1.0 1.0 1.0 setrgbcolor
newpath
448 -520 moveto
143 0 rlineto
0 -20 rlineto
-143 0 rlineto
closepath
eofill
0.0 0.0 0.0 setrgbcolor
newpath
448 -520 moveto
143 0 rlineto
0 -20 rlineto
-143 0 rlineto
closepath
stroke
480 -534 moveto
(JNukeEvalFactory) show
1.0 1.0 1.0 setrgbcolor
newpath
448 -540 moveto
143 0 rlineto
0 -18 rlineto
-143 0 rlineto
closepath
eofill
0.0 0.0 0.0 setrgbcolor
newpath
448 -540 moveto
143 0 rlineto
0 -18 rlineto
-143 0 rlineto
closepath
stroke
1.0 1.0 1.0 setrgbcolor
newpath
448 -558 moveto
143 0 rlineto
0 -18 rlineto
-143 0 rlineto
closepath
eofill
0.0 0.0 0.0 setrgbcolor
newpath
448 -558 moveto
143 0 rlineto
0 -18 rlineto
-143 0 rlineto
closepath
stroke
1.0 1.0 1.0 setrgbcolor
newpath
592 -96 moveto
119 0 rlineto
0 -56 rlineto
-119 0 rlineto
closepath
eofill
0.0 0.0 0.0 setrgbcolor
newpath
592 -96 moveto
119 0 rlineto
0 -56 rlineto
-119 0 rlineto
closepath
stroke
newpath
593 -153 moveto
118 0 rlineto
0 0 rlineto
-118 0 rlineto
closepath
eofill
newpath
712 -97 moveto
0 0 rlineto
0 -56 rlineto
0 0 rlineto
closepath
eofill
1.0 1.0 1.0 setrgbcolor
newpath
592 -96 moveto
119 0 rlineto
0 -20 rlineto
-119 0 rlineto
closepath
eofill
0.0 0.0 0.0 setrgbcolor
newpath
592 -96 moveto
119 0 rlineto
0 -20 rlineto
-119 0 rlineto
closepath
stroke
599 -110 moveto
(JNukeAttributeBuilder) show
1.0 1.0 1.0 setrgbcolor
newpath
592 -116 moveto
119 0 rlineto
0 -18 rlineto
-119 0 rlineto
closepath
eofill
0.0 0.0 0.0 setrgbcolor
newpath
592 -116 moveto
119 0 rlineto
0 -18 rlineto
-119 0 rlineto
closepath
stroke
1.0 1.0 1.0 setrgbcolor
newpath
592 -134 moveto
119 0 rlineto
0 -18 rlineto
-119 0 rlineto
closepath
eofill
0.0 0.0 0.0 setrgbcolor
newpath
592 -134 moveto
119 0 rlineto
0 -18 rlineto
-119 0 rlineto
closepath
stroke
1.0 1.0 1.0 setrgbcolor
newpath
464 -96 moveto
95 0 rlineto
0 -73 rlineto
-95 0 rlineto
closepath
eofill
0.0 0.0 0.0 setrgbcolor
newpath
464 -96 moveto
95 0 rlineto
0 -73 rlineto
-95 0 rlineto
closepath
stroke
newpath
465 -170 moveto
94 0 rlineto
0 0 rlineto
-94 0 rlineto
closepath
eofill
newpath
560 -97 moveto
0 0 rlineto
0 -73 rlineto
0 0 rlineto
closepath
eofill
1.0 1.0 1.0 setrgbcolor
newpath
464 -96 moveto
95 0 rlineto
0 -20 rlineto
-95 0 rlineto
closepath
eofill
0.0 0.0 0.0 setrgbcolor
newpath
464 -96 moveto
95 0 rlineto
0 -20 rlineto
-95 0 rlineto
closepath
stroke
476 -110 moveto
(JNukeAttribute) show
1.0 1.0 1.0 setrgbcolor
newpath
464 -116 moveto
95 0 rlineto
0 -36 rlineto
-95 0 rlineto
closepath
eofill
0.0 0.0 0.0 setrgbcolor
newpath
464 -116 moveto
95 0 rlineto
0 -36 rlineto
-95 0 rlineto
closepath
stroke
466 -131 moveto
(nameIndex : int) show
466 -149 moveto
(length : int) show
1.0 1.0 1.0 setrgbcolor
newpath
464 -152 moveto
95 0 rlineto
0 -17 rlineto
-95 0 rlineto
closepath
eofill
0.0 0.0 0.0 setrgbcolor
newpath
464 -152 moveto
95 0 rlineto
0 -17 rlineto
-95 0 rlineto
closepath
stroke
1.0 1.0 1.0 setrgbcolor
newpath
608 -384 moveto
151 0 rlineto
0 -56 rlineto
-151 0 rlineto
closepath
eofill
0.0 0.0 0.0 setrgbcolor
newpath
608 -384 moveto
151 0 rlineto
0 -56 rlineto
-151 0 rlineto
closepath
stroke
newpath
609 -441 moveto
150 0 rlineto
0 0 rlineto
-150 0 rlineto
closepath
eofill
newpath
760 -385 moveto
0 0 rlineto
0 -56 rlineto
0 0 rlineto
closepath
eofill
1.0 1.0 1.0 setrgbcolor
newpath
608 -384 moveto
151 0 rlineto
0 -20 rlineto
-151 0 rlineto
closepath
eofill
0.0 0.0 0.0 setrgbcolor
newpath
608 -384 moveto
151 0 rlineto
0 -20 rlineto
-151 0 rlineto
closepath
stroke
637 -398 moveto
(JNukeMFInfoFactory) show
1.0 1.0 1.0 setrgbcolor
newpath
608 -404 moveto
151 0 rlineto
0 -18 rlineto
-151 0 rlineto
closepath
eofill
0.0 0.0 0.0 setrgbcolor
newpath
608 -404 moveto
151 0 rlineto
0 -18 rlineto
-151 0 rlineto
closepath
stroke
1.0 1.0 1.0 setrgbcolor
newpath
608 -422 moveto
151 0 rlineto
0 -18 rlineto
-151 0 rlineto
closepath
eofill
0.0 0.0 0.0 setrgbcolor
newpath
608 -422 moveto
151 0 rlineto
0 -18 rlineto
-151 0 rlineto
closepath
stroke
1.0 1.0 1.0 setrgbcolor
newpath
704 -600 moveto
103 0 rlineto
0 -56 rlineto
-103 0 rlineto
closepath
eofill
0.0 0.0 0.0 setrgbcolor
newpath
704 -600 moveto
103 0 rlineto
0 -56 rlineto
-103 0 rlineto
closepath
stroke
newpath
705 -657 moveto
102 0 rlineto
0 0 rlineto
-102 0 rlineto
closepath
eofill
newpath
808 -601 moveto
0 0 rlineto
0 -56 rlineto
0 0 rlineto
closepath
eofill
1.0 1.0 1.0 setrgbcolor
newpath
704 -600 moveto
103 0 rlineto
0 -18 rlineto
-103 0 rlineto
closepath
eofill
0.0 0.0 0.0 setrgbcolor
newpath
704 -600 moveto
103 0 rlineto
0 -18 rlineto
-103 0 rlineto
closepath
stroke
718 -614 moveto
(<<Interface>>) show
1.0 1.0 1.0 setrgbcolor
newpath
704 -618 moveto
103 0 rlineto
0 -20 rlineto
-103 0 rlineto
closepath
eofill
0.0 0.0 0.0 setrgbcolor
newpath
704 -618 moveto
103 0 rlineto
0 -20 rlineto
-103 0 rlineto
closepath
stroke
734 -632 moveto
(execfunc) show
1.0 1.0 1.0 setrgbcolor
newpath
705 -618 moveto
101 0 rlineto
0 -1 rlineto
-101 0 rlineto
closepath
eofill
newpath
705 -618 moveto
101 0 rlineto
0 -1 rlineto
-101 0 rlineto
closepath
stroke
newpath
704 -638 moveto
103 0 rlineto
0 -18 rlineto
-103 0 rlineto
closepath
eofill
0.0 0.0 0.0 setrgbcolor
newpath
704 -638 moveto
103 0 rlineto
0 -18 rlineto
-103 0 rlineto
closepath
stroke
1.0 1.0 1.0 setrgbcolor
newpath
648 -512 moveto
76 0 rlineto
0 -56 rlineto
-76 0 rlineto
closepath
eofill
0.0 0.0 0.0 setrgbcolor
newpath
648 -512 moveto
76 0 rlineto
0 -56 rlineto
-76 0 rlineto
closepath
stroke
newpath
649 -569 moveto
75 0 rlineto
0 0 rlineto
-75 0 rlineto
closepath
eofill
newpath
725 -513 moveto
0 0 rlineto
0 -56 rlineto
0 0 rlineto
closepath
eofill
1.0 1.0 1.0 setrgbcolor
newpath
648 -512 moveto
76 0 rlineto
0 -18 rlineto
-76 0 rlineto
closepath
eofill
0.0 0.0 0.0 setrgbcolor
newpath
648 -512 moveto
76 0 rlineto
0 -18 rlineto
-76 0 rlineto
closepath
stroke
649 -526 moveto
(<<Interface>>) show
1.0 1.0 1.0 setrgbcolor
newpath
648 -530 moveto
76 0 rlineto
0 -20 rlineto
-76 0 rlineto
closepath
eofill
0.0 0.0 0.0 setrgbcolor
newpath
648 -530 moveto
76 0 rlineto
0 -20 rlineto
-76 0 rlineto
closepath
stroke
666 -544 moveto
(evalfunc) show
1.0 1.0 1.0 setrgbcolor
newpath
649 -530 moveto
74 0 rlineto
0 -1 rlineto
-74 0 rlineto
closepath
eofill
newpath
649 -530 moveto
74 0 rlineto
0 -1 rlineto
-74 0 rlineto
closepath
stroke
newpath
648 -550 moveto
76 0 rlineto
0 -18 rlineto
-76 0 rlineto
closepath
eofill
0.0 0.0 0.0 setrgbcolor
newpath
648 -550 moveto
76 0 rlineto
0 -18 rlineto
-76 0 rlineto
closepath
stroke
1.0 1.0 1.0 setrgbcolor
newpath
768 -448 moveto
87 0 rlineto
0 -98 rlineto
-87 0 rlineto
closepath
eofill
0.0 0.0 0.0 setrgbcolor
newpath
768 -448 moveto
87 0 rlineto
0 -98 rlineto
-87 0 rlineto
closepath
stroke
newpath
769 -547 moveto
86 0 rlineto
0 0 rlineto
-86 0 rlineto
closepath
eofill
newpath
856 -449 moveto
0 0 rlineto
0 -98 rlineto
0 0 rlineto
closepath
eofill
1.0 1.0 1.0 setrgbcolor
newpath
768 -448 moveto
87 0 rlineto
0 -20 rlineto
-87 0 rlineto
closepath
eofill
0.0 0.0 0.0 setrgbcolor
newpath
768 -448 moveto
87 0 rlineto
0 -20 rlineto
-87 0 rlineto
closepath
stroke
776 -462 moveto
(JNukeInstrRule) show
1.0 1.0 1.0 setrgbcolor
newpath
768 -468 moveto
87 0 rlineto
0 -59 rlineto
-87 0 rlineto
closepath
eofill
0.0 0.0 0.0 setrgbcolor
newpath
768 -468 moveto
87 0 rlineto
0 -59 rlineto
-87 0 rlineto
closepath
stroke
770 -483 moveto
(name : UCSString) show
770 -502 moveto
(eval : evalfunc) show
770 -521 moveto
(exec : execfunc) show
1.0 1.0 1.0 setrgbcolor
newpath
768 -527 moveto
87 0 rlineto
0 -19 rlineto
-87 0 rlineto
closepath
eofill
0.0 0.0 0.0 setrgbcolor
newpath
768 -527 moveto
87 0 rlineto
0 -19 rlineto
-87 0 rlineto
closepath
stroke
1.0 1.0 1.0 setrgbcolor
newpath
288 -392 moveto
126 0 rlineto
0 -73 rlineto
-126 0 rlineto
closepath
eofill
0.0 0.0 0.0 setrgbcolor
newpath
288 -392 moveto
126 0 rlineto
0 -73 rlineto
-126 0 rlineto
closepath
stroke
newpath
289 -466 moveto
125 0 rlineto
0 0 rlineto
-125 0 rlineto
closepath
eofill
newpath
415 -393 moveto
0 0 rlineto
0 -73 rlineto
0 0 rlineto
closepath
eofill
1.0 1.0 1.0 setrgbcolor
newpath
288 -392 moveto
126 0 rlineto
0 -20 rlineto
-126 0 rlineto
closepath
eofill
0.0 0.0 0.0 setrgbcolor
newpath
288 -392 moveto
126 0 rlineto
0 -20 rlineto
-126 0 rlineto
closepath
stroke
319 -406 moveto
(JNukeMethod) show
1.0 1.0 1.0 setrgbcolor
newpath
288 -412 moveto
126 0 rlineto
0 -36 rlineto
-126 0 rlineto
closepath
eofill
0.0 0.0 0.0 setrgbcolor
newpath
288 -412 moveto
126 0 rlineto
0 -36 rlineto
-126 0 rlineto
closepath
stroke
290 -427 moveto
(name : UCSString) show
290 -445 moveto
(signature : UCSString) show
1.0 1.0 1.0 setrgbcolor
newpath
288 -448 moveto
126 0 rlineto
0 -17 rlineto
-126 0 rlineto
closepath
eofill
0.0 0.0 0.0 setrgbcolor
newpath
288 -448 moveto
126 0 rlineto
0 -17 rlineto
-126 0 rlineto
closepath
stroke
1.0 1.0 1.0 setrgbcolor
newpath
824 -328 moveto
102 0 rlineto
0 -90 rlineto
-102 0 rlineto
closepath
eofill
0.0 0.0 0.0 setrgbcolor
newpath
824 -328 moveto
102 0 rlineto
0 -90 rlineto
-102 0 rlineto
closepath
stroke
newpath
825 -419 moveto
101 0 rlineto
0 0 rlineto
-101 0 rlineto
closepath
eofill
newpath
927 -329 moveto
0 0 rlineto
0 -90 rlineto
0 0 rlineto
closepath
eofill
1.0 1.0 1.0 setrgbcolor
newpath
824 -328 moveto
102 0 rlineto
0 -20 rlineto
-102 0 rlineto
closepath
eofill
0.0 0.0 0.0 setrgbcolor
newpath
824 -328 moveto
102 0 rlineto
0 -20 rlineto
-102 0 rlineto
closepath
stroke
845 -342 moveto
(JNukeMFInfo) show
1.0 1.0 1.0 setrgbcolor
newpath
824 -348 moveto
102 0 rlineto
0 -53 rlineto
-102 0 rlineto
closepath
eofill
0.0 0.0 0.0 setrgbcolor
newpath
824 -348 moveto
102 0 rlineto
0 -53 rlineto
-102 0 rlineto
closepath
stroke
826 -363 moveto
(accessFlags : int) show
826 -380 moveto
(nameIndex : int) show
826 -397 moveto
(descIndex : int) show
1.0 1.0 1.0 setrgbcolor
newpath
824 -401 moveto
102 0 rlineto
0 -17 rlineto
-102 0 rlineto
closepath
eofill
0.0 0.0 0.0 setrgbcolor
newpath
824 -401 moveto
102 0 rlineto
0 -17 rlineto
-102 0 rlineto
closepath
stroke
1.0 1.0 1.0 setrgbcolor
newpath
184 -16 moveto
152 0 rlineto
0 -63 rlineto
-152 0 rlineto
closepath
eofill
0.0 0.0 0.0 setrgbcolor
newpath
184 -16 moveto
152 0 rlineto
0 -63 rlineto
-152 0 rlineto
closepath
stroke
newpath
185 -80 moveto
151 0 rlineto
0 0 rlineto
-151 0 rlineto
closepath
eofill
newpath
337 -17 moveto
0 0 rlineto
0 -63 rlineto
0 0 rlineto
closepath
eofill
1.0 1.0 1.0 setrgbcolor
newpath
184 -16 moveto
152 0 rlineto
0 -20 rlineto
-152 0 rlineto
closepath
eofill
0.0 0.0 0.0 setrgbcolor
newpath
184 -16 moveto
152 0 rlineto
0 -20 rlineto
-152 0 rlineto
closepath
stroke
218 -30 moveto
(JNukeClassLoader) show
1.0 1.0 1.0 setrgbcolor
newpath
184 -36 moveto
152 0 rlineto
0 -22 rlineto
-152 0 rlineto
closepath
eofill
0.0 0.0 0.0 setrgbcolor
newpath
184 -36 moveto
152 0 rlineto
0 -22 rlineto
-152 0 rlineto
closepath
stroke
1.0 1.0 1.0 setrgbcolor
newpath
184 -58 moveto
152 0 rlineto
0 -21 rlineto
-152 0 rlineto
closepath
eofill
0.0 0.0 0.0 setrgbcolor
newpath
184 -58 moveto
152 0 rlineto
0 -21 rlineto
-152 0 rlineto
closepath
stroke
186 -73 moveto
(loadClass\(filename: String\) : int) show
1.0 1.0 1.0 setrgbcolor
newpath
176 -184 moveto
95 0 rlineto
0 -56 rlineto
-95 0 rlineto
closepath
eofill
0.0 0.0 0.0 setrgbcolor
newpath
176 -184 moveto
95 0 rlineto
0 -56 rlineto
-95 0 rlineto
closepath
stroke
newpath
177 -241 moveto
94 0 rlineto
0 0 rlineto
-94 0 rlineto
closepath
eofill
newpath
272 -185 moveto
0 0 rlineto
0 -56 rlineto
0 0 rlineto
closepath
eofill
1.0 1.0 1.0 setrgbcolor
newpath
176 -184 moveto
95 0 rlineto
0 -20 rlineto
-95 0 rlineto
closepath
eofill
0.0 0.0 0.0 setrgbcolor
newpath
176 -184 moveto
95 0 rlineto
0 -20 rlineto
-95 0 rlineto
closepath
stroke
187 -198 moveto
(JNukeClassPool) show
1.0 1.0 1.0 setrgbcolor
newpath
176 -204 moveto
95 0 rlineto
0 -18 rlineto
-95 0 rlineto
closepath
eofill
0.0 0.0 0.0 setrgbcolor
newpath
176 -204 moveto
95 0 rlineto
0 -18 rlineto
-95 0 rlineto
closepath
stroke
1.0 1.0 1.0 setrgbcolor
newpath
176 -222 moveto
95 0 rlineto
0 -18 rlineto
-95 0 rlineto
closepath
eofill
0.0 0.0 0.0 setrgbcolor
newpath
176 -222 moveto
95 0 rlineto
0 -18 rlineto
-95 0 rlineto
closepath
stroke
1.0 1.0 1.0 setrgbcolor
newpath
752 -24 moveto
147 0 rlineto
0 -107 rlineto
-147 0 rlineto
closepath
eofill
0.0 0.0 0.0 setrgbcolor
newpath
752 -24 moveto
147 0 rlineto
0 -107 rlineto
-147 0 rlineto
closepath
stroke
newpath
753 -132 moveto
146 0 rlineto
0 0 rlineto
-146 0 rlineto
closepath
eofill
newpath
900 -25 moveto
0 0 rlineto
0 -107 rlineto
0 0 rlineto
closepath
eofill
1.0 1.0 1.0 setrgbcolor
newpath
752 -24 moveto
147 0 rlineto
0 -20 rlineto
-147 0 rlineto
closepath
eofill
0.0 0.0 0.0 setrgbcolor
newpath
752 -24 moveto
147 0 rlineto
0 -20 rlineto
-147 0 rlineto
closepath
stroke
802 -38 moveto
(JNukeBCT) show
1.0 1.0 1.0 setrgbcolor
newpath
752 -44 moveto
147 0 rlineto
0 -17 rlineto
-147 0 rlineto
closepath
eofill
0.0 0.0 0.0 setrgbcolor
newpath
752 -44 moveto
147 0 rlineto
0 -17 rlineto
-147 0 rlineto
closepath
stroke
1.0 1.0 1.0 setrgbcolor
newpath
752 -61 moveto
147 0 rlineto
0 -70 rlineto
-147 0 rlineto
closepath
eofill
0.0 0.0 0.0 setrgbcolor
newpath
752 -61 moveto
147 0 rlineto
0 -70 rlineto
-147 0 rlineto
closepath
stroke
754 -76 moveto
(transformClass\(\) : void) show
754 -93 moveto
(transformByteCodes\(\) : int) show
754 -110 moveto
(inlineJsr\(\) : void) show
754 -127 moveto
(finalizeTransformation\(\) : void) show
1.0 1.0 1.0 setrgbcolor
newpath
784 -168 moveto
108 0 rlineto
0 -63 rlineto
-108 0 rlineto
closepath
eofill
0.0 0.0 0.0 setrgbcolor
newpath
784 -168 moveto
108 0 rlineto
0 -63 rlineto
-108 0 rlineto
closepath
stroke
newpath
785 -232 moveto
107 0 rlineto
0 0 rlineto
-107 0 rlineto
closepath
eofill
newpath
893 -169 moveto
0 0 rlineto
0 -63 rlineto
0 0 rlineto
closepath
eofill
1.0 1.0 1.0 setrgbcolor
newpath
784 -168 moveto
108 0 rlineto
0 -20 rlineto
-108 0 rlineto
closepath
eofill
0.0 0.0 0.0 setrgbcolor
newpath
784 -168 moveto
108 0 rlineto
0 -20 rlineto
-108 0 rlineto
closepath
stroke
805 -182 moveto
(JNukeBCTrans) show
1.0 1.0 1.0 setrgbcolor
newpath
784 -188 moveto
108 0 rlineto
0 -22 rlineto
-108 0 rlineto
closepath
eofill
0.0 0.0 0.0 setrgbcolor
newpath
784 -188 moveto
108 0 rlineto
0 -22 rlineto
-108 0 rlineto
closepath
stroke
1.0 1.0 1.0 setrgbcolor
newpath
784 -210 moveto
108 0 rlineto
0 -21 rlineto
-108 0 rlineto
closepath
eofill
0.0 0.0 0.0 setrgbcolor
newpath
784 -210 moveto
108 0 rlineto
0 -21 rlineto
-108 0 rlineto
closepath
stroke
1.0 1.0 1.0 setrgbcolor
newpath
688 -256 moveto
111 0 rlineto
0 -56 rlineto
-111 0 rlineto
closepath
eofill
0.0 0.0 0.0 setrgbcolor
newpath
688 -256 moveto
111 0 rlineto
0 -56 rlineto
-111 0 rlineto
closepath
stroke
newpath
689 -313 moveto
110 0 rlineto
0 0 rlineto
-110 0 rlineto
closepath
eofill
newpath
800 -257 moveto
0 0 rlineto
0 -56 rlineto
0 0 rlineto
closepath
eofill
1.0 1.0 1.0 setrgbcolor
newpath
688 -256 moveto
111 0 rlineto
0 -20 rlineto
-111 0 rlineto
closepath
eofill
0.0 0.0 0.0 setrgbcolor
newpath
688 -256 moveto
111 0 rlineto
0 -20 rlineto
-111 0 rlineto
closepath
stroke
703 -270 moveto
(JNukeClassWriter) show
1.0 1.0 1.0 setrgbcolor
newpath
688 -276 moveto
111 0 rlineto
0 -18 rlineto
-111 0 rlineto
closepath
eofill
0.0 0.0 0.0 setrgbcolor
newpath
688 -276 moveto
111 0 rlineto
0 -18 rlineto
-111 0 rlineto
closepath
stroke
1.0 1.0 1.0 setrgbcolor
newpath
688 -294 moveto
111 0 rlineto
0 -18 rlineto
-111 0 rlineto
closepath
eofill
0.0 0.0 0.0 setrgbcolor
newpath
688 -294 moveto
111 0 rlineto
0 -18 rlineto
-111 0 rlineto
closepath
stroke
1.0 1.0 1.0 setrgbcolor
newpath
280 -552 moveto
107 0 rlineto
0 -95 rlineto
-107 0 rlineto
closepath
eofill
0.0 0.0 0.0 setrgbcolor
newpath
280 -552 moveto
107 0 rlineto
0 -95 rlineto
-107 0 rlineto
closepath
stroke
newpath
281 -648 moveto
106 0 rlineto
0 0 rlineto
-106 0 rlineto
closepath
eofill
newpath
388 -553 moveto
0 0 rlineto
0 -95 rlineto
0 0 rlineto
closepath
eofill
1.0 1.0 1.0 setrgbcolor
newpath
280 -552 moveto
107 0 rlineto
0 -20 rlineto
-107 0 rlineto
closepath
eofill
0.0 0.0 0.0 setrgbcolor
newpath
280 -552 moveto
107 0 rlineto
0 -20 rlineto
-107 0 rlineto
closepath
stroke
297 -566 moveto
(JNukeByteCode) show
1.0 1.0 1.0 setrgbcolor
newpath
280 -572 moveto
107 0 rlineto
0 -57 rlineto
-107 0 rlineto
closepath
eofill
0.0 0.0 0.0 setrgbcolor
newpath
280 -572 moveto
107 0 rlineto
0 -57 rlineto
-107 0 rlineto
closepath
stroke
282 -587 moveto
(opcode : int) show
282 -606 moveto
(argLen : int) show
282 -625 moveto
(args : List) show
1.0 1.0 1.0 setrgbcolor
newpath
280 -629 moveto
107 0 rlineto
0 -18 rlineto
-107 0 rlineto
closepath
eofill
0.0 0.0 0.0 setrgbcolor
newpath
280 -629 moveto
107 0 rlineto
0 -18 rlineto
-107 0 rlineto
closepath
stroke
1.0 1.0 1.0 setrgbcolor
newpath
984 -600 moveto
135 0 rlineto
0 -56 rlineto
-135 0 rlineto
closepath
eofill
0.0 0.0 0.0 setrgbcolor
newpath
984 -600 moveto
135 0 rlineto
0 -56 rlineto
-135 0 rlineto
closepath
stroke
newpath
985 -657 moveto
134 0 rlineto
0 0 rlineto
-134 0 rlineto
closepath
eofill
newpath
1120 -601 moveto
0 0 rlineto
0 -56 rlineto
0 0 rlineto
closepath
eofill
1.0 1.0 1.0 setrgbcolor
newpath
984 -600 moveto
135 0 rlineto
0 -20 rlineto
-135 0 rlineto
closepath
eofill
0.0 0.0 0.0 setrgbcolor
newpath
984 -600 moveto
135 0 rlineto
0 -20 rlineto
-135 0 rlineto
closepath
stroke
993 -614 moveto
(JNukeScheduleFileParser) show
1.0 1.0 1.0 setrgbcolor
newpath
984 -620 moveto
135 0 rlineto
0 -18 rlineto
-135 0 rlineto
closepath
eofill
0.0 0.0 0.0 setrgbcolor
newpath
984 -620 moveto
135 0 rlineto
0 -18 rlineto
-135 0 rlineto
closepath
stroke
1.0 1.0 1.0 setrgbcolor
newpath
984 -638 moveto
135 0 rlineto
0 -18 rlineto
-135 0 rlineto
closepath
eofill
0.0 0.0 0.0 setrgbcolor
newpath
984 -638 moveto
135 0 rlineto
0 -18 rlineto
-135 0 rlineto
closepath
stroke
1.0 1.0 1.0 setrgbcolor
newpath
944 -480 moveto
175 0 rlineto
0 -56 rlineto
-175 0 rlineto
closepath
eofill
0.0 0.0 0.0 setrgbcolor
newpath
944 -480 moveto
175 0 rlineto
0 -56 rlineto
-175 0 rlineto
closepath
stroke
newpath
945 -537 moveto
174 0 rlineto
0 0 rlineto
-174 0 rlineto
closepath
eofill
newpath
1120 -481 moveto
0 0 rlineto
0 -56 rlineto
0 0 rlineto
closepath
eofill
1.0 1.0 1.0 setrgbcolor
newpath
944 -480 moveto
175 0 rlineto
0 -20 rlineto
-175 0 rlineto
closepath
eofill
0.0 0.0 0.0 setrgbcolor
newpath
944 -480 moveto
175 0 rlineto
0 -20 rlineto
-175 0 rlineto
closepath
stroke
986 -494 moveto
(JNukeReplayFacility) show
1.0 1.0 1.0 setrgbcolor
newpath
944 -500 moveto
175 0 rlineto
0 -18 rlineto
-175 0 rlineto
closepath
eofill
0.0 0.0 0.0 setrgbcolor
newpath
944 -500 moveto
175 0 rlineto
0 -18 rlineto
-175 0 rlineto
closepath
stroke
1.0 1.0 1.0 setrgbcolor
newpath
944 -518 moveto
175 0 rlineto
0 -18 rlineto
-175 0 rlineto
closepath
eofill
0.0 0.0 0.0 setrgbcolor
newpath
944 -518 moveto
175 0 rlineto
0 -18 rlineto
-175 0 rlineto
closepath
stroke
1.0 1.0 1.0 setrgbcolor
newpath
832 -600 moveto
119 0 rlineto
0 -56 rlineto
-119 0 rlineto
closepath
eofill
0.0 0.0 0.0 setrgbcolor
newpath
832 -600 moveto
119 0 rlineto
0 -56 rlineto
-119 0 rlineto
closepath
stroke
newpath
833 -657 moveto
118 0 rlineto
0 0 rlineto
-118 0 rlineto
closepath
eofill
newpath
952 -601 moveto
0 0 rlineto
0 -56 rlineto
0 0 rlineto
closepath
eofill
1.0 1.0 1.0 setrgbcolor
newpath
832 -600 moveto
119 0 rlineto
0 -20 rlineto
-119 0 rlineto
closepath
eofill
0.0 0.0 0.0 setrgbcolor
newpath
832 -600 moveto
119 0 rlineto
0 -20 rlineto
-119 0 rlineto
closepath
stroke
843 -614 moveto
(JNukeThreadChange) show
1.0 1.0 1.0 setrgbcolor
newpath
832 -620 moveto
119 0 rlineto
0 -18 rlineto
-119 0 rlineto
closepath
eofill
0.0 0.0 0.0 setrgbcolor
newpath
832 -620 moveto
119 0 rlineto
0 -18 rlineto
-119 0 rlineto
closepath
stroke
1.0 1.0 1.0 setrgbcolor
newpath
832 -638 moveto
119 0 rlineto
0 -18 rlineto
-119 0 rlineto
closepath
eofill
0.0 0.0 0.0 setrgbcolor
newpath
832 -638 moveto
119 0 rlineto
0 -18 rlineto
-119 0 rlineto
closepath
stroke
1.0 1.0 1.0 setrgbcolor
newpath
128 -384 moveto
97 0 rlineto
0 -90 rlineto
-97 0 rlineto
closepath
eofill
0.0 0.0 0.0 setrgbcolor
newpath
128 -384 moveto
97 0 rlineto
0 -90 rlineto
-97 0 rlineto
closepath
stroke
newpath
129 -475 moveto
96 0 rlineto
0 0 rlineto
-96 0 rlineto
closepath
eofill
newpath
226 -385 moveto
0 0 rlineto
0 -90 rlineto
0 0 rlineto
closepath
eofill
1.0 1.0 1.0 setrgbcolor
newpath
128 -384 moveto
97 0 rlineto
0 -20 rlineto
-97 0 rlineto
closepath
eofill
0.0 0.0 0.0 setrgbcolor
newpath
128 -384 moveto
97 0 rlineto
0 -20 rlineto
-97 0 rlineto
closepath
stroke
142 -398 moveto
(JNukeEHandler) show
1.0 1.0 1.0 setrgbcolor
newpath
128 -404 moveto
97 0 rlineto
0 -53 rlineto
-97 0 rlineto
closepath
eofill
0.0 0.0 0.0 setrgbcolor
newpath
128 -404 moveto
97 0 rlineto
0 -53 rlineto
-97 0 rlineto
closepath
stroke
130 -419 moveto
(fromPC : int) show
130 -436 moveto
(toPC : int) show
130 -453 moveto
(handlerPC : int) show
1.0 1.0 1.0 setrgbcolor
newpath
128 -457 moveto
97 0 rlineto
0 -17 rlineto
-97 0 rlineto
closepath
eofill
0.0 0.0 0.0 setrgbcolor
newpath
128 -457 moveto
97 0 rlineto
0 -17 rlineto
-97 0 rlineto
closepath
stroke
newpath
1040 -160 moveto
1024 -208 lineto
stroke
1.0 1.0 1.0 setrgbcolor
newpath
928 -144 moveto
206 0 rlineto
0 -18 rlineto
-206 0 rlineto
closepath
eofill
0.0 0.0 0.0 setrgbcolor
%% newpath
%% 928 -144 moveto
%% 206 0 rlineto
%% 0 -18 rlineto
%% -206 0 rlineto
%% closepath
%% stroke
isolatin1encoding /_Helvetica /Helvetica RE
/_Helvetica findfont
10 scalefont setfont
0.0 0.0 1.0 setrgbcolor
929 -159 moveto
(          New objects devised in this thesis  ) show
0.0 0.0 0.0 setrgbcolor
newpath
311 -392 moveto
311 -292 lineto
stroke
newpath
304 -380 moveto
311 -392 lineto
stroke
newpath
318 -380 moveto
311 -392 lineto
stroke
1.0 1.0 1.0 setrgbcolor
newpath
311 -293 moveto
316 -303 lineto
311 -313 lineto
306 -303 lineto
closepath
eofill
0.0 0.0 0.0 setrgbcolor
newpath
311 -293 moveto
316 -303 lineto
311 -313 lineto
306 -303 lineto
closepath
stroke
isolatin1encoding /_Helvetica /Helvetica RE
/_Helvetica findfont
9 scalefont setfont
265 -348 moveto
(   methods) show
287 -382 moveto
(0..*) show
newpath
432 -384 moveto
408 -292 lineto
stroke
1.0 1.0 1.0 setrgbcolor
newpath
409 -293 moveto
415 -301 lineto
413 -313 lineto
406 -303 lineto
closepath
eofill
0.0 0.0 0.0 setrgbcolor
newpath
409 -293 moveto
415 -301 lineto
413 -313 lineto
406 -303 lineto
closepath
stroke
384 -352 moveto
(    fields) show
389 -316 moveto
(0..*) show
newpath
856 -456 moveto
952 -456 lineto
stroke
1.0 1.0 1.0 setrgbcolor
newpath
951 -456 moveto
941 -461 lineto
931 -456 lineto
941 -451 lineto
closepath
eofill
0.0 0.0 0.0 setrgbcolor
newpath
951 -456 moveto
941 -461 lineto
931 -456 lineto
941 -451 lineto
closepath
stroke
892 -437 moveto
(rules) show
862 -446 moveto
(0..*) show
newpath
560 -122 moveto
565 -122 lineto
stroke
newpath
570 -122 moveto
575 -122 lineto
stroke
newpath
580 -122 moveto
585 -122 lineto
stroke
newpath
590 -122 moveto
592 -122 lineto
stroke
newpath
579 -129 moveto
591 -122 lineto
stroke
newpath
579 -115 moveto
591 -122 lineto
stroke
newpath
824 -392 moveto
819 -392 lineto
stroke
newpath
814 -392 moveto
809 -392 lineto
stroke
newpath
804 -392 moveto
799 -392 lineto
stroke
newpath
794 -392 moveto
789 -392 lineto
stroke
newpath
784 -392 moveto
779 -392 lineto
stroke
newpath
774 -392 moveto
769 -392 lineto
stroke
newpath
764 -392 moveto
760 -392 lineto
stroke
newpath
773 -385 moveto
761 -392 lineto
stroke
newpath
773 -399 moveto
761 -392 lineto
stroke
newpath
648 -544 moveto
643 -544 lineto
stroke
newpath
638 -544 moveto
633 -544 lineto
stroke
newpath
628 -544 moveto
623 -544 lineto
stroke
newpath
618 -544 moveto
613 -544 lineto
stroke
newpath
608 -544 moveto
603 -544 lineto
stroke
newpath
598 -544 moveto
593 -544 lineto
stroke
newpath
605 -537 moveto
593 -544 lineto
stroke
newpath
605 -551 moveto
593 -544 lineto
stroke
newpath
704 -640 moveto
699 -640 lineto
stroke
newpath
694 -640 moveto
689 -640 lineto
stroke
newpath
684 -640 moveto
679 -640 lineto
stroke
newpath
674 -640 moveto
669 -640 lineto
stroke
newpath
664 -640 moveto
659 -640 lineto
stroke
newpath
654 -640 moveto
649 -640 lineto
stroke
newpath
644 -640 moveto
639 -640 lineto
stroke
newpath
634 -640 moveto
629 -640 lineto
stroke
newpath
624 -640 moveto
619 -640 lineto
stroke
newpath
614 -640 moveto
609 -640 lineto
stroke
newpath
604 -640 moveto
599 -640 lineto
stroke
newpath
594 -640 moveto
592 -640 lineto
stroke
newpath
605 -633 moveto
593 -640 lineto
stroke
newpath
605 -647 moveto
593 -640 lineto
stroke
newpath
616 -384 moveto
616 -305 lineto
stroke
newpath
616 -384 moveto
611 -374 lineto
616 -364 lineto
621 -374 lineto
closepath
eofill
newpath
616 -384 moveto
611 -374 lineto
616 -364 lineto
621 -374 lineto
closepath
stroke
559 -341 moveto
(constant pool) show
newpath
616 -153 moveto
616 -248 lineto
stroke
newpath
616 -153 moveto
621 -163 lineto
616 -173 lineto
611 -163 lineto
closepath
eofill
newpath
616 -153 moveto
621 -163 lineto
616 -173 lineto
611 -163 lineto
closepath
stroke
559 -206 moveto
(constant pool) show
newpath
288 -184 moveto
288 -179 lineto
stroke
newpath
288 -174 moveto
288 -169 lineto
stroke
newpath
288 -164 moveto
288 -159 lineto
stroke
newpath
288 -154 moveto
288 -149 lineto
stroke
newpath
288 -144 moveto
288 -139 lineto
stroke
newpath
288 -134 moveto
288 -129 lineto
stroke
newpath
288 -124 moveto
288 -119 lineto
stroke
newpath
288 -114 moveto
288 -109 lineto
stroke
newpath
288 -104 moveto
288 -99 lineto
stroke
newpath
288 -94 moveto
288 -89 lineto
stroke
newpath
288 -84 moveto
288 -80 lineto
stroke
newpath
295 -93 moveto
288 -81 lineto
stroke
newpath
281 -93 moveto
288 -81 lineto
stroke
newpath
224 -80 moveto
224 -184 lineto
stroke
newpath
231 -92 moveto
224 -80 lineto
stroke
newpath
217 -92 moveto
224 -80 lineto
stroke
newpath
224 -183 moveto
219 -173 lineto
224 -163 lineto
229 -173 lineto
closepath
eofill
newpath
224 -183 moveto
219 -173 lineto
224 -163 lineto
229 -173 lineto
closepath
stroke
221 -138 moveto
(   class loader) show
newpath
960 -232 moveto
900 -132 lineto
stroke
1.0 1.0 1.0 setrgbcolor
newpath
901 -133 moveto
913 -139 lineto
901 -146 lineto
closepath
eofill
0.0 0.0 0.0 setrgbcolor
newpath
901 -133 moveto
913 -139 lineto
901 -146 lineto
closepath
stroke
newpath
792 -168 moveto
792 -132 lineto
stroke
1.0 1.0 1.0 setrgbcolor
newpath
792 -133 moveto
799 -145 lineto
785 -145 lineto
closepath
eofill
0.0 0.0 0.0 setrgbcolor
newpath
792 -133 moveto
799 -145 lineto
785 -145 lineto
closepath
stroke
newpath
688 -153 moveto
688 -256 lineto
stroke
newpath
688 -255 moveto
683 -245 lineto
688 -235 lineto
693 -245 lineto
closepath
eofill
newpath
688 -255 moveto
683 -245 lineto
688 -235 lineto
693 -245 lineto
closepath
stroke
654 -210 moveto
(attribute builder) show
newpath
736 -384 moveto
736 -313 lineto
stroke
newpath
736 -314 moveto
741 -324 lineto
736 -334 lineto
731 -324 lineto
closepath
eofill
newpath
736 -314 moveto
741 -324 lineto
736 -334 lineto
731 -324 lineto
closepath
stroke
668 -355 moveto
(method and field factory) show
newpath
992 -296 moveto
992 -400 lineto
stroke
newpath
992 -296 moveto
997 -306 lineto
992 -316 lineto
987 -306 lineto
closepath
eofill
newpath
992 -296 moveto
997 -306 lineto
992 -316 lineto
987 -306 lineto
closepath
stroke
991 -354 moveto
(  instrument) show
newpath
960 -272 moveto
800 -272 lineto
stroke
newpath
960 -272 moveto
950 -277 lineto
940 -272 lineto
950 -267 lineto
closepath
eofill
newpath
960 -272 moveto
950 -277 lineto
940 -272 lineto
950 -267 lineto
closepath
stroke
853 -290 moveto
(class writer) show
newpath
768 -547 moveto
725 -547 lineto
stroke
newpath
768 -547 moveto
758 -552 lineto
748 -547 lineto
758 -542 lineto
closepath
eofill
newpath
768 -547 moveto
758 -552 lineto
748 -547 lineto
758 -542 lineto
closepath
stroke
737 -568 moveto
(eval) show
newpath
800 -547 moveto
800 -600 lineto
stroke
newpath
800 -547 moveto
805 -557 lineto
800 -567 lineto
795 -557 lineto
closepath
eofill
newpath
800 -547 moveto
805 -557 lineto
800 -567 lineto
795 -557 lineto
closepath
stroke
803 -579 moveto
(exec) show
newpath
752 -32 moveto
337 -32 lineto
stroke
1.0 1.0 1.0 setrgbcolor
newpath
338 -32 moveto
348 -27 lineto
358 -32 lineto
348 -37 lineto
closepath
eofill
0.0 0.0 0.0 setrgbcolor
newpath
338 -32 moveto
348 -27 lineto
358 -32 lineto
348 -37 lineto
closepath
stroke
510 -50 moveto
(transformation) show
newpath
688 -273 moveto
656 -273 lineto
stroke
newpath
688 -273 moveto
678 -278 lineto
668 -273 lineto
678 -268 lineto
closepath
eofill
newpath
688 -273 moveto
678 -278 lineto
668 -273 lineto
678 -268 lineto
closepath
stroke
666 -304 moveto
(cp) show
newpath
344 -466 moveto
344 -552 lineto
stroke
1.0 1.0 1.0 setrgbcolor
newpath
344 -466 moveto
349 -476 lineto
344 -486 lineto
339 -476 lineto
closepath
eofill
0.0 0.0 0.0 setrgbcolor
newpath
344 -466 moveto
349 -476 lineto
344 -486 lineto
339 -476 lineto
closepath
stroke
350 -486 moveto
(0..*) show
294 -507 moveto
(byteCodes) show
newpath
856 -521 moveto
861 -521 lineto
stroke
newpath
866 -521 moveto
871 -521 lineto
stroke
newpath
876 -521 moveto
881 -521 lineto
stroke
newpath
886 -521 moveto
891 -521 lineto
stroke
newpath
896 -521 moveto
901 -521 lineto
stroke
newpath
906 -521 moveto
911 -521 lineto
stroke
newpath
916 -521 moveto
921 -521 lineto
stroke
newpath
926 -521 moveto
931 -521 lineto
stroke
newpath
936 -521 moveto
941 -521 lineto
stroke
newpath
931 -528 moveto
943 -521 lineto
stroke
newpath
931 -514 moveto
943 -521 lineto
stroke
newpath
952 -625 moveto
957 -625 lineto
stroke
newpath
962 -625 moveto
967 -625 lineto
stroke
newpath
972 -625 moveto
977 -625 lineto
stroke
newpath
982 -625 moveto
984 -625 lineto
stroke
newpath
971 -632 moveto
983 -625 lineto
stroke
newpath
971 -618 moveto
983 -625 lineto
stroke
newpath
944 -537 moveto
944 -600 lineto
stroke
1.0 1.0 1.0 setrgbcolor
newpath
944 -537 moveto
949 -547 lineto
944 -557 lineto
939 -547 lineto
closepath
eofill
0.0 0.0 0.0 setrgbcolor
newpath
944 -537 moveto
949 -547 lineto
944 -557 lineto
939 -547 lineto
closepath
stroke
932 -574 moveto
(        replay schedule) show
newpath
288 -432 moveto
226 -432 lineto
stroke
1.0 1.0 1.0 setrgbcolor
newpath
288 -432 moveto
278 -437 lineto
268 -432 lineto
278 -427 lineto
closepath
eofill
0.0 0.0 0.0 setrgbcolor
newpath
288 -432 moveto
278 -437 lineto
268 -432 lineto
278 -427 lineto
closepath
stroke
newpath
239 -425 moveto
227 -432 lineto
stroke
newpath
239 -439 moveto
227 -432 lineto
stroke
231 -463 moveto
(exceptions) show
showpage
%%Trailer
