digraph cfg2 {
	ranksep = 0.25;
	athrow_1	[ label = "C1: athrow" ];
	athrow_2	[ label = "C2: athrow" ];
	return_1	[ label = "main: return" ];
	return_2	[ label = "S1: return" ];

	main	-> return_1;
	main	-> S1	[ style = dotted ];
	S1	-> W;
	W	-> L;
	W	-> X;
	L	-> return_2;
	L	-> S2	[ style = dotted ];
	X	-> return_1	[ style = dotted ];
	X	-> athrow_1	[ style = dotted ];
	S2	-> X;
	S2	-> Y;
	Y	-> athrow_2	[ style = dotted ];
	Y	-> return_2	[ style = dotted ];
	C1	-> athrow_1;
	C1	-> S1	[ style = dotted ];
	C2	-> athrow_2;
	C2	-> S2	[ style = dotted ];
}
