%!PS-Adobe-2.0 EPSF-2.0
%%Title: bild1.eps
%%Creator: fig2dev Version 3.2 Patchlevel 3d
%%CreationDate: Sun Aug  3 15:10:03 2003
%%For: zboris@vera (B Z)
%%BoundingBox: 0 0 260 164
%%Magnification: 1.0000
%%EndComments
/$F2psDict 200 dict def
$F2psDict begin
$F2psDict /mtrx matrix put
/col-1 {0 setgray} bind def
/col0 {0.000 0.000 0.000 srgb} bind def
/col1 {0.000 0.000 1.000 srgb} bind def
/col2 {0.000 1.000 0.000 srgb} bind def
/col3 {0.000 1.000 1.000 srgb} bind def
/col4 {1.000 0.000 0.000 srgb} bind def
/col5 {1.000 0.000 1.000 srgb} bind def
/col6 {1.000 1.000 0.000 srgb} bind def
/col7 {1.000 1.000 1.000 srgb} bind def
/col8 {0.000 0.000 0.560 srgb} bind def
/col9 {0.000 0.000 0.690 srgb} bind def
/col10 {0.000 0.000 0.820 srgb} bind def
/col11 {0.530 0.810 1.000 srgb} bind def
/col12 {0.000 0.560 0.000 srgb} bind def
/col13 {0.000 0.690 0.000 srgb} bind def
/col14 {0.000 0.820 0.000 srgb} bind def
/col15 {0.000 0.560 0.560 srgb} bind def
/col16 {0.000 0.690 0.690 srgb} bind def
/col17 {0.000 0.820 0.820 srgb} bind def
/col18 {0.560 0.000 0.000 srgb} bind def
/col19 {0.690 0.000 0.000 srgb} bind def
/col20 {0.820 0.000 0.000 srgb} bind def
/col21 {0.560 0.000 0.560 srgb} bind def
/col22 {0.690 0.000 0.690 srgb} bind def
/col23 {0.820 0.000 0.820 srgb} bind def
/col24 {0.500 0.190 0.000 srgb} bind def
/col25 {0.630 0.250 0.000 srgb} bind def
/col26 {0.750 0.380 0.000 srgb} bind def
/col27 {1.000 0.500 0.500 srgb} bind def
/col28 {1.000 0.630 0.630 srgb} bind def
/col29 {1.000 0.750 0.750 srgb} bind def
/col30 {1.000 0.880 0.880 srgb} bind def
/col31 {1.000 0.840 0.000 srgb} bind def

end
save
newpath 0 164 moveto 0 0 lineto 260 0 lineto 260 164 lineto closepath clip newpath
-180.7 301.2 translate
1 -1 scale

/cp {closepath} bind def
/ef {eofill} bind def
/gr {grestore} bind def
/gs {gsave} bind def
/sa {save} bind def
/rs {restore} bind def
/l {lineto} bind def
/m {moveto} bind def
/rm {rmoveto} bind def
/n {newpath} bind def
/s {stroke} bind def
/sh {show} bind def
/slc {setlinecap} bind def
/slj {setlinejoin} bind def
/slw {setlinewidth} bind def
/srgb {setrgbcolor} bind def
/rot {rotate} bind def
/sc {scale} bind def
/sd {setdash} bind def
/ff {findfont} bind def
/sf {setfont} bind def
/scf {scalefont} bind def
/sw {stringwidth} bind def
/tr {translate} bind def
/tnt {dup dup currentrgbcolor
  4 -2 roll dup 1 exch sub 3 -1 roll mul add
  4 -2 roll dup 1 exch sub 3 -1 roll mul add
  4 -2 roll dup 1 exch sub 3 -1 roll mul add srgb}
  bind def
/shd {dup dup currentrgbcolor 4 -2 roll mul 4 -2 roll mul
  4 -2 roll mul srgb} bind def
/$F2psBegin {$F2psDict begin /$F2psEnteredState save def} def
/$F2psEnd {$F2psEnteredState restore end} def

$F2psBegin
10 setmiterlimit
 0.06299 0.06299 sc
%
% Fig objects follow
%
% Polyline
7.500 slw
n 2880 2205 m 6975 2205 l 6975 4770 l 2880 4770 l
 cp gs col0 s gr 
% Polyline
gs  clippath
6315 4515 m 6375 4515 l 6375 4363 l 6345 4483 l 6315 4363 l cp
eoclip
n 6345 2655 m
 6345 4500 l gs col0 s gr gr

% arrowhead
n 6315 4363 m 6345 4483 l 6375 4363 l  col0 s
% Polyline
gs  clippath
4875 4515 m 4935 4515 l 4935 4363 l 4905 4483 l 4875 4363 l cp
eoclip
n 4905 2655 m
 4905 4500 l gs col0 s gr gr

% arrowhead
n 4875 4363 m 4905 4483 l 4935 4363 l  col0 s
% Polyline
gs  clippath
3480 3120 m 3540 3120 l 3540 2968 l 3510 3088 l 3480 2968 l cp
eoclip
n 3510 2610 m
 3510 3105 l gs col0 s gr gr

% arrowhead
n 3480 2968 m 3510 3088 l 3540 2968 l  col0 s
% Polyline
 [60] 0 sd
gs  clippath
3480 3840 m 3540 3840 l 3540 3688 l 3510 3808 l 3480 3688 l cp
eoclip
n 3510 3150 m
 3510 3825 l gs col0 s gr gr
 [] 0 sd
% arrowhead
n 3480 3688 m 3510 3808 l 3540 3688 l  col0 s
% Polyline
gs  clippath
3480 4470 m 3540 4470 l 3540 4318 l 3510 4438 l 3480 4318 l cp
eoclip
n 3510 3825 m
 3510 4455 l gs col0 s gr gr

% arrowhead
n 3480 4318 m 3510 4438 l 3540 4318 l  col0 s
% Polyline
n 3555 3060 m 3735 3375 l
 3555 3690 l gs col0 s gr 
/Times-Roman ff 240.00 scf sf
3150 2520 m
gs 1 -1 sc (Thread1          Thread2          Thread3) col0 sh gr
/Times-Roman ff 240.00 scf sf
3780 3465 m
gs 1 -1 sc (I/O) col0 sh gr
$F2psEnd
rs
