%!PS-Adobe-2.0 EPSF-2.0
%%Title: thread.dia
%%Creator: Dia v0.90
%%CreationDate: Thu Jan 30 19:41:45 2003
%%For: pascal
%%Magnification: 1.0000
%%Orientation: Portrait
%%BoundingBox: 0 0 261 329
%%Pages: 1
%%EndComments
%%BeginProlog
/cp {closepath} bind def
/c {curveto} bind def
/f {fill} bind def
/a {arc} bind def
/ef {eofill} bind def
/ex {exch} bind def
/gr {grestore} bind def
/gs {gsave} bind def
/sa {save} bind def
/rs {restore} bind def
/l {lineto} bind def
/m {moveto} bind def
/rm {rmoveto} bind def
/n {newpath} bind def
/s {stroke} bind def
/sh {show} bind def
/slc {setlinecap} bind def
/slj {setlinejoin} bind def
/slw {setlinewidth} bind def
/srgb {setrgbcolor} bind def
/rot {rotate} bind def
/sc {scale} bind def
/sd {setdash} bind def
/ff {findfont} bind def
/sf {setfont} bind def
/scf {scalefont} bind def
/sw {stringwidth pop} bind def
/tr {translate} bind def

/ellipsedict 8 dict def
ellipsedict /mtrx matrix put
/ellipse
{ ellipsedict begin
   /endangle exch def
   /startangle exch def
   /yrad exch def
   /xrad exch def
   /y exch def
   /x exch def   /savematrix mtrx currentmatrix def
   x y tr xrad yrad sc
   0 0 1 startangle endangle arc
   savematrix setmatrix
   end
} def

/mergeprocs {
dup length
3 -1 roll
dup
length
dup
5 1 roll
3 -1 roll
add
array cvx
dup
3 -1 roll
0 exch
putinterval
dup
4 2 roll
putinterval
} bind def
%%EndProlog

%%BeginSetup
%%EndSetup
28.346000 -28.346000 scale
-4.135200 -18.300000 translate

1.000000 1.000000 1.000000 srgb
n 5.250000 6.750000 m 5.250000 8.650000 l 12.193200 8.650000 l 12.193200 6.750000 l f
0.100000 slw
[] 0 sd
[] 0 sd
0 slj
0.000000 0.000000 0.000000 srgb
n 5.250000 6.750000 m 5.250000 8.650000 l 12.193200 8.650000 l 12.193200 6.750000 l cp s
 [ /xi /xi /xi /xi /xi /xi /xi /xi /xi /xi /xi /xi /xi /xi /xi /xi
 /xi /xi /xi /xi /xi /xi /xi /xi /xi /xi /xi /xi /xi /xi /xi /xi
 /J /N /u /k /e /T /h /r /xi /xi /a /d /S /t /c /F
 /m /R /g /i /s /xi /xi /xi /xi /xi /xi /xi /xi /xi /xi /xi
 /xi /xi /xi /xi /xi /xi /xi /xi /xi /xi /xi /xi /xi /xi /xi /xi
 /xi /xi /xi /xi /xi /xi /xi /xi /xi /xi /xi /xi /xi /xi /xi /xi
 /xi /xi /xi /xi /xi /xi /xi /xi /xi /xi /xi /xi /xi /xi /xi /xi
 /xi /xi /xi /xi /xi /xi /xi /xi /xi /xi /xi /xi /xi /xi /xi /xi
 /xi /xi /xi /xi /xi /xi /xi /xi /xi /xi /xi /xi /xi /xi /xi /xi
 /xi /xi /xi /xi /xi /xi /xi /xi /xi /xi /xi /xi /xi /xi /xi /xi
 /xi /xi /xi /xi /xi /xi /xi /xi /xi /xi /xi /xi /xi /xi /xi /xi
 /xi /xi /xi /xi /xi /xi /xi /xi /xi /xi /xi /xi /xi /xi /xi /xi
 /xi /xi /xi /xi /xi /xi /xi /xi /xi /xi /xi /xi /xi /xi /xi /xi
 /xi /xi /xi /xi /xi /xi /xi /xi /xi /xi /xi /xi /xi /xi /xi /xi
 /xi /xi /xi /xi /xi /xi /xi /xi /xi /xi /xi /xi /xi /xi /xi /xi
 /xi /xi /xi /xi /xi /xi /xi /xi /xi /xi /xi /xi /xi /xi /xi /xi
] /e0 exch def
/Courier_e0 undefinefont
/Courier_e0
  /Courier findfont
  dup length dict begin
  {1 index /FID ne {def} {pop pop} ifelse} forall
  /Encoding e0 def
  currentdict end
definefont pop
/Courier_e0 ff 0.800000 scf sf
( !"#$%&'$*+) sw
2 div 8.721600 ex sub 7.896491 m ( !"#$%&'$*+)
 gs 1 -1 sc sh gr
1.000000 1.000000 1.000000 srgb
n 4.185200 11.450000 m 4.185200 13.350000 l 13.258000 13.350000 l 13.258000 11.450000 l f
0.100000 slw
[] 0 sd
[] 0 sd
0 slj
0.000000 0.000000 0.000000 srgb
n 4.185200 11.450000 m 4.185200 13.350000 l 13.258000 13.350000 l 13.258000 11.450000 l cp s
/Courier_e0 ff 0.800000 scf sf
( !"#$,-*.#/'*0$) sw
2 div 8.721600 ex sub 12.596491 m ( !"#$,-*.#/'*0$)
 gs 1 -1 sc sh gr
1.000000 1.000000 1.000000 srgb
n 4.717600 16.350000 m 4.717600 18.250000 l 12.725600 18.250000 l 12.725600 16.350000 l f
0.100000 slw
[] 0 sd
[] 0 sd
0 slj
0.000000 0.000000 0.000000 srgb
n 4.717600 16.350000 m 4.717600 18.250000 l 12.725600 18.250000 l 12.725600 16.350000 l cp s
/Courier_e0 ff 0.800000 scf sf
( !"#$1$234-$') sw
2 div 8.721600 ex sub 17.496491 m ( !"#$1$234-$')
 gs 1 -1 sc sh gr
0.100000 slw
[] 0 sd
0 slj
0 slc
n 8.721600 11.450000 m 8.721600 10.500000 l 8.721600 10.500000 l 8.721600 8.650000 l s
[] 0 sd
0 slj
0 slc
n 8.721600 8.650000 m 8.961600 9.350000 l 8.721600 10.050000 l 8.481600 9.350000 l f
0.100000 slw
[] 0 sd
0 slj
0 slc
n 8.721600 16.350000 m 8.721600 15.200000 l 8.721600 15.200000 l 8.721600 13.350000 l s
[] 0 sd
0 slj
0 slc
n 8.721600 13.350000 m 8.961600 14.050000 l 8.721600 14.750000 l 8.481600 14.050000 l f
showpage
