(classPool
(JNukeClass "Dup2_2" "Dup2_2.java"
  (JNukeVar "[J" "a")
  (JNukeVar "J" "f")
  (JNukeMethod "Dup2_2.<init>" (JNukeSignature "V" (JNukeVector))
  (JNukeByteCodes
    (JNukeRByteCode 1 "     InvokeSpecial" (JNukeMethod "java/lang/Object.<init>" (JNukeSignature "V" (JNukeVector))) l0) (begin_of_basic_block 0) (end_of_basic_block (next_bb 2))
    (JNukeRByteCode 2 "     Return" void) (begin_of_basic_block 2) (end_of_basic_block)
))
  (JNukeMethod "Dup2_2.test" (JNukeSignature "J" (JNukeVector "I" "J"))
  (JNukeByteCodes
    (JNukeRByteCode 1 "r0 = GetField" "Dup2_2" (pair "a" "[J") l0) (begin_of_basic_block 0) (end_of_basic_block (next_bb 2))
    (JNukeRByteCode 2 "r1 = Get" l1) (begin_of_basic_block 2)
    (JNukeRByteCode 3 "r2 = Get" l0)
    (JNukeRByteCode 4 "<r3, r4> = Get" l2 l3)
    (JNukeVector (JNukeRByteCode 5 "<r5, r6> = Get" r3 r4) (JNukeRByteCode 5 "r4 = Get" r2) (JNukeRByteCode 5 "<r2, r3> = Get" r5 r6))
    (JNukeRByteCode 6 "     PutField" "Dup2_2" (pair "f" "J") r4 r5 r6) (end_of_basic_block (next_bb 7))
    (JNukeVector (JNukeRByteCode 7 "<r4, r5> = Get" r2 r3) (JNukeRByteCode 7 "r3 = Get" r1) (JNukeRByteCode 7 "r2 = Get" r0) (JNukeRByteCode 7 "<r0, r1> = Get" r4 r5)) (begin_of_basic_block 7)
    (JNukeRByteCode 8 "     AStore" long r2 r3 r4 r5) (end_of_basic_block (next_bb 9))
    (JNukeRByteCode 9 "     Return" long r0 r1) (begin_of_basic_block 9) (end_of_basic_block)
))
)
)
