#FIG 3.2
Landscape
Center
Inches
Letter  
100.00
Single
-2
1200 2
0 32 #8e8e8e
0 33 #c7b696
0 34 #dfcba6
0 35 #414141
0 36 #868286
0 37 #bec3be
0 38 #e0e0e0
0 39 #8e8e8e
0 40 #aeaaae
0 41 #595559
0 42 #414141
0 43 #868286
0 44 #bec3be
0 45 #868286
0 46 #bec3be
0 47 #dfe3df
0 48 #8e8e8e
0 49 #8e8e8e
0 50 #414141
0 51 #868286
0 52 #bec3be
0 53 #dfe3df
0 54 #414141
0 55 #868286
0 56 #bec3be
0 57 #dfe3df
0 58 #868286
0 59 #bec3be
0 60 #dfe3df
0 61 #c7b696
0 62 #effbff
0 63 #dfcba6
0 64 #c7b696
0 65 #effbff
0 66 #dfcba6
0 67 #aeaaae
0 68 #595559
0 69 #8e8e8e
0 70 #414141
0 71 #868286
0 72 #bec3be
0 73 #dfe3df
0 74 #414141
0 75 #868286
0 76 #bec3be
0 77 #dfe3df
0 78 #868286
0 79 #bec3be
0 80 #dfe3df
0 81 #414141
0 82 #868286
0 83 #bec3be
0 84 #414141
0 85 #bec3be
0 86 #dfe3df
0 87 #414141
0 88 #868286
0 89 #bec3be
0 90 #8e8e8e
0 91 #414141
0 92 #868286
0 93 #bec3be
0 94 #dfe3df
0 95 #414141
0 96 #868286
0 97 #bec3be
0 98 #dfe3df
0 99 #bebebe
0 100 #515151
0 101 #e7e3e7
0 102 #000049
0 103 #797979
0 104 #303430
0 105 #414541
0 106 #414141
0 107 #868286
0 108 #bec3be
0 109 #dfe3df
6 375 4500 2325 5100
2 1 0 2 0 7 50 0 -1 0.000 0 0 -1 1 0 2
	1 1 2.00 180.00 240.00
	 450 4650 2250 4650
4 1 0 50 0 16 24 0.0000 4 285 1140 1275 5100 Events\001
-6
6 9300 6225 10650 8775
6 9300 6225 10650 8775
6 9300 7125 10650 8775
5 1 0 1 0 7 50 0 -1 0.000 0 1 0 0 9975.000 7714.074 9300 8445 9975 8709 10650 8445
1 2 0 1 0 7 50 0 -1 0.000 1 0.0000 9975 7389 675 264 9300 7125 10650 7653
2 1 0 1 0 7 50 0 -1 0.000 0 0 -1 0 0 2
	 10650 8445 10650 7389
2 1 0 1 0 7 50 0 -1 0.000 0 0 -1 0 0 2
	 9300 7389 9300 8445
-6
2 1 0 2 0 37 50 0 20 0.000 0 0 -1 1 0 2
	1 1 2.00 180.00 240.00
	 9975 6300 9975 7125
-6
4 1 0 50 0 16 24 0.0000 4 285 1005 9975 8175 Model\001
-6
6 9150 2250 10800 4125
6 9150 2250 10800 4125
5 1 0 1 0 7 50 0 -1 0.000 0 1 0 0 9975.000 2875.255 9150 3810 9975 4122 10800 3810
1 2 0 1 0 7 50 0 -1 0.000 1 0.0000 9975 2562 825 312 9150 2250 10800 2874
2 1 0 1 0 7 50 0 -1 0.000 0 0 -1 0 0 2
	 10800 3810 10800 2562
2 1 0 1 0 7 50 0 -1 0.000 0 0 -1 0 0 2
	 9150 2562 9150 3810
-6
4 1 0 50 0 16 24 0.0000 4 285 1290 9975 3450 Context\001
-6
6 2325 2700 7200 6000
2 1 0 1 0 7 50 0 20 0.000 0 0 -1 0 0 2
	 3000 4800 7200 4800
2 1 0 1 0 7 50 0 -1 0.000 0 0 -1 0 0 2
	 3000 6000 3000 3600
2 2 0 1 0 7 55 0 20 0.000 0 0 -1 0 0 5
	 2325 3600 7200 3600 7200 6000 2325 6000 2325 3600
2 2 0 1 0 38 60 0 20 0.000 0 0 -1 0 0 5
	 2325 2700 7200 2700 7200 3600 2325 3600 2325 2700
4 1 0 50 0 16 24 0.0000 4 285 3060 5100 5550 Observable events\001
4 1 0 50 0 16 24 0.0000 4 285 2460 5100 4350 Internal events\001
4 1 0 50 0 16 24 0.0000 4 360 2385 4725 3300 Event analysis\001
4 1 0 50 0 16 24 1.5708 4 360 1350 2775 4800 Filtering\001
-6
6 11250 5400 13350 6000
6 11700 5700 12750 6000
4 1 0 50 0 16 24 0.0000 4 285 1050 12225 6000 Result\001
-6
2 1 0 2 0 7 50 0 -1 0.000 0 0 -1 1 0 2
	1 1 2.00 180.00 240.00
	 11325 5550 13275 5550
-6
6 1875 -508 9825 1200
6 2098 235 4030 977
4 1 0 50 0 16 22 0.0000 4 238 1828 3045 478 Instrumented\001
4 1 0 50 0 16 22 0.0000 4 237 1189 3045 840 program\001
-6
6 5887 -62 9825 1200
6 6110 235 7299 977
4 1 0 50 0 16 22 0.0000 4 238 817 6722 478 Event\001
4 1 0 50 0 16 22 0.0000 4 312 1129 6722 840 analysis\001
-6
2 1 0 1 0 7 50 0 -1 0.000 0 0 -1 0 0 2
	 7539 -12 7539 1131
2 4 0 1 0 7 50 0 -1 0.000 0 0 8 0 0 5
	 9825 1131 9825 -12 5903 -12 5903 1131 9825 1131
4 1 0 50 0 16 22 0.0000 4 312 1887 8682 643 Interpretation\001
-6
2 4 0 1 0 7 50 0 -1 0.000 0 0 8 0 0 5
	 4271 1131 4271 -12 1902 -12 1902 1131 4271 1131
2 1 0 1 0 7 50 0 -1 0.000 0 0 -1 1 0 2
	1 1 2.00 195.93 261.26
	 4271 560 5903 560
4 1 0 50 0 16 22 0.0000 4 238 1278 7782 -257 Observer\001
4 1 0 50 0 16 22 0.0000 4 238 966 5004 396 Events\001
-6
2 1 0 2 0 37 50 0 20 0.000 0 0 -1 1 0 2
	1 1 2.00 180.00 240.00
	 7200 5400 8700 5550
2 1 0 1 0 37 60 0 20 0.000 0 0 -1 1 0 2
	1 1 1.00 90.00 120.00
	 7200 5400 8400 5850
2 1 0 2 0 37 50 0 20 0.000 0 0 -1 1 0 2
	1 1 2.00 180.00 240.00
	 7200 4200 9150 3300
2 1 2 1 0 7 50 0 -1 3.000 0 0 -1 0 0 2
	 9825 1200 11400 2175
2 1 2 1 0 7 50 0 -1 3.000 0 0 -1 0 0 2
	 7500 1200 7200 2175
2 1 2 1 0 7 50 0 -1 3.000 0 0 -1 0 0 2
	 5925 1200 2475 2175
2 1 0 2 0 37 50 0 20 0.000 0 0 -1 1 0 2
	1 1 2.00 180.00 240.00
	 9975 4125 9975 5100
2 2 0 1 0 37 60 0 20 0.000 0 0 -1 0 0 5
	 8550 5250 11175 5250 11175 6150 8550 6150 8550 5250
2 2 0 1 0 37 65 0 20 0.000 0 0 -1 0 0 5
	 8400 5400 11025 5400 11025 6300 8400 6300 8400 5400
2 2 0 1 0 7 55 0 20 0.000 0 0 -1 0 0 5
	 8700 5100 11325 5100 11325 6000 8700 6000 8700 5100
4 1 0 50 0 16 24 0.0000 4 360 2250 9997 5700 Interpretation\001
