#FIG 3.2
Landscape
Center
Metric
A4      
100.00
Single
-2
1200 2
6 2250 1440 5220 2070
2 2 0 2 0 7 100 0 -1 0.000 0 0 -1 0 0 5
	 2295 1485 5175 1485 5175 2025 2295 2025 2295 1485
4 1 0 50 0 18 20 0.0000 4 270 2520 3735 1845 AnalysisAlgorithm\001
-6
6 5760 1440 7650 2070
2 2 0 2 0 7 100 0 -1 0.000 0 0 -1 0 0 5
	 5805 1485 7605 1485 7605 2025 5805 2025 5805 1485
4 1 0 50 0 19 20 0.0000 4 270 1365 6705 1845 Mergeable\001
-6
6 4140 3240 6660 3870
2 2 0 2 0 7 100 0 -1 0.000 0 0 -1 0 0 5
	 4185 3285 6615 3285 6615 3825 4185 3825 4185 3285
4 1 0 50 0 18 20 0.0000 4 270 1965 5400 3645 StaticAnalysis\001
-6
6 8640 3240 10845 3870
2 2 0 2 0 7 100 0 -1 0.000 0 0 -1 0 0 5
	 8685 3285 10800 3285 10800 3825 8685 3825 8685 3285
4 1 0 50 0 18 20 0.0000 4 210 1665 9765 3645 ControlFlow\001
-6
6 8775 1440 10665 2070
2 2 0 2 0 7 100 0 -1 0.000 0 0 -1 0 0 5
	 8820 1485 10620 1485 10620 2025 8820 2025 8820 1485
4 1 0 50 0 18 20 0.0000 4 210 1395 9720 1845 Recursion\001
-6
6 1980 3240 3555 3825
4 0 0 50 0 16 20 0.0000 4 210 750 1980 3465 Static\001
4 0 0 50 0 16 20 0.0000 4 210 1545 1980 3795 environment\001
-6
2 1 0 2 0 7 100 0 -1 0.000 0 0 -1 1 0 4
	1 0 2.00 180.00 240.00
	 5355 3285 5355 2655 3780 2655 3780 2025
2 1 0 2 0 7 100 0 -1 0.000 0 0 -1 1 0 4
	1 0 2.00 180.00 240.00
	 5355 3285 5355 2655 6705 2655 6705 2025
2 1 0 2 0 7 100 0 -1 0.000 0 0 -1 1 0 2
	3 1 2.00 120.00 240.00
	 9720 3285 9720 2025
2 3 2 2 0 7 50 0 -1 4.500 0 0 -1 0 0 7
	 11070 1125 8190 1125 8190 2925 3825 2925 3825 4185 11070 4185
	 11070 1125
2 1 0 2 0 7 100 0 -1 0.000 0 0 -1 1 0 2
	3 1 2.00 120.00 240.00
	 6615 3555 8685 3555
