(JNukeExitBlock (JNukeSchedule 
  (JNukeThreadSwitch (from_thread 0) (to_thread 0) (JNukeMethod "TestCase3Main.main" (JNukeSignature "V" (JNukeVector "[Ljava/lang/String;"))) (pc 8) (line 9))
  (JNukeThreadSwitch (from_thread 0) (to_thread 0) (JNukeMethod "TestCase3Main.main" (JNukeSignature "V" (JNukeVector "[Ljava/lang/String;"))) (pc 18) (line 13))
  (JNukeThreadSwitch (from_thread 0) (to_thread 0) (JNukeMethod "TestCase3Main.main" (JNukeSignature "V" (JNukeVector "[Ljava/lang/String;"))) (pc 26) (line 14))
  (JNukeThreadSwitch (from_thread 0) (to_thread 1) (JNukeMethod "TestCase3Main.main" (JNukeSignature "V" (JNukeVector "[Ljava/lang/String;"))) (pc 33) (line 16))
)
)

(JNukeExitBlock (JNukeSchedule 
  (JNukeThreadSwitch (from_thread 0) (to_thread 1) (JNukeMethod "TestCase3Main.main" (JNukeSignature "V" (JNukeVector "[Ljava/lang/String;"))) (pc 8) (line 9))
  (JNukeThreadSwitch (from_thread 1) (to_thread 1) (JNukeMethod "LockAB.run" (JNukeSignature "V" (JNukeVector))) (pc 12) (line 15))
  (JNukeThreadSwitch (from_thread 1) (to_thread 1) (JNukeMethod "LockAB.run" (JNukeSignature "V" (JNukeVector))) (pc 20) (line 16))
  (JNukeThreadSwitch (from_thread 1) (to_thread 0) (JNukeMethod "LockAB.run" (JNukeSignature "V" (JNukeVector))) (pc 27) (line 17))
)
)

