(classPool
(JNukeClass "DupX1" "DupX1.java"
  (JNukeVar "[I" "a")
  (JNukeVar "I" "i")
  (JNukeMethod "DupX1.<init>" (JNukeSignature "V" (JNukeVector))
  (JNukeByteCodes
    (JNukeRByteCode 0 "r0 = Get" l0 (line 1))
    (JNukeRByteCode 1 "     InvokeSpecial" (JNukeMethod "java/lang/Object.<init>" (JNukeSignature "V" (JNukeVector))) r0)
    (JNukeRByteCode 2 "r0 = Get" l0 (line 2))
    (JNukeRByteCode 3 "r1 = Const" int 2)
    (JNukeRByteCode 4 "r1 = NewArray" int 0x1 r1)
    (JNukeRByteCode 5 "     PutField" "DupX1" (pair "a" "[I") r0 r1)
    (JNukeRByteCode 6 "     Return" void)
))
  (JNukeMethod "DupX1.doSth" (JNukeSignature "V" (JNukeVector))
  (JNukeByteCodes
    (JNukeRByteCode 0 "r0 = Get" l0 (line 6))
    (JNukeRByteCode 1 "r1 = Const" int 0)
    (JNukeRByteCode 2 "     PutField" "DupX1" (pair "i" "I") r0 r1)
    (JNukeRByteCode 3 "r0 = Get" l0 (line 7))
    (JNukeRByteCode 4 "r0 = GetField" "DupX1" (pair "a" "[I") r0)
    (JNukeRByteCode 5 "r1 = Get" l0)
    (JNukeRByteCode 6 "r2 = Get" r1)
    (JNukeRByteCode 7 "r2 = GetField" "DupX1" (pair "i" "I") r2)
    (JNukeVector (JNukeRByteCode 8 "r3 = Get" r2) (JNukeRByteCode 8 "r2 = Get" r1) (JNukeRByteCode 8 "r1 = Get" r3))
    (JNukeRByteCode 9 "r4 = Const" int 1)
    (JNukeRByteCode 10 "r3 = Prim" iadd r3 r4)
    (JNukeRByteCode 11 "     PutField" "DupX1" (pair "i" "I") r2 r3)
    (JNukeRByteCode 12 "r2 = Const" int 1)
    (JNukeRByteCode 13 "     AStore" int r0 r1 r2)
    (JNukeRByteCode 14 "     Return" void (line 8))
))
  (JNukeMethod "DupX1.main" (JNukeSignature "V" (JNukeVector "[Ljava/lang/String;"))
  (JNukeByteCodes
    (JNukeRByteCode 0 "r0 = New" "DupX1" (line 11))
    (JNukeRByteCode 1 "r1 = Get" r0)
    (JNukeRByteCode 2 "     InvokeSpecial" (JNukeMethod "DupX1.<init>" (JNukeSignature "V" (JNukeVector))) r1)
    (JNukeRByteCode 3 "     InvokeVirtual" (JNukeMethod "DupX1.doSth" (JNukeSignature "V" (JNukeVector))) r0)
    (JNukeRByteCode 4 "     Return" void (line 12))
))
)
)
