%!PS-Adobe-3.0 EPSF-3.0 
%%BoundingBox: 0 0 805 558
%%Pages: 0
%%Creator: Sun Microsystems, Inc.
%%Title: none
%%CreationDate: none
%%LanguageLevel: 2
%%EndComments
%%BeginProlog
%%BeginResource: SDRes
/b4_inc_state save def
/dict_count countdictstack def
/op_count count 1 sub def
userdict begin
0 setgray 0 setlinecap 1 setlinewidth 0 setlinejoin 10 setmiterlimit[] 0 setdash newpath
/languagelevel where {pop languagelevel 1 ne {false setstrokeadjust false setoverprint} if} if
/bdef {bind def} bind def
/c {setrgbcolor} bdef
/l {neg lineto} bdef
/rl {neg rlineto} bdef
/cl {currentlinewidth currentdash currentlinecap 2 setlinecap} bdef
/lc {setlinecap} bdef
/lw {setlinewidth} bdef
/ld {setdash} bdef
/m {neg moveto} bdef
/ct {6 2 roll neg 6 2 roll neg 6 2 roll neg curveto} bdef
/r {rotate} bdef
/t {neg translate} bdef
/s {scale} bdef
/gs {gsave} bdef
/gr {grestore} bdef
/f {findfont dup length dict begin
{1 index /FID ne {def} {pop pop} ifelse} forall /Encoding ISOLatin1Encoding def
currentdict end /NFont exch definefont pop /NFont findfont} bdef
/p {closepath} bdef
/sf {scalefont setfont} bdef
/ef {eofill}bdef
/pc {closepath stroke}bdef
/ps {stroke}bdef
/pum {matrix currentmatrix}bdef
/pom {setmatrix}bdef
/bs {/aString exch def /nXOfs exch def /nWidth exch def currentpoint nXOfs 0 rmoveto pum nWidth aString stringwidth pop div 1 scale aString show pom moveto} bdef
%%EndResource
%%EndProlog
%%BeginSetup
%%EndSetup
%%Page: 1 1
%%BeginPageSetup
%%EndPageSetup
pum
0.28345 0.28339 s 
0 -1969 t 
gs
-63.5 -63.5 t 
63.5 63.5 m 2903.4 63.5 l 2903.4 2032.4 l 63.5 2032.4 l 63.5 63.5 l
eoclip newpath
gs
63.5 63.5 m 2903.4 63.5 l 2903.4 2032.4 l 63.5 2032.4 l 63.5 63.5 l
eoclip newpath
gs
63.5 63.5 t 
0 0 m 2839.9 0 l 2839.9 1968.9 l 0 1968.9 l 0 0 l eoclip newpath
1.000 1.000 1.000 c 0 0 m  2840.1 0 l  2840.1 1969.1 l  0 1969.1 l 
0 0 l  p ef
0.003 0.003 0.003 c 229.5 1747.3 m  2378.5 1747.3 l  ps
229.5 1641.5 m  2378.5 1641.5 l  ps
229.5 1535.6 m  2378.5 1535.6 l  ps
229.5 1429.7 m  2378.5 1429.7 l  ps
229.5 1323.8 m  2378.5 1323.8 l  ps
229.5 1218 m  2378.5 1218 l  ps
229.5 1112.1 m  2378.5 1112.1 l  ps
229.5 1006.2 m  2378.5 1006.2 l  ps
229.5 900.3 m  2378.5 900.3 l  ps
229.5 794.4 m  2378.5 794.4 l  ps
229.5 688.6 m  2378.5 688.6 l  ps
229.5 582.7 m  2378.5 582.7 l  ps
229.5 476.8 m  2378.5 476.8 l  ps
229.5 370.9 m  2378.5 370.9 l  ps
229.5 265 m  2378.5 265 l  ps
229.5 1747.3 m  2378.5 1747.3 l  ps
229.5 1747.3 m  2378.5 1747.3 l  ps
229.5 1762.3 m  229.5 1747.3 l  ps
gs
pum
277.8 1772.1 t 
5.4 68.1 m  5.4 18.4 l  26.2 18.4 l  36.39999 18.4 41.4 22.5 41.4 30.7 ct 
41.4 34.7 40.2 38 37.7 40.6 ct 36.2 42.1 34.2 43.5 31.4 44.7 ct 
48 68.1 l  39.4 68.1 l  25.2 47.1 l  12.5 47.1 l 
12.5 68.1 l  p
12.5 41.7 m  20.3 41.7 l  25.1 41.7 28.7 40.9 30.9 39.2 ct 
33.1 37.6 34.2 35 34.2 31.6 ct 34.2 28.7 33.3 26.6 31.4 25.5 ct 
29.6 24.3 26.7 23.7 22.5 23.7 ct 12.5 23.7 l 
p ef
pom
pum
326.9 1772.1 t 
27.3 45.8 m  27.3 43.6 27 42 26.6 40.9 ct 25.5 37.5 22.9 35.7 19 35.7 ct 
16.3 35.7 14.2 36.5 12.7 38.1 ct 11.1 39.7 10.3 42.3 9.8 45.8 ct 
p
33.89999 61.6 m  33.89999 66.9 l  29.4 68.2 25.2 68.9 21.4 68.9 ct 
15.6 68.9 11.2 67.1 7.8 63.6 ct 4.5 60 2.8 55.3 2.8 49.4 ct 
2.8 43.6 4.2 39.2 7.2 35.8 ct 10.1 32.5 14.2 30.9 19.2 30.9 ct 
25.1 30.9 29.1 32.8 31.6 36.89999 ct 33.3 40.1 34.2 43.9 34 48.9 ct 
34 50.9 l  9.7 50.9 l  10 53.5 10.4 55.6 11.1 57 ct 
13 61.5 16.9 63.8 22.8 63.8 ct 26.2 63.8 l 
29.8 63.2 l  p ef
pom
pum
365 1772.1 t 
25.8 63.4 m  21.7 67 17.69999 68.9 13.8 68.9 ct 
10.7 68.9 8.09999 68 6 66 ct 4.1 64.29999 3.1 61.8 3.1 58.9 ct 
3.1 50.7 9.8 46.5 23.3 46.5 ct 24.8 46.5 l 
24.8 42.1 l  24.8 37.89999 22.5 35.8 17.8 35.8 ct 
14.2 35.8 10.4 36.8 6.3 39 ct 6.3 33.5 l 
10.8 31.7 15.1 30.9 19.2 30.9 ct 23.4 30.9 26.6 31.7 28.5 33.5 ct 
30.5 35.3 31.4 38.1 31.4 42.1 ct 31.4 58.6 l 
31.4 62.3 32.7 64.29999 35 64.29999 ct 35.3 64.29999 35.7 64.29999 36.2 64.1 ct 
36.8 67.79999 l  35.1 68.5 33.5 68.9 31.8 68.9 ct 
30.3 68.9 29.1 68.5 28.1 67.6 ct 27.2 66.7 l 
26.3 65.4 l  p
24.8 59.9 m  24.8 50.4 l  22.8 50.4 l  21.4 50.2 19.9 50.4 18.19999 50.7 ct 
12.7 51.3 10 53.8 10 57.9 ct 10 61.6 11.9 63.4 16 63.4 ct 
18.8 63.4 l  21.8 62.2 l  p ef
pom
pum
403.1 1772.1 t 
26.3 55.2 m  26.3 36.6 l  23.2 36.1 20.8 35.8 19.5 35.8 ct 
13.1 35.8 10 40.6 10 50.2 ct 10 54.2 10.5 57.2 11.8 59.6 ct 
13 61.9 14.7 63 16.9 63 ct 19.6 63 l  22.8 60.4 l 
p
26.3 61.2 m  25.1 63.6 23.7 65.2 22.3 66.5 ct 
20.4 68.1 18.1 68.9 15.3 68.9 ct 11.6 68.9 8.59999 67.29999 6.3 63.8 ct 
3.9 60.7 2.8 56.3 2.8 50.8 ct 2.8 44.5 4.2 39.5 7.2 36.1 ct 
10.3 32.5 14.5 30.9 19.9 30.9 ct 22.1 30.9 24.1 31 26.3 31.6 ct 
26.3 15.1 l  32.89999 15.1 l  32.89999 68.1 l  26.3 68.1 l 
p ef
pom
pum
441.2 1772.1 t 
5.4 68.1 m  5.4 18.4 l  15.2 18.4 l  28.8 56.8 l 
42.8 18.4 l  51.6 18.4 l  51.6 68.1 l  45 68.1 l 
45 27.7 l  31.4 64.7 l  24.7 64.7 l  11.5 27.6 l 
11.5 68.1 l  p ef
pom
pum
498.8 1772.1 t 
25.8 63.4 m  21.7 67 17.69999 68.9 13.8 68.9 ct 
10.7 68.9 8.09999 68 6 66 ct 4.1 64.29999 3.1 61.8 3.1 58.9 ct 
3.1 50.7 9.8 46.5 23.3 46.5 ct 24.8 46.5 l 
24.8 42.1 l  24.8 37.89999 22.5 35.8 17.8 35.8 ct 
14.2 35.8 10.4 36.8 6.3 39 ct 6.3 33.5 l 
10.8 31.7 15.1 30.9 19.2 30.9 ct 23.4 30.9 26.6 31.7 28.5 33.5 ct 
30.5 35.3 31.4 38.1 31.4 42.1 ct 31.4 58.6 l 
31.4 62.3 32.7 64.29999 35 64.29999 ct 35.3 64.29999 35.7 64.29999 36.2 64.1 ct 
36.8 67.79999 l  35.1 68.5 33.5 68.9 31.8 68.9 ct 
30.3 68.9 29.1 68.5 28.1 67.6 ct 27.2 66.7 l 
26.3 65.4 l  p
24.8 59.9 m  24.8 50.4 l  22.8 50.4 l  21.4 50.2 19.9 50.4 18.19999 50.7 ct 
12.7 51.3 10 53.8 10 57.9 ct 10 61.6 11.9 63.4 16 63.4 ct 
18.8 63.4 l  21.8 62.2 l  p ef
pom
pum
536.89999 1772.1 t 
5 68.1 m  5 31.6 l  11.6 31.6 l  11.6 38.4 l 
13.3 36.2 14.9 34.39999 16.4 33.3 ct 18.8 31.7 21.4 30.9 24.1 30.9 ct 
30.2 30.9 33.3 34.39999 33.3 41.9 ct 33.3 68.1 l 
26.7 68.1 l  26.7 44.1 l  26.7 41 26.3 39.1 25.8 38 ct 
25.1 37 24 36.5 22.3 36.5 ct 18.6 36.5 15.1 39.1 11.6 44.5 ct 
11.6 68.1 l  p ef
pom
pum
575 1772.1 t 
13.4 68.1 m  0.5 31.6 l  7.2 31.6 l  17.1 59.6 l 
28 31.6 l  33.89999 31.6 l  14.5 81.3 l  7.6 81.3 l 
p ef
pom
pum
277.8 1850.8 t 
6.3 68.1 m  6.3 18.4 l  40.1 18.4 l  40.1 23.7 l 
13.3 23.7 l  13.3 40.3 l  36.6 40.3 l  36.6 45.4 l 
13.3 45.4 l  13.3 68.1 l  p ef
pom
pum
319.3 1850.8 t 
4.2 68.1 m  4.2 31.6 l  10.8 31.6 l  10.8 68.1 l 
p
4.2 25 m  4.2 18.4 l  10.8 18.4 l  10.8 25 l 
p ef
pom
pum
334.5 1850.8 t 
27.3 45.8 m  27.3 43.6 27 42 26.6 40.9 ct 25.5 37.5 22.9 35.7 19 35.7 ct 
16.3 35.7 14.2 36.5 12.7 38.1 ct 11.1 39.7 10.3 42.3 9.8 45.8 ct 
p
33.89999 61.6 m  33.89999 66.9 l  29.4 68.2 25.2 68.9 21.4 68.9 ct 
15.6 68.9 11.2 67.1 7.8 63.6 ct 4.5 60 2.8 55.3 2.8 49.4 ct 
2.8 43.6 4.2 39.2 7.2 35.8 ct 10.1 32.5 14.2 30.9 19.2 30.9 ct 
25.1 30.9 29.1 32.8 31.6 36.89999 ct 33.3 40.1 34.2 43.9 34 48.9 ct 
34 50.9 l  9.7 50.9 l  10 53.5 10.4 55.6 11.1 57 ct 
13 61.5 16.9 63.8 22.8 63.8 ct 26.2 63.8 l 
29.8 63.2 l  p ef
pom
pum
372.6 1850.8 t 
4.2 68.1 m  4.2 15.1 l  10.8 15.1 l  10.8 68.1 l 
p ef
pom
pum
387.9 1850.8 t 
26.3 55.2 m  26.3 36.6 l  23.2 36.1 20.8 35.8 19.5 35.8 ct 
13.1 35.8 10 40.6 10 50.2 ct 10 54.2 10.5 57.2 11.8 59.6 ct 
13 61.9 14.7 63 16.9 63 ct 19.6 63 l  22.8 60.4 l 
p
26.3 61.2 m  25.1 63.6 23.7 65.2 22.3 66.5 ct 
20.4 68.1 18.1 68.9 15.3 68.9 ct 11.6 68.9 8.59999 67.29999 6.3 63.8 ct 
3.9 60.7 2.8 56.3 2.8 50.8 ct 2.8 44.5 4.2 39.5 7.2 36.1 ct 
10.3 32.5 14.5 30.9 19.9 30.9 ct 22.1 30.9 24.1 31 26.3 31.6 ct 
26.3 15.1 l  32.89999 15.1 l  32.89999 68.1 l  26.3 68.1 l 
p ef
pom
pum
426 1850.8 t 
3.8 66.7 m  3.8 60.7 l  8.2 62.9 12.3 63.8 16 63.8 ct 
21.1 63.8 23.7 62.1 23.7 58.5 ct 23.7 56.1 21.9 54.2 18.4 53.1 ct 
12.5 51.2 l  6.8 49.3 3.9 45.8 3.9 40.9 ct 
3.9 34.2 8.59999 30.9 17.8 30.9 ct 20.6 30.9 23.7 31.1 27.6 31.8 ct 
27.6 37.5 l  24.1 36.39999 20.8 35.8 17.4 35.8 ct 
12.9 35.8 10.5 37.3 10.5 40.3 ct 10.5 42.5 12 44.1 15.2 45.2 ct 
20.6 46.8 l  27 49 30.3 52.7 30.3 57.9 ct 30.3 61.2 29.1 64 26.5 65.9 ct 
23.9 67.79999 20.3 68.9 15.8 68.9 ct 12.3 68.9 l 
8.2 68.1 l  p ef
pom
gr
659.3 1762.3 m  659.3 1747.3 l  ps
gs
pum
751.4 1772.1 t 
5.9 68.1 m  5.9 18.4 l  13 18.4 l  13 68.1 l 
p ef
pom
pum
770 1772.1 t 
17.69999 68.2 m  16.3 68.7 15.1 68.9 13.8 68.9 ct 
7.9 68.9 5 65.2 5 57.9 ct 5 36.6 l  0.9 36.6 l 
0.9 31.6 l  5 31.6 l  5 25 l  11.6 24.4 l  11.6 31.6 l 
18.6 31.6 l  18.6 36.6 l  11.6 36.6 l  11.6 56.7 l 
11.6 59.6 11.9 61.5 12.3 62.5 ct 12.9 63.4 13.8 63.8 15.5 63.8 ct 
16.3 63.8 17 63.8 17.69999 63.6 ct p ef
pom
pum
788.7 1772.1 t 
27.3 45.8 m  27.3 43.6 27 42 26.6 40.9 ct 25.5 37.5 22.9 35.7 19 35.7 ct 
16.3 35.7 14.2 36.5 12.7 38.1 ct 11.1 39.7 10.3 42.3 9.8 45.8 ct 
p
33.89999 61.6 m  33.89999 66.9 l  29.4 68.2 25.2 68.9 21.4 68.9 ct 
15.6 68.9 11.2 67.1 7.8 63.6 ct 4.5 60 2.8 55.3 2.8 49.4 ct 
2.8 43.6 4.2 39.2 7.2 35.8 ct 10.1 32.5 14.2 30.9 19.2 30.9 ct 
25.1 30.9 29.1 32.8 31.6 36.89999 ct 33.3 40.1 34.2 43.9 34 48.9 ct 
34 50.9 l  9.7 50.9 l  10 53.5 10.4 55.6 11.1 57 ct 
13 61.5 16.9 63.8 22.8 63.8 ct 26.2 63.8 l 
29.8 63.2 l  p ef
pom
pum
826.8 1772.1 t 
5 68.1 m  5 31.6 l  11.6 31.6 l  11.6 38.4 l 
12.6 36.1 13.7 34.39999 14.8 33.3 ct 16.3 31.7 18.19999 30.9 20.4 30.9 ct 
20.8 30.9 21.5 30.9 22.3 31 ct 22.3 37.2 l 
21.1 36.8 20.1 36.6 19.5 36.6 ct 17 36.6 14.4 39.1 11.6 44.1 ct 
11.6 68.1 l  p ef
pom
pum
849.6 1772.1 t 
25.8 63.4 m  21.7 67 17.69999 68.9 13.8 68.9 ct 
10.7 68.9 8.09999 68 6 66 ct 4.1 64.29999 3.1 61.8 3.1 58.9 ct 
3.1 50.7 9.8 46.5 23.3 46.5 ct 24.8 46.5 l 
24.8 42.1 l  24.8 37.89999 22.5 35.8 17.8 35.8 ct 
14.2 35.8 10.4 36.8 6.3 39 ct 6.3 33.5 l 
10.8 31.7 15.1 30.9 19.2 30.9 ct 23.4 30.9 26.6 31.7 28.5 33.5 ct 
30.5 35.3 31.4 38.1 31.4 42.1 ct 31.4 58.6 l 
31.4 62.3 32.7 64.29999 35 64.29999 ct 35.3 64.29999 35.7 64.29999 36.2 64.1 ct 
36.8 67.79999 l  35.1 68.5 33.5 68.9 31.8 68.9 ct 
30.3 68.9 29.1 68.5 28.1 67.6 ct 27.2 66.7 l 
26.3 65.4 l  p
24.8 59.9 m  24.8 50.4 l  22.8 50.4 l  21.4 50.2 19.9 50.4 18.19999 50.7 ct 
12.7 51.3 10 53.8 10 57.9 ct 10 61.6 11.9 63.4 16 63.4 ct 
18.8 63.4 l  21.8 62.2 l  p ef
pom
pum
887.7 1772.1 t 
17.69999 68.2 m  16.3 68.7 15.1 68.9 13.8 68.9 ct 
7.9 68.9 5 65.2 5 57.9 ct 5 36.6 l  0.9 36.6 l 
0.9 31.6 l  5 31.6 l  5 25 l  11.6 24.4 l  11.6 31.6 l 
18.6 31.6 l  18.6 36.6 l  11.6 36.6 l  11.6 56.7 l 
11.6 59.6 11.9 61.5 12.3 62.5 ct 12.9 63.4 13.8 63.8 15.5 63.8 ct 
16.3 63.8 17 63.8 17.69999 63.6 ct p ef
pom
pum
907.2 1772.1 t 
4.2 68.1 m  4.2 31.6 l  10.8 31.6 l  10.8 68.1 l 
p
4.2 25 m  4.2 18.4 l  10.8 18.4 l  10.8 25 l 
p ef
pom
pum
922.4 1772.1 t 
18.9 30.9 m  24 30.9 27.8 32.5 30.9 35.89999 ct 
33.8 39.2 35.1 43.9 35.1 49.8 ct 35.1 55.7 33.8 60.4 30.9 63.8 ct 
27.8 67.1 23.9 68.9 18.8 68.9 ct 14.4 68.9 10.8 67.4 8.09999 64.7 ct 
4.5 61.2 2.8 56.1 2.8 49.8 ct 2.8 43.9 4.2 39.2 7.1 35.89999 ct 
10 32.5 l  14 30.9 l  p
18.9 35.8 m  12.9 35.8 10 40.5 10 49.8 ct 10 59.2 12.9 63.8 18.9 63.8 ct 
25 63.8 28 59.2 28 49.7 ct 28 40.3 l  25 35.8 l 
p ef
pom
pum
960.5 1772.1 t 
5 68.1 m  5 31.6 l  11.6 31.6 l  11.6 38.4 l 
13.3 36.2 14.9 34.39999 16.4 33.3 ct 18.8 31.7 21.4 30.9 24.1 30.9 ct 
30.2 30.9 33.3 34.39999 33.3 41.9 ct 33.3 68.1 l 
26.7 68.1 l  26.7 44.1 l  26.7 41 26.3 39.1 25.8 38 ct 
25.1 37 24 36.5 22.3 36.5 ct 18.6 36.5 15.1 39.1 11.6 44.5 ct 
11.6 68.1 l  p ef
pom
gr
1089.1 1762.3 m  1089.1 1747.3 l  ps
gs
pum
1222.4 1772.1 t 
0.5 68.1 m  19.3 18.4 l  26.3 18.4 l  44.9 68.1 l 
37.3 68.1 l  32.1 54.2 l  12.2 54.2 l  7.1 68.1 l 
p
14.2 49 m  30.2 49 l  22.2 27.8 l  p ef
pom
pum
1267.3 1772.1 t 
5 68.1 m  5 31.6 l  11.6 31.6 l  11.6 38.4 l 
12.6 36.1 13.7 34.39999 14.8 33.3 ct 16.3 31.7 18.19999 30.9 20.4 30.9 ct 
20.8 30.9 21.5 30.9 22.3 31 ct 22.3 37.2 l 
21.1 36.8 20.1 36.6 19.5 36.6 ct 17 36.6 14.4 39.1 11.6 44.1 ct 
11.6 68.1 l  p ef
pom
pum
1290.1 1772.1 t 
5 68.1 m  5 31.6 l  11.6 31.6 l  11.6 38.4 l 
12.6 36.1 13.7 34.39999 14.8 33.3 ct 16.3 31.7 18.19999 30.9 20.4 30.9 ct 
20.8 30.9 21.5 30.9 22.3 31 ct 22.3 37.2 l 
21.1 36.8 20.1 36.6 19.5 36.6 ct 17 36.6 14.4 39.1 11.6 44.1 ct 
11.6 68.1 l  p ef
pom
pum
1313 1772.1 t 
25.8 63.4 m  21.7 67 17.69999 68.9 13.8 68.9 ct 
10.7 68.9 8.09999 68 6 66 ct 4.1 64.29999 3.1 61.8 3.1 58.9 ct 
3.1 50.7 9.8 46.5 23.3 46.5 ct 24.8 46.5 l 
24.8 42.1 l  24.8 37.89999 22.5 35.8 17.8 35.8 ct 
14.2 35.8 10.4 36.8 6.3 39 ct 6.3 33.5 l 
10.8 31.7 15.1 30.9 19.2 30.9 ct 23.4 30.9 26.6 31.7 28.5 33.5 ct 
30.5 35.3 31.4 38.1 31.4 42.1 ct 31.4 58.6 l 
31.4 62.3 32.7 64.29999 35 64.29999 ct 35.3 64.29999 35.7 64.29999 36.2 64.1 ct 
36.8 67.79999 l  35.1 68.5 33.5 68.9 31.8 68.9 ct 
30.3 68.9 29.1 68.5 28.1 67.6 ct 27.2 66.7 l 
26.3 65.4 l  p
24.8 59.9 m  24.8 50.4 l  22.8 50.4 l  21.4 50.2 19.9 50.4 18.19999 50.7 ct 
12.7 51.3 10 53.8 10 57.9 ct 10 61.6 11.9 63.4 16 63.4 ct 
18.8 63.4 l  21.8 62.2 l  p ef
pom
pum
1351.1 1772.1 t 
13.4 68.1 m  0.5 31.6 l  7.2 31.6 l  17.1 59.6 l 
28 31.6 l  33.89999 31.6 l  14.5 81.3 l  7.6 81.3 l 
p ef
pom
gr
1518.9 1762.3 m  1518.9 1747.3 l  ps
gs
pum
1569 1772.1 t 
5.4 68.1 m  5.4 18.4 l  15.2 18.4 l  28.8 56.8 l 
42.8 18.4 l  51.6 18.4 l  51.6 68.1 l  45 68.1 l 
45 27.7 l  31.4 64.7 l  24.7 64.7 l  11.5 27.6 l 
11.5 68.1 l  p ef
pom
pum
1625.7 1772.1 t 
26.3 68.1 m  26.3 61.2 l  24.7 63.4 23 65.2 21.5 66.29999 ct 
19.2 68.1 16.69999 68.9 14 68.9 ct 7.8 68.9 4.6 65.2 4.6 57.8 ct 
4.6 31.6 l  11.2 31.6 l  11.2 55.6 l  11.2 58.6 11.5 60.5 12.2 61.6 ct 
12.7 62.6 14 63.2 15.6 63.2 ct 19.3 63.2 22.8 60.5 26.3 55.2 ct 
26.3 31.6 l  32.89999 31.6 l  32.89999 68.1 l  p ef
pom
pum
1663.8 1772.1 t 
4.2 68.1 m  4.2 15.1 l  10.8 15.1 l  10.8 68.1 l 
p ef
pom
pum
1679.1 1772.1 t 
17.69999 68.2 m  16.3 68.7 15.1 68.9 13.8 68.9 ct 
7.9 68.9 5 65.2 5 57.9 ct 5 36.6 l  0.9 36.6 l 
0.9 31.6 l  5 31.6 l  5 25 l  11.6 24.4 l  11.6 31.6 l 
18.6 31.6 l  18.6 36.6 l  11.6 36.6 l  11.6 56.7 l 
11.6 59.6 11.9 61.5 12.3 62.5 ct 12.9 63.4 13.8 63.8 15.5 63.8 ct 
16.3 63.8 17 63.8 17.69999 63.6 ct p ef
pom
pum
1697.7 1772.1 t 
4.2 68.1 m  4.2 31.6 l  10.8 31.6 l  10.8 68.1 l 
p
4.2 25 m  4.2 18.4 l  10.8 18.4 l  10.8 25 l 
p ef
pom
pum
1712.9 1772.1 t 
2.8 50.7 m  2.8 45.7 l  19.9 45.7 l  19.9 50.7 l 
p ef
pom
pum
1735.8 1772.1 t 
0.5 68.1 m  19.3 18.4 l  26.3 18.4 l  44.9 68.1 l 
37.3 68.1 l  32.1 54.2 l  12.2 54.2 l  7.1 68.1 l 
p
14.2 49 m  30.2 49 l  22.2 27.8 l  p ef
pom
pum
1781.5 1772.1 t 
5 68.1 m  5 31.6 l  11.6 31.6 l  11.6 38.4 l 
12.6 36.1 13.7 34.39999 14.8 33.3 ct 16.3 31.7 18.19999 30.9 20.4 30.9 ct 
20.8 30.9 21.5 30.9 22.3 31 ct 22.3 37.2 l 
21.1 36.8 20.1 36.6 19.5 36.6 ct 17 36.6 14.4 39.1 11.6 44.1 ct 
11.6 68.1 l  p ef
pom
pum
1804.4 1772.1 t 
5 68.1 m  5 31.6 l  11.6 31.6 l  11.6 38.4 l 
12.6 36.1 13.7 34.39999 14.8 33.3 ct 16.3 31.7 18.19999 30.9 20.4 30.9 ct 
20.8 30.9 21.5 30.9 22.3 31 ct 22.3 37.2 l 
21.1 36.8 20.1 36.6 19.5 36.6 ct 17 36.6 14.4 39.1 11.6 44.1 ct 
11.6 68.1 l  p ef
pom
pum
1827.2 1772.1 t 
25.8 63.4 m  21.7 67 17.69999 68.9 13.8 68.9 ct 
10.7 68.9 8.09999 68 6 66 ct 4.1 64.29999 3.1 61.8 3.1 58.9 ct 
3.1 50.7 9.8 46.5 23.3 46.5 ct 24.8 46.5 l 
24.8 42.1 l  24.8 37.89999 22.5 35.8 17.8 35.8 ct 
14.2 35.8 10.4 36.8 6.3 39 ct 6.3 33.5 l 
10.8 31.7 15.1 30.9 19.2 30.9 ct 23.4 30.9 26.6 31.7 28.5 33.5 ct 
30.5 35.3 31.4 38.1 31.4 42.1 ct 31.4 58.6 l 
31.4 62.3 32.7 64.29999 35 64.29999 ct 35.3 64.29999 35.7 64.29999 36.2 64.1 ct 
36.8 67.79999 l  35.1 68.5 33.5 68.9 31.8 68.9 ct 
30.3 68.9 29.1 68.5 28.1 67.6 ct 27.2 66.7 l 
26.3 65.4 l  p
24.8 59.9 m  24.8 50.4 l  22.8 50.4 l  21.4 50.2 19.9 50.4 18.19999 50.7 ct 
12.7 51.3 10 53.8 10 57.9 ct 10 61.6 11.9 63.4 16 63.4 ct 
18.8 63.4 l  21.8 62.2 l  p ef
pom
pum
1865.3 1772.1 t 
13.4 68.1 m  0.5 31.6 l  7.2 31.6 l  17.1 59.6 l 
28 31.6 l  33.89999 31.6 l  14.5 81.3 l  7.6 81.3 l 
p ef
pom
gr
1948.7 1762.3 m  1948.7 1747.3 l  ps
gs
pum
1995 1772.1 t 
5.4 68.1 m  5.4 18.4 l  21.4 18.4 l  27.8 18.4 32.5 19.2 35.1 20.8 ct 
37.89999 22.6 39.2 25.5 39.2 29.5 ct 39.2 33.2 37.89999 36.2 35.3 38.6 ct 
33.6 39.9 31.3 41.2 28.3 42.1 ct 32.1 43.4 35 44.7 37 46.4 ct 
39.8 48.9 41.2 51.9 41.2 55.6 ct 41.2 59.2 40.1 62.1 37.7 64.4 ct 
36.1 66 34 67.1 31.4 67.6 ct 29.4 67.79999 26.6 68.1 23 68.1 ct 
p
12.5 62.7 m  17.69999 62.7 l  24.3 62.7 28.5 62.3 30.6 61.2 ct 
32.7 60.3 33.8 58.3 33.8 55.2 ct 33.8 51.7 32.39999 49.1 29.8 47.4 ct 
27 45.6 23.2 44.6 18.19999 44.6 ct 12.5 44.6 l 
p
12.5 40.2 m  18.5 40.2 l  27.4 40.2 32 37 32 30.7 ct 
32 27.6 30.7 25.5 28.1 24.7 ct 26.2 24 23 23.7 18.9 23.7 ct 
12.5 23.7 l  p ef
pom
pum
2039.9 1772.1 t 
26.3 68.1 m  26.3 61.2 l  24.7 63.4 23 65.2 21.5 66.29999 ct 
19.2 68.1 16.69999 68.9 14 68.9 ct 7.8 68.9 4.6 65.2 4.6 57.8 ct 
4.6 31.6 l  11.2 31.6 l  11.2 55.6 l  11.2 58.6 11.5 60.5 12.2 61.6 ct 
12.7 62.6 14 63.2 15.6 63.2 ct 19.3 63.2 22.8 60.5 26.3 55.2 ct 
26.3 31.6 l  32.89999 31.6 l  32.89999 68.1 l  p ef
pom
pum
2078 1772.1 t 
11.6 44.5 m  11.6 63 l  14.7 63.6 17 63.8 18.5 63.8 ct 
24.8 63.8 28 59.2 28 49.6 ct 28 45.4 27.4 42.3 26.2 40.1 ct 
25 37.7 23.3 36.6 21.1 36.6 ct 18.4 36.6 l 
15.2 39.2 l  p
11.6 38.4 m  12.9 36.2 14.2 34.39999 15.6 33.3 ct 
17.5 31.7 19.9 30.9 22.6 30.9 ct 26.3 30.9 29.4 32.39999 31.7 35.7 ct 
34 39 35.1 43.4 35.1 48.9 ct 35.1 55.2 33.6 60.1 30.7 63.7 ct 
27.7 67.1 23.4 68.9 17.9 68.9 ct 16 68.9 13.8 68.7 11.6 68.1 ct 
5 68.4 l  5 15.1 l  11.6 15.1 l  p ef
pom
pum
2116.9 1772.1 t 
11.6 44.5 m  11.6 63 l  14.7 63.6 17 63.8 18.5 63.8 ct 
24.8 63.8 28 59.2 28 49.6 ct 28 45.4 27.4 42.3 26.2 40.1 ct 
25 37.7 23.3 36.6 21.1 36.6 ct 18.4 36.6 l 
15.2 39.2 l  p
11.6 38.4 m  12.9 36.2 14.2 34.39999 15.6 33.3 ct 
17.5 31.7 19.9 30.9 22.6 30.9 ct 26.3 30.9 29.4 32.39999 31.7 35.7 ct 
34 39 35.1 43.4 35.1 48.9 ct 35.1 55.2 33.6 60.1 30.7 63.7 ct 
27.7 67.1 23.4 68.9 17.9 68.9 ct 16 68.9 13.8 68.7 11.6 68.1 ct 
5 68.4 l  5 15.1 l  11.6 15.1 l  p ef
pom
pum
2155 1772.1 t 
4.2 68.1 m  4.2 15.1 l  10.8 15.1 l  10.8 68.1 l 
p ef
pom
pum
2170.3 1772.1 t 
27.3 45.8 m  27.3 43.6 27 42 26.6 40.9 ct 25.5 37.5 22.9 35.7 19 35.7 ct 
16.3 35.7 14.2 36.5 12.7 38.1 ct 11.1 39.7 10.3 42.3 9.8 45.8 ct 
p
33.89999 61.6 m  33.89999 66.9 l  29.4 68.2 25.2 68.9 21.4 68.9 ct 
15.6 68.9 11.2 67.1 7.8 63.6 ct 4.5 60 2.8 55.3 2.8 49.4 ct 
2.8 43.6 4.2 39.2 7.2 35.8 ct 10.1 32.5 14.2 30.9 19.2 30.9 ct 
25.1 30.9 29.1 32.8 31.6 36.89999 ct 33.3 40.1 34.2 43.9 34 48.9 ct 
34 50.9 l  9.7 50.9 l  10 53.5 10.4 55.6 11.1 57 ct 
13 61.5 16.9 63.8 22.8 63.8 ct 26.2 63.8 l 
29.8 63.2 l  p ef
pom
pum
2208.4 1772.1 t 
3.9 66.29999 m  3.9 59.3 l  10.5 62.5 17.1 64 23.4 64 ct 
30.7 64 34.3 61.4 34.3 56 ct 34.3 53.3 33.3 51.2 31.4 49.8 ct 
29.8 48.9 27.3 47.8 23.9 46.7 ct 17.1 44.5 l 
8.5 41.6 4.2 36.89999 4.2 30.5 ct 4.2 21.5 10.3 17.1 22.3 17.1 ct 
27.6 17.1 32.89999 17.8 38.6 19.3 ct 38.6 25.8 l 
32.7 23.6 27.2 22.3 21.9 22.3 ct 14.7 22.3 10.9 25 10.9 29.9 ct 
10.9 31.8 11.6 33.3 13 34.6 ct 14.4 35.8 17 37 20.4 38.1 ct 
27.4 40.3 l  32.7 42.1 36.2 44.1 38.4 46.3 ct 
40.5 48.5 41.6 51.3 41.6 54.9 ct 41.6 59.3 39.9 62.9 36.6 65.4 ct 
33.5 68 28.9 69.29999 23.2 69.29999 ct 17.5 69.29999 l 
11.2 68.2 l  p ef
pom
pum
2254.09999 1772.1 t 
18.9 30.9 m  24 30.9 27.8 32.5 30.9 35.89999 ct 
33.8 39.2 35.1 43.9 35.1 49.8 ct 35.1 55.7 33.8 60.4 30.9 63.8 ct 
27.8 67.1 23.9 68.9 18.8 68.9 ct 14.4 68.9 10.8 67.4 8.09999 64.7 ct 
4.5 61.2 2.8 56.1 2.8 49.8 ct 2.8 43.9 4.2 39.2 7.1 35.89999 ct 
10 32.5 l  14 30.9 l  p
18.9 35.8 m  12.9 35.8 10 40.5 10 49.8 ct 10 59.2 12.9 63.8 18.9 63.8 ct 
25 63.8 28 59.2 28 49.7 ct 28 40.3 l  25 35.8 l 
p ef
pom
pum
2292.2 1772.1 t 
5 68.1 m  5 31.6 l  11.6 31.6 l  11.6 38.4 l 
12.6 36.1 13.7 34.39999 14.8 33.3 ct 16.3 31.7 18.19999 30.9 20.4 30.9 ct 
20.8 30.9 21.5 30.9 22.3 31 ct 22.3 37.2 l 
21.1 36.8 20.1 36.6 19.5 36.6 ct 17 36.6 14.4 39.1 11.6 44.1 ct 
11.6 68.1 l  p ef
pom
pum
2315 1772.1 t 
17.69999 68.2 m  16.3 68.7 15.1 68.9 13.8 68.9 ct 
7.9 68.9 5 65.2 5 57.9 ct 5 36.6 l  0.9 36.6 l 
0.9 31.6 l  5 31.6 l  5 25 l  11.6 24.4 l  11.6 31.6 l 
18.6 31.6 l  18.6 36.6 l  11.6 36.6 l  11.6 56.7 l 
11.6 59.6 11.9 61.5 12.3 62.5 ct 12.9 63.4 13.8 63.8 15.5 63.8 ct 
16.3 63.8 17 63.8 17.69999 63.6 ct p ef
pom
pum
2333.7 1772.1 t 
pom
pum
1995 1850.8 t 
20 73.5 m  20 78 l  15.5 74.79999 12 70.79999 9.4 66.2 ct 
6 60.1 4.2 53.5 4.2 46.5 ct 4.2 39.1 6.1 32.39999 9.8 26.1 ct 
12.5 21.8 15.8 18.1 20 15.1 ct 20 19.6 l  17 23 14.8 26.5 13.4 29.9 ct 
11.8 34.3 10.9 39.8 10.9 46.5 ct 10.9 53.5 11.8 59.2 13.7 63.7 ct 
15.1 67 l  17.1 70.2 l  p ef
pom
pum
2017 1850.8 t 
7.6 68.1 m  7.6 63 l  17.5 63 l  17.5 23.9 l 
7.6 26.3 l  7.6 21.2 l  24.1 17.1 l  24.1 63 l 
34.2 63 l  34.2 68.1 l  p ef
pom
pum
2056 1850.8 t 
18.9 17.1 m  24 17.1 28 19.5 31 24.1 ct 33.89999 28.8 35.39999 35.1 35.39999 43.1 ct 
35.39999 51.2 33.89999 57.7 31 62.3 ct 28 67 24 69.29999 18.8 69.29999 ct 
14.4 69.29999 10.7 67.4 7.9 63.6 ct 4.29999 58.8 2.6 52 2.6 43.1 ct 
2.6 35.1 4.1 28.8 7 24.1 ct 10 19.5 l  14 17.1 l 
p
18.9 22.1 m  16 22.1 13.7 24 12 27.6 ct 10.4 31.3 9.6 36.5 9.6 43.2 ct 
9.6 49.8 10.4 55 12 58.8 ct 13.7 62.5 16 64.29999 19 64.29999 ct 
21.8 64.29999 23.9 62.9 25.4 60.3 ct 27.3 56.6 28.4 50.9 28.4 43.1 ct 
28.4 36.39999 27.6 31.1 25.9 27.6 ct 24.3 24 l 
21.9 22.1 l  p ef
pom
pum
2094.09999 1850.8 t 
18.9 17.1 m  24 17.1 28 19.5 31 24.1 ct 33.89999 28.8 35.39999 35.1 35.39999 43.1 ct 
35.39999 51.2 33.89999 57.7 31 62.3 ct 28 67 24 69.29999 18.8 69.29999 ct 
14.4 69.29999 10.7 67.4 7.9 63.6 ct 4.29999 58.8 2.6 52 2.6 43.1 ct 
2.6 35.1 4.1 28.8 7 24.1 ct 10 19.5 l  14 17.1 l 
p
18.9 22.1 m  16 22.1 13.7 24 12 27.6 ct 10.4 31.3 9.6 36.5 9.6 43.2 ct 
9.6 49.8 10.4 55 12 58.8 ct 13.7 62.5 16 64.29999 19 64.29999 ct 
21.8 64.29999 23.9 62.9 25.4 60.3 ct 27.3 56.6 28.4 50.9 28.4 43.1 ct 
28.4 36.39999 27.6 31.1 25.9 27.6 ct 24.3 24 l 
21.9 22.1 l  p ef
pom
pum
2132.2 1850.8 t 
18.9 17.1 m  24 17.1 28 19.5 31 24.1 ct 33.89999 28.8 35.39999 35.1 35.39999 43.1 ct 
35.39999 51.2 33.89999 57.7 31 62.3 ct 28 67 24 69.29999 18.8 69.29999 ct 
14.4 69.29999 10.7 67.4 7.9 63.6 ct 4.29999 58.8 2.6 52 2.6 43.1 ct 
2.6 35.1 4.1 28.8 7 24.1 ct 10 19.5 l  14 17.1 l 
p
18.9 22.1 m  16 22.1 13.7 24 12 27.6 ct 10.4 31.3 9.6 36.5 9.6 43.2 ct 
9.6 49.8 10.4 55 12 58.8 ct 13.7 62.5 16 64.29999 19 64.29999 ct 
21.8 64.29999 23.9 62.9 25.4 60.3 ct 27.3 56.6 28.4 50.9 28.4 43.1 ct 
28.4 36.39999 27.6 31.1 25.9 27.6 ct 24.3 24 l 
21.9 22.1 l  p ef
pom
pum
2170.3 1850.8 t 
2.7 19.6 m  2.7 15.1 l  7.1 18.19999 10.7 22.2 13.3 26.9 ct 
16.69999 32.89999 18.4 39.5 18.4 46.5 ct 18.4 53.8 16.6 60.7 12.9 67 ct 
10.3 71.29999 6.8 75 2.7 78 ct 2.7 73.5 l  5.7 70 7.8 66.6 9.2 63 ct 
10.9 58.8 11.8 53.1 11.8 46.5 ct 11.8 39.5 10.8 33.8 8.9 29.4 ct 
7.6 26.1 l  5.4 22.9 l  p ef
pom
gr
1.000 1.000 0.800 c 498 1705.4 m  605.39999 1705.4 l  605.39999 1747.3 l 
498 1747.3 l  498 1705.4 l  p ef
0.003 0.003 0.003 c 551.7 1747.3 m  498 1747.3 l  498 1705.4 l 
605.39999 1705.4 l  605.39999 1747.3 l  551.7 1747.3 l 
ps
1.000 1.000 0.800 c 927.8 1729.6 m  1035.2 1729.6 l 
1035.2 1747.3 l  927.8 1747.3 l  927.8 1729.6 l 
p ef
0.003 0.003 0.003 c 981.5 1747.3 m  927.8 1747.3 l  927.8 1729.6 l 
1035.2 1729.6 l  1035.2 1747.3 l  981.5 1747.3 l 
ps
1.000 1.000 0.800 c 1357.6 1729.6 m  1465 1729.6 l  1465 1747.3 l 
1357.6 1747.3 l  1357.6 1729.6 l  p ef
0.003 0.003 0.003 c 1411.3 1747.3 m  1357.6 1747.3 l  1357.6 1729.6 l 
1465 1729.6 l  1465 1747.3 l  1411.3 1747.3 l  ps
1.000 1.000 0.800 c 1787.4 1729.1 m  1894.8 1729.1 l 
1894.8 1747.3 l  1787.4 1747.3 l  1787.4 1729.1 l 
p ef
0.003 0.003 0.003 c 1841.1 1747.3 m  1787.4 1747.3 l  1787.4 1729.1 l 
1894.8 1729.1 l  1894.8 1747.3 l  1841.1 1747.3 l 
ps
1.000 1.000 0.800 c 2217.2 1728.7 m  2324.59999 1728.7 l 
2324.59999 1747.3 l  2217.2 1747.3 l  2217.2 1728.7 l 
p ef
0.003 0.003 0.003 c 2270.9 1747.3 m  2217.2 1747.3 l  2217.2 1728.7 l 
2324.59999 1728.7 l  2324.59999 1747.3 l  2270.9 1747.3 l 
ps
0.601 0.203 0.402 c 390.6 298.9 m  498 298.9 l  498 1747.3 l 
390.6 1747.3 l  390.6 298.9 l  p ef
0.003 0.003 0.003 c 444.3 1747.3 m  390.6 1747.3 l  390.6 298.9 l 
498 298.9 l  498 1747.3 l  444.3 1747.3 l  ps
0.601 0.203 0.402 c 820.4 1604.6 m  927.8 1604.6 l 
927.8 1747.3 l  820.4 1747.3 l  820.4 1604.6 l 
p ef
0.003 0.003 0.003 c 874.1 1747.3 m  820.4 1747.3 l  820.4 1604.6 l 
927.8 1604.6 l  927.8 1747.3 l  874.1 1747.3 l 
ps
0.601 0.203 0.402 c 1250.2 1561.9 m  1357.6 1561.9 l 
1357.6 1747.3 l  1250.2 1747.3 l  1250.2 1561.9 l 
p ef
0.003 0.003 0.003 c 1303.9 1747.3 m  1250.2 1747.3 l  1250.2 1561.9 l 
1357.6 1561.9 l  1357.6 1747.3 l  1303.9 1747.3 l 
ps
0.601 0.203 0.402 c 1680 1724.5 m  1787.4 1724.5 l  1787.4 1747.3 l 
1680 1747.3 l  1680 1724.5 l  p ef
0.003 0.003 0.003 c 1733.7 1747.3 m  1680 1747.3 l  1680 1724.5 l 
1787.4 1724.5 l  1787.4 1747.3 l  1733.7 1747.3 l 
ps
0.601 0.203 0.402 c 2109.8 366.7 m  2217.2 366.7 l 
2217.2 1747.3 l  2109.8 1747.3 l  2109.8 366.7 l 
p ef
0.003 0.003 0.003 c 2163.5 1747.3 m  2109.8 1747.3 l  2109.8 366.7 l 
2217.2 366.7 l  2217.2 1747.3 l  2163.5 1747.3 l 
ps
0.601 0.601 1.000 c 283.19999 1677.5 m  390.6 1677.5 l 
390.6 1747.3 l  283.19999 1747.3 l  283.19999 1677.5 l 
p ef
0.003 0.003 0.003 c 336.9 1747.3 m  283.19999 1747.3 l  283.19999 1677.5 l 
390.6 1677.5 l  390.6 1747.3 l  336.9 1747.3 l 
ps
0.601 0.601 1.000 c 713 1728.3 m  820.4 1728.3 l  820.4 1747.3 l 
713 1747.3 l  713 1728.3 l  p ef
0.003 0.003 0.003 c 766.7 1747.3 m  713 1747.3 l  713 1728.3 l 
820.4 1728.3 l  820.4 1747.3 l  766.7 1747.3 l 
ps
0.601 0.601 1.000 c 1142.79999 1734.6 m  1250.2 1734.6 l 
1250.2 1747.3 l  1142.79999 1747.3 l  1142.79999 1734.6 l 
p ef
0.003 0.003 0.003 c 1196.5 1747.3 m  1142.79999 1747.3 l  1142.79999 1734.6 l 
1250.2 1734.6 l  1250.2 1747.3 l  1196.5 1747.3 l 
ps
0.601 0.601 1.000 c 1572.6 1745.7 m  1680 1745.7 l  1680 1747.3 l 
1572.6 1747.3 l  1572.6 1745.7 l  p ef
0.003 0.003 0.003 c 1626.3 1747.3 m  1572.6 1747.3 l  1572.6 1745.7 l 
1680 1745.7 l  1680 1747.3 l  1626.3 1747.3 l  ps
0.601 0.601 1.000 c 2002.4 1662.2 m  2109.8 1662.2 l 
2109.8 1747.3 l  2002.4 1747.3 l  2002.4 1662.2 l 
p ef
0.003 0.003 0.003 c 2056.09999 1747.3 m  2002.4 1747.3 l  2002.4 1662.2 l 
2109.8 1662.2 l  2109.8 1747.3 l  2056.09999 1747.3 l 
ps
229.5 1747.3 m  229.5 265.1 l  ps
229.5 1747.3 m  229.5 265.1 l  ps
214.5 1747.3 m  229.5 1747.3 l  ps
gs
pum
166.7 1708.6 t 
18.9 17.1 m  24 17.1 28 19.5 31 24.1 ct 33.89999 28.8 35.39999 35.1 35.39999 43.1 ct 
35.39999 51.2 33.89999 57.7 31 62.3 ct 28 67 24 69.29999 18.8 69.29999 ct 
14.4 69.29999 10.7 67.4 7.9 63.6 ct 4.29999 58.8 2.6 52 2.6 43.1 ct 
2.6 35.1 4.1 28.8 7 24.1 ct 10 19.5 l  14 17.1 l 
p
18.9 22.1 m  16 22.1 13.7 24 12 27.6 ct 10.4 31.3 9.6 36.5 9.6 43.2 ct 
9.6 49.8 10.4 55 12 58.8 ct 13.7 62.5 16 64.29999 19 64.29999 ct 
21.8 64.29999 23.9 62.9 25.4 60.3 ct 27.3 56.6 28.4 50.9 28.4 43.1 ct 
28.4 36.39999 27.6 31.1 25.9 27.6 ct 24.3 24 l 
21.9 22.1 l  p ef
pom
pum
166.7 1708.6 t 
18.9 17.1 m  24 17.1 28 19.5 31 24.1 ct 33.89999 28.8 35.39999 35.1 35.39999 43.1 ct 
35.39999 51.2 33.89999 57.7 31 62.3 ct 28 67 24 69.29999 18.8 69.29999 ct 
14.4 69.29999 10.7 67.4 7.9 63.6 ct 4.29999 58.8 2.6 52 2.6 43.1 ct 
2.6 35.1 4.1 28.8 7 24.1 ct 10 19.5 l  14 17.1 l 
p
18.9 22.1 m  16 22.1 13.7 24 12 27.6 ct 10.4 31.3 9.6 36.5 9.6 43.2 ct 
9.6 49.8 10.4 55 12 58.8 ct 13.7 62.5 16 64.29999 19 64.29999 ct 
21.8 64.29999 23.9 62.9 25.4 60.3 ct 27.3 56.6 28.4 50.9 28.4 43.1 ct 
28.4 36.39999 27.6 31.1 25.9 27.6 ct 24.3 24 l 
21.9 22.1 l  p ef
pom
gr
214.5 1641.5 m  229.5 1641.5 l  ps
gs
pum
108.5 1602.8 t 
3.2 68.1 m  3.2 62.2 l  4.8 58.6 7.4 54.9 11.1 51.2 ct 
14.7 47.5 l  17.9 44.2 l  22.2 39.8 24.4 35.3 24.4 30.9 ct 
24.4 27.7 23.6 25.4 21.9 23.9 ct 20.6 22.8 18.8 22.1 16.3 22.1 ct 
13.3 22.1 9.3 23.4 4.5 26.1 ct 4.5 20.3 l 
9 18.19999 13.3 17.1 17.3 17.1 ct 21.5 17.1 25 18.4 27.6 21 ct 
30.2 23.4 31.4 26.9 31.4 31 ct 31.4 34 30.7 36.6 29.5 38.8 ct 
28.1 41.2 25.6 43.9 21.9 47.2 ct 19.6 49.3 l 
15.1 53.5 12.2 57.8 11.4 62.2 ct 31.1 62.2 l 
31.1 68.1 l  p ef
pom
pum
146.59999 1602.8 t 
5.3 68.1 m  5.3 59.7 l  13.6 59.7 l  13.6 68.1 l 
p ef
pom
pum
165.2 1602.8 t 
5.3 68.2 m  5.3 62.3 l  8.7 63.7 11.9 64.29999 14.7 64.29999 ct 
17.9 64.29999 20.6 63.3 22.5 61.4 ct 24.3 59.4 25.2 56.8 25.2 53.5 ct 
25.2 46.1 20.1 42.3 10 42.3 ct 8.7 42.3 7.5 42.4 6.1 42.5 ct 
6.1 18.4 l  31.3 18.4 l  31.3 24.1 l  12 24.1 l 
12 37.2 l  17.9 37.3 22.5 38.6 25.9 40.9 ct 
30.2 43.8 32.2 48 32.2 53.8 ct 32.2 58.6 30.7 62.5 27.4 65.2 ct 
24.1 68 19.7 69.29999 14 69.29999 ct 11.5 69.29999 l  8.59999 68.9 l 
p ef
pom
gr
214.5 1535.6 m  229.5 1535.6 l  ps
gs
pum
166.7 1496.9 t 
5.3 68.2 m  5.3 62.3 l  8.7 63.7 11.9 64.29999 14.7 64.29999 ct 
17.9 64.29999 20.6 63.3 22.5 61.4 ct 24.3 59.4 25.2 56.8 25.2 53.5 ct 
25.2 46.1 20.1 42.3 10 42.3 ct 8.7 42.3 7.5 42.4 6.1 42.5 ct 
6.1 18.4 l  31.3 18.4 l  31.3 24.1 l  12 24.1 l 
12 37.2 l  17.9 37.3 22.5 38.6 25.9 40.9 ct 
30.2 43.8 32.2 48 32.2 53.8 ct 32.2 58.6 30.7 62.5 27.4 65.2 ct 
24.1 68 19.7 69.29999 14 69.29999 ct 11.5 69.29999 l  8.59999 68.9 l 
p ef
pom
pum
166.7 1496.9 t 
5.3 68.2 m  5.3 62.3 l  8.7 63.7 11.9 64.29999 14.7 64.29999 ct 
17.9 64.29999 20.6 63.3 22.5 61.4 ct 24.3 59.4 25.2 56.8 25.2 53.5 ct 
25.2 46.1 20.1 42.3 10 42.3 ct 8.7 42.3 7.5 42.4 6.1 42.5 ct 
6.1 18.4 l  31.3 18.4 l  31.3 24.1 l  12 24.1 l 
12 37.2 l  17.9 37.3 22.5 38.6 25.9 40.9 ct 
30.2 43.8 32.2 48 32.2 53.8 ct 32.2 58.6 30.7 62.5 27.4 65.2 ct 
24.1 68 19.7 69.29999 14 69.29999 ct 11.5 69.29999 l  8.59999 68.9 l 
p ef
pom
gr
214.5 1429.7 m  229.5 1429.7 l  ps
gs
pum
108.5 1391.1 t 
7.4 68.1 m  7.9 64.1 8.9 60.8 10.1 58.1 ct 
11.2 55.2 13.4 51.3 16.4 46.4 ct 30 24.5 l 
4.5 24.5 l  4.5 18.4 l  36.39999 18.4 l  36.39999 24.5 l 
23.6 43.4 16.4 57.8 14.9 68.1 ct p ef
pom
pum
146.59999 1391.1 t 
5.3 68.1 m  5.3 59.7 l  13.6 59.7 l  13.6 68.1 l 
p ef
pom
pum
165.2 1391.1 t 
5.3 68.2 m  5.3 62.3 l  8.7 63.7 11.9 64.29999 14.7 64.29999 ct 
17.9 64.29999 20.6 63.3 22.5 61.4 ct 24.3 59.4 25.2 56.8 25.2 53.5 ct 
25.2 46.1 20.1 42.3 10 42.3 ct 8.7 42.3 7.5 42.4 6.1 42.5 ct 
6.1 18.4 l  31.3 18.4 l  31.3 24.1 l  12 24.1 l 
12 37.2 l  17.9 37.3 22.5 38.6 25.9 40.9 ct 
30.2 43.8 32.2 48 32.2 53.8 ct 32.2 58.6 30.7 62.5 27.4 65.2 ct 
24.1 68 19.7 69.29999 14 69.29999 ct 11.5 69.29999 l  8.59999 68.9 l 
p ef
pom
gr
214.5 1323.8 m  229.5 1323.8 l  ps
gs
pum
127 1282.6 t 
7.6 68.1 m  7.6 63 l  17.5 63 l  17.5 23.9 l 
7.6 26.3 l  7.6 21.2 l  24.1 17.1 l  24.1 63 l 
34.2 63 l  34.2 68.1 l  p ef
pom
pum
165.1 1282.6 t 
18.9 17.1 m  24 17.1 28 19.5 31 24.1 ct 33.89999 28.8 35.39999 35.1 35.39999 43.1 ct 
35.39999 51.2 33.89999 57.7 31 62.3 ct 28 67 24 69.29999 18.8 69.29999 ct 
14.4 69.29999 10.7 67.4 7.9 63.6 ct 4.29999 58.8 2.6 52 2.6 43.1 ct 
2.6 35.1 4.1 28.8 7 24.1 ct 10 19.5 l  14 17.1 l 
p
18.9 22.1 m  16 22.1 13.7 24 12 27.6 ct 10.4 31.3 9.6 36.5 9.6 43.2 ct 
9.6 49.8 10.4 55 12 58.8 ct 13.7 62.5 16 64.29999 19 64.29999 ct 
21.8 64.29999 23.9 62.9 25.4 60.3 ct 27.3 56.6 28.4 50.9 28.4 43.1 ct 
28.4 36.39999 27.6 31.1 25.9 27.6 ct 24.3 24 l 
21.9 22.1 l  p ef
pom
gr
214.5 1218 m  229.5 1218 l  ps
gs
pum
71.4 1176.79999 t 
7.6 68.1 m  7.6 63 l  17.5 63 l  17.5 23.9 l 
7.6 26.3 l  7.6 21.2 l  24.1 17.1 l  24.1 63 l 
34.2 63 l  34.2 68.1 l  p ef
pom
pum
109.5 1176.79999 t 
3.2 68.1 m  3.2 62.2 l  4.8 58.6 7.4 54.9 11.1 51.2 ct 
14.7 47.5 l  17.9 44.2 l  22.2 39.8 24.4 35.3 24.4 30.9 ct 
24.4 27.7 23.6 25.4 21.9 23.9 ct 20.6 22.8 18.8 22.1 16.3 22.1 ct 
13.3 22.1 9.3 23.4 4.5 26.1 ct 4.5 20.3 l 
9 18.19999 13.3 17.1 17.3 17.1 ct 21.5 17.1 25 18.4 27.6 21 ct 
30.2 23.4 31.4 26.9 31.4 31 ct 31.4 34 30.7 36.6 29.5 38.8 ct 
28.1 41.2 25.6 43.9 21.9 47.2 ct 19.6 49.3 l 
15.1 53.5 12.2 57.8 11.4 62.2 ct 31.1 62.2 l 
31.1 68.1 l  p ef
pom
pum
147.59999 1176.79999 t 
5.3 68.1 m  5.3 59.7 l  13.6 59.7 l  13.6 68.1 l 
p ef
pom
pum
166.2 1176.79999 t 
5.3 68.2 m  5.3 62.3 l  8.7 63.7 11.9 64.29999 14.7 64.29999 ct 
17.9 64.29999 20.6 63.3 22.5 61.4 ct 24.3 59.4 25.2 56.8 25.2 53.5 ct 
25.2 46.1 20.1 42.3 10 42.3 ct 8.7 42.3 7.5 42.4 6.1 42.5 ct 
6.1 18.4 l  31.3 18.4 l  31.3 24.1 l  12 24.1 l 
12 37.2 l  17.9 37.3 22.5 38.6 25.9 40.9 ct 
30.2 43.8 32.2 48 32.2 53.8 ct 32.2 58.6 30.7 62.5 27.4 65.2 ct 
24.1 68 19.7 69.29999 14 69.29999 ct 11.5 69.29999 l  8.59999 68.9 l 
p ef
pom
gr
214.5 1112.1 m  229.5 1112.1 l  ps
gs
pum
127 1071 t 
7.6 68.1 m  7.6 63 l  17.5 63 l  17.5 23.9 l 
7.6 26.3 l  7.6 21.2 l  24.1 17.1 l  24.1 63 l 
34.2 63 l  34.2 68.1 l  p ef
pom
pum
165.1 1071 t 
5.3 68.2 m  5.3 62.3 l  8.7 63.7 11.9 64.29999 14.7 64.29999 ct 
17.9 64.29999 20.6 63.3 22.5 61.4 ct 24.3 59.4 25.2 56.8 25.2 53.5 ct 
25.2 46.1 20.1 42.3 10 42.3 ct 8.7 42.3 7.5 42.4 6.1 42.5 ct 
6.1 18.4 l  31.3 18.4 l  31.3 24.1 l  12 24.1 l 
12 37.2 l  17.9 37.3 22.5 38.6 25.9 40.9 ct 
30.2 43.8 32.2 48 32.2 53.8 ct 32.2 58.6 30.7 62.5 27.4 65.2 ct 
24.1 68 19.7 69.29999 14 69.29999 ct 11.5 69.29999 l  8.59999 68.9 l 
p ef
pom
gr
214.5 1006.2 m  229.5 1006.2 l  ps
gs
pum
71.4 965.1 t 
7.6 68.1 m  7.6 63 l  17.5 63 l  17.5 23.9 l 
7.6 26.3 l  7.6 21.2 l  24.1 17.1 l  24.1 63 l 
34.2 63 l  34.2 68.1 l  p ef
pom
pum
109.5 965.1 t 
7.4 68.1 m  7.9 64.1 8.9 60.8 10.1 58.1 ct 
11.2 55.2 13.4 51.3 16.4 46.4 ct 30 24.5 l 
4.5 24.5 l  4.5 18.4 l  36.39999 18.4 l  36.39999 24.5 l 
23.6 43.4 16.4 57.8 14.9 68.1 ct p ef
pom
pum
147.59999 965.1 t 
5.3 68.1 m  5.3 59.7 l  13.6 59.7 l  13.6 68.1 l 
p ef
pom
pum
166.2 965.1 t 
5.3 68.2 m  5.3 62.3 l  8.7 63.7 11.9 64.29999 14.7 64.29999 ct 
17.9 64.29999 20.6 63.3 22.5 61.4 ct 24.3 59.4 25.2 56.8 25.2 53.5 ct 
25.2 46.1 20.1 42.3 10 42.3 ct 8.7 42.3 7.5 42.4 6.1 42.5 ct 
6.1 18.4 l  31.3 18.4 l  31.3 24.1 l  12 24.1 l 
12 37.2 l  17.9 37.3 22.5 38.6 25.9 40.9 ct 
30.2 43.8 32.2 48 32.2 53.8 ct 32.2 58.6 30.7 62.5 27.4 65.2 ct 
24.1 68 19.7 69.29999 14 69.29999 ct 11.5 69.29999 l  8.59999 68.9 l 
p ef
pom
gr
214.5 900.3 m  229.5 900.3 l  ps
gs
pum
127 859.3 t 
3.2 68.1 m  3.2 62.2 l  4.8 58.6 7.4 54.9 11.1 51.2 ct 
14.7 47.5 l  17.9 44.2 l  22.2 39.8 24.4 35.3 24.4 30.9 ct 
24.4 27.7 23.6 25.4 21.9 23.9 ct 20.6 22.8 18.8 22.1 16.3 22.1 ct 
13.3 22.1 9.3 23.4 4.5 26.1 ct 4.5 20.3 l 
9 18.19999 13.3 17.1 17.3 17.1 ct 21.5 17.1 25 18.4 27.6 21 ct 
30.2 23.4 31.4 26.9 31.4 31 ct 31.4 34 30.7 36.6 29.5 38.8 ct 
28.1 41.2 25.6 43.9 21.9 47.2 ct 19.6 49.3 l 
15.1 53.5 12.2 57.8 11.4 62.2 ct 31.1 62.2 l 
31.1 68.1 l  p ef
pom
pum
165.1 859.3 t 
18.9 17.1 m  24 17.1 28 19.5 31 24.1 ct 33.89999 28.8 35.39999 35.1 35.39999 43.1 ct 
35.39999 51.2 33.89999 57.7 31 62.3 ct 28 67 24 69.29999 18.8 69.29999 ct 
14.4 69.29999 10.7 67.4 7.9 63.6 ct 4.29999 58.8 2.6 52 2.6 43.1 ct 
2.6 35.1 4.1 28.8 7 24.1 ct 10 19.5 l  14 17.1 l 
p
18.9 22.1 m  16 22.1 13.7 24 12 27.6 ct 10.4 31.3 9.6 36.5 9.6 43.2 ct 
9.6 49.8 10.4 55 12 58.8 ct 13.7 62.5 16 64.29999 19 64.29999 ct 
21.8 64.29999 23.9 62.9 25.4 60.3 ct 27.3 56.6 28.4 50.9 28.4 43.1 ct 
28.4 36.39999 27.6 31.1 25.9 27.6 ct 24.3 24 l 
21.9 22.1 l  p ef
pom
gr
214.5 794.4 m  229.5 794.4 l  ps
gs
pum
71.4 753.5 t 
3.2 68.1 m  3.2 62.2 l  4.8 58.6 7.4 54.9 11.1 51.2 ct 
14.7 47.5 l  17.9 44.2 l  22.2 39.8 24.4 35.3 24.4 30.9 ct 
24.4 27.7 23.6 25.4 21.9 23.9 ct 20.6 22.8 18.8 22.1 16.3 22.1 ct 
13.3 22.1 9.3 23.4 4.5 26.1 ct 4.5 20.3 l 
9 18.19999 13.3 17.1 17.3 17.1 ct 21.5 17.1 25 18.4 27.6 21 ct 
30.2 23.4 31.4 26.9 31.4 31 ct 31.4 34 30.7 36.6 29.5 38.8 ct 
28.1 41.2 25.6 43.9 21.9 47.2 ct 19.6 49.3 l 
15.1 53.5 12.2 57.8 11.4 62.2 ct 31.1 62.2 l 
31.1 68.1 l  p ef
pom
pum
109.5 753.5 t 
3.2 68.1 m  3.2 62.2 l  4.8 58.6 7.4 54.9 11.1 51.2 ct 
14.7 47.5 l  17.9 44.2 l  22.2 39.8 24.4 35.3 24.4 30.9 ct 
24.4 27.7 23.6 25.4 21.9 23.9 ct 20.6 22.8 18.8 22.1 16.3 22.1 ct 
13.3 22.1 9.3 23.4 4.5 26.1 ct 4.5 20.3 l 
9 18.19999 13.3 17.1 17.3 17.1 ct 21.5 17.1 25 18.4 27.6 21 ct 
30.2 23.4 31.4 26.9 31.4 31 ct 31.4 34 30.7 36.6 29.5 38.8 ct 
28.1 41.2 25.6 43.9 21.9 47.2 ct 19.6 49.3 l 
15.1 53.5 12.2 57.8 11.4 62.2 ct 31.1 62.2 l 
31.1 68.1 l  p ef
pom
pum
147.59999 753.5 t 
5.3 68.1 m  5.3 59.7 l  13.6 59.7 l  13.6 68.1 l 
p ef
pom
pum
166.2 753.5 t 
5.3 68.2 m  5.3 62.3 l  8.7 63.7 11.9 64.29999 14.7 64.29999 ct 
17.9 64.29999 20.6 63.3 22.5 61.4 ct 24.3 59.4 25.2 56.8 25.2 53.5 ct 
25.2 46.1 20.1 42.3 10 42.3 ct 8.7 42.3 7.5 42.4 6.1 42.5 ct 
6.1 18.4 l  31.3 18.4 l  31.3 24.1 l  12 24.1 l 
12 37.2 l  17.9 37.3 22.5 38.6 25.9 40.9 ct 
30.2 43.8 32.2 48 32.2 53.8 ct 32.2 58.6 30.7 62.5 27.4 65.2 ct 
24.1 68 19.7 69.29999 14 69.29999 ct 11.5 69.29999 l  8.59999 68.9 l 
p ef
pom
gr
214.5 688.6 m  229.5 688.6 l  ps
gs
pum
127 647.6 t 
3.2 68.1 m  3.2 62.2 l  4.8 58.6 7.4 54.9 11.1 51.2 ct 
14.7 47.5 l  17.9 44.2 l  22.2 39.8 24.4 35.3 24.4 30.9 ct 
24.4 27.7 23.6 25.4 21.9 23.9 ct 20.6 22.8 18.8 22.1 16.3 22.1 ct 
13.3 22.1 9.3 23.4 4.5 26.1 ct 4.5 20.3 l 
9 18.19999 13.3 17.1 17.3 17.1 ct 21.5 17.1 25 18.4 27.6 21 ct 
30.2 23.4 31.4 26.9 31.4 31 ct 31.4 34 30.7 36.6 29.5 38.8 ct 
28.1 41.2 25.6 43.9 21.9 47.2 ct 19.6 49.3 l 
15.1 53.5 12.2 57.8 11.4 62.2 ct 31.1 62.2 l 
31.1 68.1 l  p ef
pom
pum
165.1 647.6 t 
5.3 68.2 m  5.3 62.3 l  8.7 63.7 11.9 64.29999 14.7 64.29999 ct 
17.9 64.29999 20.6 63.3 22.5 61.4 ct 24.3 59.4 25.2 56.8 25.2 53.5 ct 
25.2 46.1 20.1 42.3 10 42.3 ct 8.7 42.3 7.5 42.4 6.1 42.5 ct 
6.1 18.4 l  31.3 18.4 l  31.3 24.1 l  12 24.1 l 
12 37.2 l  17.9 37.3 22.5 38.6 25.9 40.9 ct 
30.2 43.8 32.2 48 32.2 53.8 ct 32.2 58.6 30.7 62.5 27.4 65.2 ct 
24.1 68 19.7 69.29999 14 69.29999 ct 11.5 69.29999 l  8.59999 68.9 l 
p ef
pom
gr
214.5 582.7 m  229.5 582.7 l  ps
gs
pum
71.4 541.8 t 
3.2 68.1 m  3.2 62.2 l  4.8 58.6 7.4 54.9 11.1 51.2 ct 
14.7 47.5 l  17.9 44.2 l  22.2 39.8 24.4 35.3 24.4 30.9 ct 
24.4 27.7 23.6 25.4 21.9 23.9 ct 20.6 22.8 18.8 22.1 16.3 22.1 ct 
13.3 22.1 9.3 23.4 4.5 26.1 ct 4.5 20.3 l 
9 18.19999 13.3 17.1 17.3 17.1 ct 21.5 17.1 25 18.4 27.6 21 ct 
30.2 23.4 31.4 26.9 31.4 31 ct 31.4 34 30.7 36.6 29.5 38.8 ct 
28.1 41.2 25.6 43.9 21.9 47.2 ct 19.6 49.3 l 
15.1 53.5 12.2 57.8 11.4 62.2 ct 31.1 62.2 l 
31.1 68.1 l  p ef
pom
pum
109.5 541.8 t 
7.4 68.1 m  7.9 64.1 8.9 60.8 10.1 58.1 ct 
11.2 55.2 13.4 51.3 16.4 46.4 ct 30 24.5 l 
4.5 24.5 l  4.5 18.4 l  36.39999 18.4 l  36.39999 24.5 l 
23.6 43.4 16.4 57.8 14.9 68.1 ct p ef
pom
pum
147.59999 541.8 t 
5.3 68.1 m  5.3 59.7 l  13.6 59.7 l  13.6 68.1 l 
p ef
pom
pum
166.2 541.8 t 
5.3 68.2 m  5.3 62.3 l  8.7 63.7 11.9 64.29999 14.7 64.29999 ct 
17.9 64.29999 20.6 63.3 22.5 61.4 ct 24.3 59.4 25.2 56.8 25.2 53.5 ct 
25.2 46.1 20.1 42.3 10 42.3 ct 8.7 42.3 7.5 42.4 6.1 42.5 ct 
6.1 18.4 l  31.3 18.4 l  31.3 24.1 l  12 24.1 l 
12 37.2 l  17.9 37.3 22.5 38.6 25.9 40.9 ct 
30.2 43.8 32.2 48 32.2 53.8 ct 32.2 58.6 30.7 62.5 27.4 65.2 ct 
24.1 68 19.7 69.29999 14 69.29999 ct 11.5 69.29999 l  8.59999 68.9 l 
p ef
pom
gr
214.5 476.8 m  229.5 476.8 l  ps
gs
pum
127 436 t 
5 67.7 m  5 61.5 l  5.3 61.6 l  5.9 61.8 6.3 62.1 6.5 62.1 ct 
8.9 63 10.5 63.6 11.5 63.7 ct 12.9 64.1 14.2 64.29999 15.5 64.29999 ct 
18.8 64.29999 21.4 63.4 23 61.5 ct 24.4 59.9 25.2 57.5 25.2 54.6 ct 
25.2 51.2 24.1 48.5 21.8 46.7 ct 19.6 44.9 16.4 43.9 12.2 43.9 ct 
9.6 43.9 l  9.6 39.4 l  11.9 39.4 l  15.8 39.4 18.6 38.4 20.8 36.8 ct 
22.9 35 24 32.7 24 29.5 ct 24 24.5 21.4 22.1 16 22.1 ct 
13.3 22.1 9.8 23 5.7 25 ct 5.7 19.2 l  9.7 17.8 13.3 17.1 16.4 17.1 ct 
21.8 17.1 25.6 18.5 28 21 ct 29.8 22.9 30.6 25.4 30.6 28.5 ct 
30.6 32.1 29.4 35.1 26.9 37.3 ct 25.4 38.7 23.2 39.9 20.3 41.2 ct 
22.9 41.9 24.8 42.5 26.1 43.2 ct 30.2 45.7 32.2 49.4 32.2 54.4 ct 
32.2 58.9 30.9 62.5 27.8 65.2 ct 24.8 68 21 69.29999 16 69.29999 ct 
13.4 69.29999 l  9.8 68.79999 l  p ef
pom
pum
165.1 436 t 
18.9 17.1 m  24 17.1 28 19.5 31 24.1 ct 33.89999 28.8 35.39999 35.1 35.39999 43.1 ct 
35.39999 51.2 33.89999 57.7 31 62.3 ct 28 67 24 69.29999 18.8 69.29999 ct 
14.4 69.29999 10.7 67.4 7.9 63.6 ct 4.29999 58.8 2.6 52 2.6 43.1 ct 
2.6 35.1 4.1 28.8 7 24.1 ct 10 19.5 l  14 17.1 l 
p
18.9 22.1 m  16 22.1 13.7 24 12 27.6 ct 10.4 31.3 9.6 36.5 9.6 43.2 ct 
9.6 49.8 10.4 55 12 58.8 ct 13.7 62.5 16 64.29999 19 64.29999 ct 
21.8 64.29999 23.9 62.9 25.4 60.3 ct 27.3 56.6 28.4 50.9 28.4 43.1 ct 
28.4 36.39999 27.6 31.1 25.9 27.6 ct 24.3 24 l 
21.9 22.1 l  p ef
pom
gr
214.5 370.9 m  229.5 370.9 l  ps
gs
pum
71.4 330.1 t 
5 67.7 m  5 61.5 l  5.3 61.6 l  5.9 61.8 6.3 62.1 6.5 62.1 ct 
8.9 63 10.5 63.6 11.5 63.7 ct 12.9 64.1 14.2 64.29999 15.5 64.29999 ct 
18.8 64.29999 21.4 63.4 23 61.5 ct 24.4 59.9 25.2 57.5 25.2 54.6 ct 
25.2 51.2 24.1 48.5 21.8 46.7 ct 19.6 44.9 16.4 43.9 12.2 43.9 ct 
9.6 43.9 l  9.6 39.4 l  11.9 39.4 l  15.8 39.4 18.6 38.4 20.8 36.8 ct 
22.9 35 24 32.7 24 29.5 ct 24 24.5 21.4 22.1 16 22.1 ct 
13.3 22.1 9.8 23 5.7 25 ct 5.7 19.2 l  9.7 17.8 13.3 17.1 16.4 17.1 ct 
21.8 17.1 25.6 18.5 28 21 ct 29.8 22.9 30.6 25.4 30.6 28.5 ct 
30.6 32.1 29.4 35.1 26.9 37.3 ct 25.4 38.7 23.2 39.9 20.3 41.2 ct 
22.9 41.9 24.8 42.5 26.1 43.2 ct 30.2 45.7 32.2 49.4 32.2 54.4 ct 
32.2 58.9 30.9 62.5 27.8 65.2 ct 24.8 68 21 69.29999 16 69.29999 ct 
13.4 69.29999 l  9.8 68.79999 l  p ef
pom
pum
109.5 330.1 t 
3.2 68.1 m  3.2 62.2 l  4.8 58.6 7.4 54.9 11.1 51.2 ct 
14.7 47.5 l  17.9 44.2 l  22.2 39.8 24.4 35.3 24.4 30.9 ct 
24.4 27.7 23.6 25.4 21.9 23.9 ct 20.6 22.8 18.8 22.1 16.3 22.1 ct 
13.3 22.1 9.3 23.4 4.5 26.1 ct 4.5 20.3 l 
9 18.19999 13.3 17.1 17.3 17.1 ct 21.5 17.1 25 18.4 27.6 21 ct 
30.2 23.4 31.4 26.9 31.4 31 ct 31.4 34 30.7 36.6 29.5 38.8 ct 
28.1 41.2 25.6 43.9 21.9 47.2 ct 19.6 49.3 l 
15.1 53.5 12.2 57.8 11.4 62.2 ct 31.1 62.2 l 
31.1 68.1 l  p ef
pom
pum
147.59999 330.1 t 
5.3 68.1 m  5.3 59.7 l  13.6 59.7 l  13.6 68.1 l 
p ef
pom
pum
166.2 330.1 t 
5.3 68.2 m  5.3 62.3 l  8.7 63.7 11.9 64.29999 14.7 64.29999 ct 
17.9 64.29999 20.6 63.3 22.5 61.4 ct 24.3 59.4 25.2 56.8 25.2 53.5 ct 
25.2 46.1 20.1 42.3 10 42.3 ct 8.7 42.3 7.5 42.4 6.1 42.5 ct 
6.1 18.4 l  31.3 18.4 l  31.3 24.1 l  12 24.1 l 
12 37.2 l  17.9 37.3 22.5 38.6 25.9 40.9 ct 
30.2 43.8 32.2 48 32.2 53.8 ct 32.2 58.6 30.7 62.5 27.4 65.2 ct 
24.1 68 19.7 69.29999 14 69.29999 ct 11.5 69.29999 l  8.59999 68.9 l 
p ef
pom
gr
214.5 265 m  229.5 265 l  ps
gs
pum
127 224.3 t 
5 67.7 m  5 61.5 l  5.3 61.6 l  5.9 61.8 6.3 62.1 6.5 62.1 ct 
8.9 63 10.5 63.6 11.5 63.7 ct 12.9 64.1 14.2 64.29999 15.5 64.29999 ct 
18.8 64.29999 21.4 63.4 23 61.5 ct 24.4 59.9 25.2 57.5 25.2 54.6 ct 
25.2 51.2 24.1 48.5 21.8 46.7 ct 19.6 44.9 16.4 43.9 12.2 43.9 ct 
9.6 43.9 l  9.6 39.4 l  11.9 39.4 l  15.8 39.4 18.6 38.4 20.8 36.8 ct 
22.9 35 24 32.7 24 29.5 ct 24 24.5 21.4 22.1 16 22.1 ct 
13.3 22.1 9.8 23 5.7 25 ct 5.7 19.2 l  9.7 17.8 13.3 17.1 16.4 17.1 ct 
21.8 17.1 25.6 18.5 28 21 ct 29.8 22.9 30.6 25.4 30.6 28.5 ct 
30.6 32.1 29.4 35.1 26.9 37.3 ct 25.4 38.7 23.2 39.9 20.3 41.2 ct 
22.9 41.9 24.8 42.5 26.1 43.2 ct 30.2 45.7 32.2 49.4 32.2 54.4 ct 
32.2 58.9 30.9 62.5 27.8 65.2 ct 24.8 68 21 69.29999 16 69.29999 ct 
13.4 69.29999 l  9.8 68.79999 l  p ef
pom
pum
165.1 224.3 t 
5.3 68.2 m  5.3 62.3 l  8.7 63.7 11.9 64.29999 14.7 64.29999 ct 
17.9 64.29999 20.6 63.3 22.5 61.4 ct 24.3 59.4 25.2 56.8 25.2 53.5 ct 
25.2 46.1 20.1 42.3 10 42.3 ct 8.7 42.3 7.5 42.4 6.1 42.5 ct 
6.1 18.4 l  31.3 18.4 l  31.3 24.1 l  12 24.1 l 
12 37.2 l  17.9 37.3 22.5 38.6 25.9 40.9 ct 
30.2 43.8 32.2 48 32.2 53.8 ct 32.2 58.6 30.7 62.5 27.4 65.2 ct 
24.1 68 19.7 69.29999 14 69.29999 ct 11.5 69.29999 l  8.59999 68.9 l 
p ef
pom
gr
gs
pum
280.5 1608.9 t 
6.5 58.4 m  6.5 54 l  15 54 l  15 20.4 l  6.5 22.6 l 
6.5 18.19999 l  20.7 14.7 l  20.7 54 l  29.3 54 l 
29.3 58.4 l  p ef
pom
pum
312.7 1608.9 t 
4.5 58.4 m  4.5 51.2 l  11.6 51.2 l  11.6 58.4 l 
p ef
pom
pum
329.6 1608.9 t 
8.4 36 m  11.1 32.7 14.3 31 18.19999 31 ct 21.6 31 24.5 32.2 26.5 34.6 ct 
28.5 36.89999 29.4 40.2 29.4 44.4 ct 29.4 49 28.2 52.6 25.9 55.3 ct 
23.5 58 20.3 59.4 16.3 59.4 ct 12 59.4 8.5 57.6 6.1 53.8 ct 
3.6 50 2.3 44.9 2.3 38.4 ct 2.3 30.9 3.8 25.2 6.8 20.9 ct 
9.7 16.8 13.9 14.7 19.2 14.7 ct 21.5 14.7 24.2 15.1 27.2 16.3 ct 
27.2 21.3 l  23.6 19.7 20.9 18.9 19 18.9 ct 
14.8 18.9 11.7 21 10.1 25.3 ct 9.4 27 8.9 28.9 8.7 30.9 ct 
8.5 32.1 l  8.5 33.8 l  p
16.69999 35.1 m  14.2 35.1 12.3 35.89999 10.9 37.5 ct 
9.4 39.2 8.7 41.4 8.7 44.2 ct 8.7 47.4 9.4 50 10.9 52 ct 
12.4 54.1 14.4 55.1 16.8 55.1 ct 21.5 55.1 23.9 51.9 23.9 45.5 ct 
23.9 38.6 l  21.4 35.1 l  p ef
pom
pum
362.6 1608.9 t 
4.5 58.5 m  4.5 53.4 l  7.5 54.6 10.2 55.1 12.6 55.1 ct 
15.4 55.1 17.6 54.3 19.3 52.6 ct 20.8 51 21.6 48.7 21.6 45.9 ct 
21.6 39.5 17.3 36.2 8.5 36.2 ct 7.5 36.2 6.4 36.39999 5.3 36.5 ct 
5.3 15.7 l  26.8 15.7 l  26.8 20.7 l  10.3 20.7 l 
10.3 31.9 l  15.4 32 19.3 33.1 22.2 35.1 ct 
25.9 37.5 27.6 41.2 27.6 46.1 ct 27.6 50.3 26.3 53.5 23.5 55.9 ct 
20.7 58.3 16.9 59.4 12 59.4 ct 9.8 59.4 l 
7.4 59.1 l  p ef
pom
gr
gs
pum
709.1 1659.1 t 
16.19999 14.7 m  20.6 14.7 24 16.69999 26.6 20.7 ct 
29 24.7 30.3 30.1 30.3 36.89999 ct 30.3 43.9 29 49.4 26.6 53.4 ct 
24 57.4 20.6 59.4 16.1 59.4 ct 12.3 59.4 9.09999 57.8 6.8 54.5 ct 
3.7 50.4 2.2 44.6 2.2 36.89999 ct 2.2 30.1 3.5 24.7 6 20.7 ct 
8.5 16.69999 l  12 14.7 l  p
16.19999 18.9 m  13.7 18.9 11.7 20.6 10.3 23.6 ct 
8.9 26.8 8.2 31.3 8.2 37.1 ct 8.2 42.7 8.9 47.2 10.3 50.4 ct 
11.7 53.5 13.7 55.1 16.3 55.1 ct 18.69999 55.1 20.4 53.9 21.7 51.7 ct 
23.4 48.5 24.3 43.7 24.3 36.89999 ct 24.3 31.2 23.6 26.7 22.2 23.6 ct 
20.8 20.6 l  18.8 18.9 l  p ef
pom
pum
741.3 1659.1 t 
4.5 58.4 m  4.5 51.2 l  11.6 51.2 l  11.6 58.4 l 
p ef
pom
pum
758.2 1659.1 t 
19.6 58.4 m  19.6 46.2 l  0.8 46.2 l  0.8 42 l 
19.6 15.7 l  25 15.7 l  25 41.7 l  30.7 41.7 l 
30.7 46.2 l  25 46.2 l  25 58.4 l  p
6.3 41.7 m  20.1 41.7 l  20.1 22.7 l  p ef
pom
pum
791.2 1659.1 t 
4.5 58.5 m  4.5 53.4 l  7.5 54.6 10.2 55.1 12.6 55.1 ct 
15.4 55.1 17.6 54.3 19.3 52.6 ct 20.8 51 21.6 48.7 21.6 45.9 ct 
21.6 39.5 17.3 36.2 8.5 36.2 ct 7.5 36.2 6.4 36.39999 5.3 36.5 ct 
5.3 15.7 l  26.8 15.7 l  26.8 20.7 l  10.3 20.7 l 
10.3 31.9 l  15.4 32 19.3 33.1 22.2 35.1 ct 
25.9 37.5 27.6 41.2 27.6 46.1 ct 27.6 50.3 26.3 53.5 23.5 55.9 ct 
20.7 58.3 16.9 59.4 12 59.4 ct 9.8 59.4 l 
7.4 59.1 l  p ef
pom
gr
gs
pum
1156.2 1667.1 t 
16.19999 14.7 m  20.6 14.7 24 16.69999 26.6 20.7 ct 
29 24.7 30.3 30.1 30.3 36.89999 ct 30.3 43.9 29 49.4 26.6 53.4 ct 
24 57.4 20.6 59.4 16.1 59.4 ct 12.3 59.4 9.09999 57.8 6.8 54.5 ct 
3.7 50.4 2.2 44.6 2.2 36.89999 ct 2.2 30.1 3.5 24.7 6 20.7 ct 
8.5 16.69999 l  12 14.7 l  p
16.19999 18.9 m  13.7 18.9 11.7 20.6 10.3 23.6 ct 
8.9 26.8 8.2 31.3 8.2 37.1 ct 8.2 42.7 8.9 47.2 10.3 50.4 ct 
11.7 53.5 13.7 55.1 16.3 55.1 ct 18.69999 55.1 20.4 53.9 21.7 51.7 ct 
23.4 48.5 24.3 43.7 24.3 36.89999 ct 24.3 31.2 23.6 26.7 22.2 23.6 ct 
20.8 20.6 l  18.8 18.9 l  p ef
pom
pum
1188.4 1667.1 t 
4.5 58.4 m  4.5 51.2 l  11.6 51.2 l  11.6 58.4 l 
p ef
pom
pum
1205.29999 1667.1 t 
4.29999 58 m  4.29999 52.7 l  4.5 52.8 l  5 53 5.4 53.2 5.6 53.2 ct 
7.6 54 9 54.5 9.8 54.6 ct 11 55 12.2 55.1 13.3 55.1 ct 
16.1 55.1 18.3 54.4 19.7 52.7 ct 20.9 51.3 21.6 49.3 21.6 46.8 ct 
21.6 43.9 20.7 41.5 18.69999 40 ct 16.8 38.5 14.1 37.6 10.4 37.6 ct 
8.2 37.6 l  8.2 33.8 l  10.2 33.8 l  13.5 33.8 16 32.89999 17.9 31.5 ct 
19.6 30 20.6 28 20.6 25.3 ct 20.6 21 18.3 18.9 13.7 18.9 ct 
11.4 18.9 8.4 19.7 4.9 21.4 ct 4.9 16.4 l 
8.3 15.3 11.4 14.7 14.1 14.7 ct 18.69999 14.7 22 15.9 24 18 ct 
25.5 19.6 26.2 21.7 26.2 24.5 ct 26.2 27.5 25.2 30.1 23 32 ct 
21.7 33.2 19.9 34.2 17.4 35.3 ct 19.6 35.89999 21.3 36.5 22.3 37.1 ct 
25.9 39.2 27.6 42.4 27.6 46.6 ct 27.6 50.5 26.5 53.5 23.9 55.9 ct 
21.3 58.3 18 59.4 13.7 59.4 ct 11.5 59.4 l 
8.4 59 l  p ef
pom
gr
gs
pum
1569 1677.7 t 
16.19999 14.7 m  20.6 14.7 24 16.69999 26.6 20.7 ct 
29 24.7 30.3 30.1 30.3 36.89999 ct 30.3 43.9 29 49.4 26.6 53.4 ct 
24 57.4 20.6 59.4 16.1 59.4 ct 12.3 59.4 9.09999 57.8 6.8 54.5 ct 
3.7 50.4 2.2 44.6 2.2 36.89999 ct 2.2 30.1 3.5 24.7 6 20.7 ct 
8.5 16.69999 l  12 14.7 l  p
16.19999 18.9 m  13.7 18.9 11.7 20.6 10.3 23.6 ct 
8.9 26.8 8.2 31.3 8.2 37.1 ct 8.2 42.7 8.9 47.2 10.3 50.4 ct 
11.7 53.5 13.7 55.1 16.3 55.1 ct 18.69999 55.1 20.4 53.9 21.7 51.7 ct 
23.4 48.5 24.3 43.7 24.3 36.89999 ct 24.3 31.2 23.6 26.7 22.2 23.6 ct 
20.8 20.6 l  18.8 18.9 l  p ef
pom
pum
1601.2 1677.7 t 
4.5 58.4 m  4.5 51.2 l  11.6 51.2 l  11.6 58.4 l 
p ef
pom
pum
1618.1 1677.7 t 
16.19999 14.7 m  20.6 14.7 24 16.69999 26.6 20.7 ct 
29 24.7 30.3 30.1 30.3 36.89999 ct 30.3 43.9 29 49.4 26.6 53.4 ct 
24 57.4 20.6 59.4 16.1 59.4 ct 12.3 59.4 9.09999 57.8 6.8 54.5 ct 
3.7 50.4 2.2 44.6 2.2 36.89999 ct 2.2 30.1 3.5 24.7 6 20.7 ct 
8.5 16.69999 l  12 14.7 l  p
16.19999 18.9 m  13.7 18.9 11.7 20.6 10.3 23.6 ct 
8.9 26.8 8.2 31.3 8.2 37.1 ct 8.2 42.7 8.9 47.2 10.3 50.4 ct 
11.7 53.5 13.7 55.1 16.3 55.1 ct 18.69999 55.1 20.4 53.9 21.7 51.7 ct 
23.4 48.5 24.3 43.7 24.3 36.89999 ct 24.3 31.2 23.6 26.7 22.2 23.6 ct 
20.8 20.6 l  18.8 18.9 l  p ef
pom
pum
1651.1 1677.7 t 
19.6 58.4 m  19.6 46.2 l  0.8 46.2 l  0.8 42 l 
19.6 15.7 l  25 15.7 l  25 41.7 l  30.7 41.7 l 
30.7 46.2 l  25 46.2 l  25 58.4 l  p
6.3 41.7 m  20.1 41.7 l  20.1 22.7 l  p ef
pom
gr
gs
pum
1997.6 1593 t 
2.8 58.4 m  2.8 53.3 l  4.1 50.3 6.3 47.1 9.5 43.9 ct 
12.6 40.7 l  15.4 37.89999 l  19 34.1 20.9 30.2 20.9 26.5 ct 
20.9 23.7 20.2 21.7 18.8 20.4 ct 17.6 19.5 16.1 18.9 14 18.9 ct 
11.4 18.9 8 20.1 3.8 22.3 ct 3.8 17.4 l 
7.7 15.6 11.4 14.7 14.8 14.7 ct 18.4 14.7 21.4 15.7 23.6 18 ct 
25.9 20.1 26.9 23 26.9 26.6 ct 26.9 29.2 26.3 31.4 25.3 33.3 ct 
24.1 35.3 22 37.6 18.8 40.5 ct 16.8 42.2 l 
12.9 45.9 10.4 49.5 9.7 53.3 ct 26.7 53.3 l 
26.7 58.4 l  p ef
pom
pum
2029.8 1593 t 
4.5 58.4 m  4.5 51.2 l  11.6 51.2 l  11.6 58.4 l 
p ef
pom
pum
2046.7 1593 t 
16.19999 14.7 m  20.6 14.7 24 16.69999 26.6 20.7 ct 
29 24.7 30.3 30.1 30.3 36.89999 ct 30.3 43.9 29 49.4 26.6 53.4 ct 
24 57.4 20.6 59.4 16.1 59.4 ct 12.3 59.4 9.09999 57.8 6.8 54.5 ct 
3.7 50.4 2.2 44.6 2.2 36.89999 ct 2.2 30.1 3.5 24.7 6 20.7 ct 
8.5 16.69999 l  12 14.7 l  p
16.19999 18.9 m  13.7 18.9 11.7 20.6 10.3 23.6 ct 
8.9 26.8 8.2 31.3 8.2 37.1 ct 8.2 42.7 8.9 47.2 10.3 50.4 ct 
11.7 53.5 13.7 55.1 16.3 55.1 ct 18.69999 55.1 20.4 53.9 21.7 51.7 ct 
23.4 48.5 24.3 43.7 24.3 36.89999 ct 24.3 31.2 23.6 26.7 22.2 23.6 ct 
20.8 20.6 l  18.8 18.9 l  p ef
pom
pum
2079.7 1593 t 
6.5 58.4 m  6.5 54 l  15 54 l  15 20.4 l  6.5 22.6 l 
6.5 18.19999 l  20.7 14.7 l  20.7 54 l  29.3 54 l 
29.3 58.4 l  p ef
pom
gr
gs
pum
386.3 230.4 t 
4.29999 58 m  4.29999 52.7 l  4.5 52.8 l  5 53 5.4 53.2 5.6 53.2 ct 
7.6 54 9 54.5 9.8 54.6 ct 11 55 12.2 55.1 13.3 55.1 ct 
16.1 55.1 18.3 54.4 19.7 52.7 ct 20.9 51.3 21.6 49.3 21.6 46.8 ct 
21.6 43.9 20.7 41.5 18.69999 40 ct 16.8 38.5 14.1 37.6 10.4 37.6 ct 
8.2 37.6 l  8.2 33.8 l  10.2 33.8 l  13.5 33.8 16 32.89999 17.9 31.5 ct 
19.6 30 20.6 28 20.6 25.3 ct 20.6 21 18.3 18.9 13.7 18.9 ct 
11.4 18.9 8.4 19.7 4.9 21.4 ct 4.9 16.4 l 
8.3 15.3 11.4 14.7 14.1 14.7 ct 18.69999 14.7 22 15.9 24 18 ct 
25.5 19.6 26.2 21.7 26.2 24.5 ct 26.2 27.5 25.2 30.1 23 32 ct 
21.7 33.2 19.9 34.2 17.4 35.3 ct 19.6 35.89999 21.3 36.5 22.3 37.1 ct 
25.9 39.2 27.6 42.4 27.6 46.6 ct 27.6 50.5 26.5 53.5 23.9 55.9 ct 
21.3 58.3 18 59.4 13.7 59.4 ct 11.5 59.4 l 
8.4 59 l  p ef
pom
pum
418.5 230.4 t 
19.6 58.4 m  19.6 46.2 l  0.8 46.2 l  0.8 42 l 
19.6 15.7 l  25 15.7 l  25 41.7 l  30.7 41.7 l 
30.7 46.2 l  25 46.2 l  25 58.4 l  p
6.3 41.7 m  20.1 41.7 l  20.1 22.7 l  p ef
pom
pum
451.5 230.4 t 
4.5 58.4 m  4.5 51.2 l  11.6 51.2 l  11.6 58.4 l 
p ef
pom
pum
468.4 230.4 t 
2.8 58.4 m  2.8 53.3 l  4.1 50.3 6.3 47.1 9.5 43.9 ct 
12.6 40.7 l  15.4 37.89999 l  19 34.1 20.9 30.2 20.9 26.5 ct 
20.9 23.7 20.2 21.7 18.8 20.4 ct 17.6 19.5 16.1 18.9 14 18.9 ct 
11.4 18.9 8 20.1 3.8 22.3 ct 3.8 17.4 l 
7.7 15.6 11.4 14.7 14.8 14.7 ct 18.4 14.7 21.4 15.7 23.6 18 ct 
25.9 20.1 26.9 23 26.9 26.6 ct 26.9 29.2 26.3 31.4 25.3 33.3 ct 
24.1 35.3 22 37.6 18.8 40.5 ct 16.8 42.2 l 
12.9 45.9 10.4 49.5 9.7 53.3 ct 26.7 53.3 l 
26.7 58.4 l  p ef
pom
gr
gs
pum
817.6 1537.4 t 
4.29999 58 m  4.29999 52.7 l  4.5 52.8 l  5 53 5.4 53.2 5.6 53.2 ct 
7.6 54 9 54.5 9.8 54.6 ct 11 55 12.2 55.1 13.3 55.1 ct 
16.1 55.1 18.3 54.4 19.7 52.7 ct 20.9 51.3 21.6 49.3 21.6 46.8 ct 
21.6 43.9 20.7 41.5 18.69999 40 ct 16.8 38.5 14.1 37.6 10.4 37.6 ct 
8.2 37.6 l  8.2 33.8 l  10.2 33.8 l  13.5 33.8 16 32.89999 17.9 31.5 ct 
19.6 30 20.6 28 20.6 25.3 ct 20.6 21 18.3 18.9 13.7 18.9 ct 
11.4 18.9 8.4 19.7 4.9 21.4 ct 4.9 16.4 l 
8.3 15.3 11.4 14.7 14.1 14.7 ct 18.69999 14.7 22 15.9 24 18 ct 
25.5 19.6 26.2 21.7 26.2 24.5 ct 26.2 27.5 25.2 30.1 23 32 ct 
21.7 33.2 19.9 34.2 17.4 35.3 ct 19.6 35.89999 21.3 36.5 22.3 37.1 ct 
25.9 39.2 27.6 42.4 27.6 46.6 ct 27.6 50.5 26.5 53.5 23.9 55.9 ct 
21.3 58.3 18 59.4 13.7 59.4 ct 11.5 59.4 l 
8.4 59 l  p ef
pom
pum
849.8 1537.4 t 
4.5 58.4 m  4.5 51.2 l  11.6 51.2 l  11.6 58.4 l 
p ef
pom
pum
866.7 1537.4 t 
4.29999 58 m  4.29999 52.7 l  4.5 52.8 l  5 53 5.4 53.2 5.6 53.2 ct 
7.6 54 9 54.5 9.8 54.6 ct 11 55 12.2 55.1 13.3 55.1 ct 
16.1 55.1 18.3 54.4 19.7 52.7 ct 20.9 51.3 21.6 49.3 21.6 46.8 ct 
21.6 43.9 20.7 41.5 18.69999 40 ct 16.8 38.5 14.1 37.6 10.4 37.6 ct 
8.2 37.6 l  8.2 33.8 l  10.2 33.8 l  13.5 33.8 16 32.89999 17.9 31.5 ct 
19.6 30 20.6 28 20.6 25.3 ct 20.6 21 18.3 18.9 13.7 18.9 ct 
11.4 18.9 8.4 19.7 4.9 21.4 ct 4.9 16.4 l 
8.3 15.3 11.4 14.7 14.1 14.7 ct 18.69999 14.7 22 15.9 24 18 ct 
25.5 19.6 26.2 21.7 26.2 24.5 ct 26.2 27.5 25.2 30.1 23 32 ct 
21.7 33.2 19.9 34.2 17.4 35.3 ct 19.6 35.89999 21.3 36.5 22.3 37.1 ct 
25.9 39.2 27.6 42.4 27.6 46.6 ct 27.6 50.5 26.5 53.5 23.9 55.9 ct 
21.3 58.3 18 59.4 13.7 59.4 ct 11.5 59.4 l 
8.4 59 l  p ef
pom
pum
899.7 1537.4 t 
6.3 58.4 m  6.8 55 7.6 52.1 8.7 49.8 ct 
9.6 47.3 11.5 44 14.1 39.8 ct 25.7 21 l  3.8 21 l 
3.8 15.7 l  31.2 15.7 l  31.2 21 l  20.2 37.2 14.1 49.5 12.8 58.4 ct 
p ef
pom
gr
gs
pum
1246.2 1492.5 t 
19.6 58.4 m  19.6 46.2 l  0.8 46.2 l  0.8 42 l 
19.6 15.7 l  25 15.7 l  25 41.7 l  30.7 41.7 l 
30.7 46.2 l  25 46.2 l  25 58.4 l  p
6.3 41.7 m  20.1 41.7 l  20.1 22.7 l  p ef
pom
pum
1278.4 1492.5 t 
4.5 58.4 m  4.5 51.2 l  11.6 51.2 l  11.6 58.4 l 
p ef
pom
pum
1295.3 1492.5 t 
4.29999 58 m  4.29999 52.7 l  4.5 52.8 l  5 53 5.4 53.2 5.6 53.2 ct 
7.6 54 9 54.5 9.8 54.6 ct 11 55 12.2 55.1 13.3 55.1 ct 
16.1 55.1 18.3 54.4 19.7 52.7 ct 20.9 51.3 21.6 49.3 21.6 46.8 ct 
21.6 43.9 20.7 41.5 18.69999 40 ct 16.8 38.5 14.1 37.6 10.4 37.6 ct 
8.2 37.6 l  8.2 33.8 l  10.2 33.8 l  13.5 33.8 16 32.89999 17.9 31.5 ct 
19.6 30 20.6 28 20.6 25.3 ct 20.6 21 18.3 18.9 13.7 18.9 ct 
11.4 18.9 8.4 19.7 4.9 21.4 ct 4.9 16.4 l 
8.3 15.3 11.4 14.7 14.1 14.7 ct 18.69999 14.7 22 15.9 24 18 ct 
25.5 19.6 26.2 21.7 26.2 24.5 ct 26.2 27.5 25.2 30.1 23 32 ct 
21.7 33.2 19.9 34.2 17.4 35.3 ct 19.6 35.89999 21.3 36.5 22.3 37.1 ct 
25.9 39.2 27.6 42.4 27.6 46.6 ct 27.6 50.5 26.5 53.5 23.9 55.9 ct 
21.3 58.3 18 59.4 13.7 59.4 ct 11.5 59.4 l 
8.4 59 l  p ef
pom
pum
1328.3 1492.5 t 
11.1 35.2 m  9.4 33.8 8 32.5 7 31.3 ct 5.6 29.4 4.9 27.5 4.9 25.4 ct 
4.9 22.2 6.1 19.7 8.5 17.69999 ct 10.9 15.7 14 14.7 17.69999 14.7 ct 
21.3 14.7 24.1 15.5 26.2 17.3 ct 28.5 18.9 29.5 21.2 29.5 24 ct 
29.5 26.5 28.6 28.7 26.7 30.9 ct 25.5 32.2 23.7 33.6 21.6 35.2 ct 
24.5 36.6 26.6 38.1 28.1 39.8 ct 30.2 41.9 31.2 44.5 31.2 47.4 ct 
31.2 51 29.9 53.8 27.2 56 ct 24.5 58.3 21 59.4 16.69999 59.4 ct 
12.6 59.4 9.09999 58.4 6.5 56.1 ct 4.1 54 2.8 51.2 2.8 47.8 ct 
2.8 44.7 3.7 41.9 5.8 39.5 ct 7 38 l  8.9 36.6 l 
p
18.4 33.39999 m  22.3 30.6 24.3 27.8 24.3 24.8 ct 
24.3 23 23.7 21.6 22.4 20.6 ct 21.2 19.5 19.4 18.9 17.1 18.9 ct 
15 18.9 13.3 19.5 12.1 20.4 ct 10.8 21.5 10.1 22.8 10.1 24.5 ct 
10.1 26.5 11.1 28.3 13.4 30.1 ct 14.4 30.9 l 
16.19999 32.1 l  p
14.3 37.39999 m  12.2 39.1 10.7 40.5 9.8 41.8 ct 
8.9 43.1 8.4 44.8 8.4 47 ct 8.4 49.4 9.09999 51.3 10.8 52.8 ct 
12.3 54.4 14.4 55.1 17 55.1 ct 19.5 55.1 21.5 54.5 23 53.2 ct 
24.6 51.9 25.4 50.3 25.4 48.2 ct 25.4 46.4 24.8 44.8 23.5 43.7 ct 
22.6 42.6 20.8 41.3 18.3 39.9 ct p ef
pom
gr
gs
pum
1674.8 1656.5 t 
16.19999 14.7 m  20.6 14.7 24 16.69999 26.6 20.7 ct 
29 24.7 30.3 30.1 30.3 36.89999 ct 30.3 43.9 29 49.4 26.6 53.4 ct 
24 57.4 20.6 59.4 16.1 59.4 ct 12.3 59.4 9.09999 57.8 6.8 54.5 ct 
3.7 50.4 2.2 44.6 2.2 36.89999 ct 2.2 30.1 3.5 24.7 6 20.7 ct 
8.5 16.69999 l  12 14.7 l  p
16.19999 18.9 m  13.7 18.9 11.7 20.6 10.3 23.6 ct 
8.9 26.8 8.2 31.3 8.2 37.1 ct 8.2 42.7 8.9 47.2 10.3 50.4 ct 
11.7 53.5 13.7 55.1 16.3 55.1 ct 18.69999 55.1 20.4 53.9 21.7 51.7 ct 
23.4 48.5 24.3 43.7 24.3 36.89999 ct 24.3 31.2 23.6 26.7 22.2 23.6 ct 
20.8 20.6 l  18.8 18.9 l  p ef
pom
pum
1707 1656.5 t 
4.5 58.4 m  4.5 51.2 l  11.6 51.2 l  11.6 58.4 l 
p ef
pom
pum
1723.9 1656.5 t 
4.5 58.5 m  4.5 53.4 l  7.5 54.6 10.2 55.1 12.6 55.1 ct 
15.4 55.1 17.6 54.3 19.3 52.6 ct 20.8 51 21.6 48.7 21.6 45.9 ct 
21.6 39.5 17.3 36.2 8.5 36.2 ct 7.5 36.2 6.4 36.39999 5.3 36.5 ct 
5.3 15.7 l  26.8 15.7 l  26.8 20.7 l  10.3 20.7 l 
10.3 31.9 l  15.4 32 19.3 33.1 22.2 35.1 ct 
25.9 37.5 27.6 41.2 27.6 46.1 ct 27.6 50.3 26.3 53.5 23.5 55.9 ct 
20.7 58.3 16.9 59.4 12 59.4 ct 9.8 59.4 l 
7.4 59.1 l  p ef
pom
pum
1756.9 1656.5 t 
19.6 58.4 m  19.6 46.2 l  0.8 46.2 l  0.8 42 l 
19.6 15.7 l  25 15.7 l  25 41.7 l  30.7 41.7 l 
30.7 46.2 l  25 46.2 l  25 58.4 l  p
6.3 41.7 m  20.1 41.7 l  20.1 22.7 l  p ef
pom
gr
gs
pum
2106.09999 299.19999 t 
4.29999 58 m  4.29999 52.7 l  4.5 52.8 l  5 53 5.4 53.2 5.6 53.2 ct 
7.6 54 9 54.5 9.8 54.6 ct 11 55 12.2 55.1 13.3 55.1 ct 
16.1 55.1 18.3 54.4 19.7 52.7 ct 20.9 51.3 21.6 49.3 21.6 46.8 ct 
21.6 43.9 20.7 41.5 18.69999 40 ct 16.8 38.5 14.1 37.6 10.4 37.6 ct 
8.2 37.6 l  8.2 33.8 l  10.2 33.8 l  13.5 33.8 16 32.89999 17.9 31.5 ct 
19.6 30 20.6 28 20.6 25.3 ct 20.6 21 18.3 18.9 13.7 18.9 ct 
11.4 18.9 8.4 19.7 4.9 21.4 ct 4.9 16.4 l 
8.3 15.3 11.4 14.7 14.1 14.7 ct 18.69999 14.7 22 15.9 24 18 ct 
25.5 19.6 26.2 21.7 26.2 24.5 ct 26.2 27.5 25.2 30.1 23 32 ct 
21.7 33.2 19.9 34.2 17.4 35.3 ct 19.6 35.89999 21.3 36.5 22.3 37.1 ct 
25.9 39.2 27.6 42.4 27.6 46.6 ct 27.6 50.5 26.5 53.5 23.9 55.9 ct 
21.3 58.3 18 59.4 13.7 59.4 ct 11.5 59.4 l 
8.4 59 l  p ef
pom
pum
2138.3 299.19999 t 
2.8 58.4 m  2.8 53.3 l  4.1 50.3 6.3 47.1 9.5 43.9 ct 
12.6 40.7 l  15.4 37.89999 l  19 34.1 20.9 30.2 20.9 26.5 ct 
20.9 23.7 20.2 21.7 18.8 20.4 ct 17.6 19.5 16.1 18.9 14 18.9 ct 
11.4 18.9 8 20.1 3.8 22.3 ct 3.8 17.4 l 
7.7 15.6 11.4 14.7 14.8 14.7 ct 18.4 14.7 21.4 15.7 23.6 18 ct 
25.9 20.1 26.9 23 26.9 26.6 ct 26.9 29.2 26.3 31.4 25.3 33.3 ct 
24.1 35.3 22 37.6 18.8 40.5 ct 16.8 42.2 l 
12.9 45.9 10.4 49.5 9.7 53.3 ct 26.7 53.3 l 
26.7 58.4 l  p ef
pom
pum
2171.3 299.19999 t 
4.5 58.4 m  4.5 51.2 l  11.6 51.2 l  11.6 58.4 l 
p ef
pom
pum
2188.2 299.19999 t 
8.4 36 m  11.1 32.7 14.3 31 18.19999 31 ct 21.6 31 24.5 32.2 26.5 34.6 ct 
28.5 36.89999 29.4 40.2 29.4 44.4 ct 29.4 49 28.2 52.6 25.9 55.3 ct 
23.5 58 20.3 59.4 16.3 59.4 ct 12 59.4 8.5 57.6 6.1 53.8 ct 
3.6 50 2.3 44.9 2.3 38.4 ct 2.3 30.9 3.8 25.2 6.8 20.9 ct 
9.7 16.8 13.9 14.7 19.2 14.7 ct 21.5 14.7 24.2 15.1 27.2 16.3 ct 
27.2 21.3 l  23.6 19.7 20.9 18.9 19 18.9 ct 
14.8 18.9 11.7 21 10.1 25.3 ct 9.4 27 8.9 28.9 8.7 30.9 ct 
8.5 32.1 l  8.5 33.8 l  p
16.69999 35.1 m  14.2 35.1 12.3 35.89999 10.9 37.5 ct 
9.4 39.2 8.7 41.4 8.7 44.2 ct 8.7 47.4 9.4 50 10.9 52 ct 
12.4 54.1 14.4 55.1 16.8 55.1 ct 21.5 55.1 23.9 51.9 23.9 45.5 ct 
23.9 38.6 l  21.4 35.1 l  p ef
pom
gr
gs
pum
494.8 1638 t 
16.19999 14.7 m  20.6 14.7 24 16.69999 26.6 20.7 ct 
29 24.7 30.3 30.1 30.3 36.89999 ct 30.3 43.9 29 49.4 26.6 53.4 ct 
24 57.4 20.6 59.4 16.1 59.4 ct 12.3 59.4 9.09999 57.8 6.8 54.5 ct 
3.7 50.4 2.2 44.6 2.2 36.89999 ct 2.2 30.1 3.5 24.7 6 20.7 ct 
8.5 16.69999 l  12 14.7 l  p
16.19999 18.9 m  13.7 18.9 11.7 20.6 10.3 23.6 ct 
8.9 26.8 8.2 31.3 8.2 37.1 ct 8.2 42.7 8.9 47.2 10.3 50.4 ct 
11.7 53.5 13.7 55.1 16.3 55.1 ct 18.69999 55.1 20.4 53.9 21.7 51.7 ct 
23.4 48.5 24.3 43.7 24.3 36.89999 ct 24.3 31.2 23.6 26.7 22.2 23.6 ct 
20.8 20.6 l  18.8 18.9 l  p ef
pom
pum
527 1638 t 
4.5 58.4 m  4.5 51.2 l  11.6 51.2 l  11.6 58.4 l 
p ef
pom
pum
543.89999 1638 t 
23.3 38.1 m  20.7 41.4 17.4 43.1 13.6 43.1 ct 
10.1 43.1 7.4 41.9 5.4 39.5 ct 3.4 37.2 2.3 33.89999 2.3 29.8 ct 
2.3 25.2 3.5 21.5 5.8 18.8 ct 8.2 16 11.4 14.7 15.4 14.7 ct 
19.7 14.7 23.2 16.6 25.7 20.3 ct 28.2 24 29.4 29.2 29.4 35.6 ct 
29.4 43.1 28 49 24.9 53.1 ct 22 57.3 17.9 59.4 12.7 59.4 ct 
10.2 59.4 7.5 58.9 4.5 57.8 ct 4.5 52.8 l 
8.09999 54.4 10.8 55.1 12.8 55.1 ct 17 55.1 20 53 21.6 48.7 ct 
22.3 47.1 22.8 45.2 23 43.1 ct 23.2 42 l  23.3 40.4 l 
p
14.9 18.9 m  10.2 18.9 7.8 22.1 7.8 28.6 ct 
7.8 35.5 10.3 38.9 15.1 38.9 ct 17.5 38.9 19.4 38.1 20.8 36.5 ct 
22.3 34.8 23 32.6 23 29.8 ct 23 26.7 22.3 24.1 20.8 22 ct 
19.3 20 l  17.3 18.9 l  p ef
pom
pum
576.89999 1638 t 
23.3 38.1 m  20.7 41.4 17.4 43.1 13.6 43.1 ct 
10.1 43.1 7.4 41.9 5.4 39.5 ct 3.4 37.2 2.3 33.89999 2.3 29.8 ct 
2.3 25.2 3.5 21.5 5.8 18.8 ct 8.2 16 11.4 14.7 15.4 14.7 ct 
19.7 14.7 23.2 16.6 25.7 20.3 ct 28.2 24 29.4 29.2 29.4 35.6 ct 
29.4 43.1 28 49 24.9 53.1 ct 22 57.3 17.9 59.4 12.7 59.4 ct 
10.2 59.4 7.5 58.9 4.5 57.8 ct 4.5 52.8 l 
8.09999 54.4 10.8 55.1 12.8 55.1 ct 17 55.1 20 53 21.6 48.7 ct 
22.3 47.1 22.8 45.2 23 43.1 ct 23.2 42 l  23.3 40.4 l 
p
14.9 18.9 m  10.2 18.9 7.8 22.1 7.8 28.6 ct 
7.8 35.5 10.3 38.9 15.1 38.9 ct 17.5 38.9 19.4 38.1 20.8 36.5 ct 
22.3 34.8 23 32.6 23 29.8 ct 23 26.7 22.3 24.1 20.8 22 ct 
19.3 20 l  17.3 18.9 l  p ef
pom
gr
gs
pum
923.4 1661.8 t 
16.19999 14.7 m  20.6 14.7 24 16.69999 26.6 20.7 ct 
29 24.7 30.3 30.1 30.3 36.89999 ct 30.3 43.9 29 49.4 26.6 53.4 ct 
24 57.4 20.6 59.4 16.1 59.4 ct 12.3 59.4 9.09999 57.8 6.8 54.5 ct 
3.7 50.4 2.2 44.6 2.2 36.89999 ct 2.2 30.1 3.5 24.7 6 20.7 ct 
8.5 16.69999 l  12 14.7 l  p
16.19999 18.9 m  13.7 18.9 11.7 20.6 10.3 23.6 ct 
8.9 26.8 8.2 31.3 8.2 37.1 ct 8.2 42.7 8.9 47.2 10.3 50.4 ct 
11.7 53.5 13.7 55.1 16.3 55.1 ct 18.69999 55.1 20.4 53.9 21.7 51.7 ct 
23.4 48.5 24.3 43.7 24.3 36.89999 ct 24.3 31.2 23.6 26.7 22.2 23.6 ct 
20.8 20.6 l  18.8 18.9 l  p ef
pom
pum
955.6 1661.8 t 
4.5 58.4 m  4.5 51.2 l  11.6 51.2 l  11.6 58.4 l 
p ef
pom
pum
972.5 1661.8 t 
19.6 58.4 m  19.6 46.2 l  0.8 46.2 l  0.8 42 l 
19.6 15.7 l  25 15.7 l  25 41.7 l  30.7 41.7 l 
30.7 46.2 l  25 46.2 l  25 58.4 l  p
6.3 41.7 m  20.1 41.7 l  20.1 22.7 l  p ef
pom
pum
1005.5 1661.8 t 
2.8 58.4 m  2.8 53.3 l  4.1 50.3 6.3 47.1 9.5 43.9 ct 
12.6 40.7 l  15.4 37.89999 l  19 34.1 20.9 30.2 20.9 26.5 ct 
20.9 23.7 20.2 21.7 18.8 20.4 ct 17.6 19.5 16.1 18.9 14 18.9 ct 
11.4 18.9 8 20.1 3.8 22.3 ct 3.8 17.4 l 
7.7 15.6 11.4 14.7 14.8 14.7 ct 18.4 14.7 21.4 15.7 23.6 18 ct 
25.9 20.1 26.9 23 26.9 26.6 ct 26.9 29.2 26.3 31.4 25.3 33.3 ct 
24.1 35.3 22 37.6 18.8 40.5 ct 16.8 42.2 l 
12.9 45.9 10.4 49.5 9.7 53.3 ct 26.7 53.3 l 
26.7 58.4 l  p ef
pom
gr
gs
pum
1354.7 1661.8 t 
16.19999 14.7 m  20.6 14.7 24 16.69999 26.6 20.7 ct 
29 24.7 30.3 30.1 30.3 36.89999 ct 30.3 43.9 29 49.4 26.6 53.4 ct 
24 57.4 20.6 59.4 16.1 59.4 ct 12.3 59.4 9.09999 57.8 6.8 54.5 ct 
3.7 50.4 2.2 44.6 2.2 36.89999 ct 2.2 30.1 3.5 24.7 6 20.7 ct 
8.5 16.69999 l  12 14.7 l  p
16.19999 18.9 m  13.7 18.9 11.7 20.6 10.3 23.6 ct 
8.9 26.8 8.2 31.3 8.2 37.1 ct 8.2 42.7 8.9 47.2 10.3 50.4 ct 
11.7 53.5 13.7 55.1 16.3 55.1 ct 18.69999 55.1 20.4 53.9 21.7 51.7 ct 
23.4 48.5 24.3 43.7 24.3 36.89999 ct 24.3 31.2 23.6 26.7 22.2 23.6 ct 
20.8 20.6 l  18.8 18.9 l  p ef
pom
pum
1386.9 1661.8 t 
4.5 58.4 m  4.5 51.2 l  11.6 51.2 l  11.6 58.4 l 
p ef
pom
pum
1403.8 1661.8 t 
19.6 58.4 m  19.6 46.2 l  0.8 46.2 l  0.8 42 l 
19.6 15.7 l  25 15.7 l  25 41.7 l  30.7 41.7 l 
30.7 46.2 l  25 46.2 l  25 58.4 l  p
6.3 41.7 m  20.1 41.7 l  20.1 22.7 l  p ef
pom
pum
1436.8 1661.8 t 
2.8 58.4 m  2.8 53.3 l  4.1 50.3 6.3 47.1 9.5 43.9 ct 
12.6 40.7 l  15.4 37.89999 l  19 34.1 20.9 30.2 20.9 26.5 ct 
20.9 23.7 20.2 21.7 18.8 20.4 ct 17.6 19.5 16.1 18.9 14 18.9 ct 
11.4 18.9 8 20.1 3.8 22.3 ct 3.8 17.4 l 
7.7 15.6 11.4 14.7 14.8 14.7 ct 18.4 14.7 21.4 15.7 23.6 18 ct 
25.9 20.1 26.9 23 26.9 26.6 ct 26.9 29.2 26.3 31.4 25.3 33.3 ct 
24.1 35.3 22 37.6 18.8 40.5 ct 16.8 42.2 l 
12.9 45.9 10.4 49.5 9.7 53.3 ct 26.7 53.3 l 
26.7 58.4 l  p ef
pom
gr
gs
pum
1783.3 1661.8 t 
16.19999 14.7 m  20.6 14.7 24 16.69999 26.6 20.7 ct 
29 24.7 30.3 30.1 30.3 36.89999 ct 30.3 43.9 29 49.4 26.6 53.4 ct 
24 57.4 20.6 59.4 16.1 59.4 ct 12.3 59.4 9.09999 57.8 6.8 54.5 ct 
3.7 50.4 2.2 44.6 2.2 36.89999 ct 2.2 30.1 3.5 24.7 6 20.7 ct 
8.5 16.69999 l  12 14.7 l  p
16.19999 18.9 m  13.7 18.9 11.7 20.6 10.3 23.6 ct 
8.9 26.8 8.2 31.3 8.2 37.1 ct 8.2 42.7 8.9 47.2 10.3 50.4 ct 
11.7 53.5 13.7 55.1 16.3 55.1 ct 18.69999 55.1 20.4 53.9 21.7 51.7 ct 
23.4 48.5 24.3 43.7 24.3 36.89999 ct 24.3 31.2 23.6 26.7 22.2 23.6 ct 
20.8 20.6 l  18.8 18.9 l  p ef
pom
pum
1815.5 1661.8 t 
4.5 58.4 m  4.5 51.2 l  11.6 51.2 l  11.6 58.4 l 
p ef
pom
pum
1832.4 1661.8 t 
19.6 58.4 m  19.6 46.2 l  0.8 46.2 l  0.8 42 l 
19.6 15.7 l  25 15.7 l  25 41.7 l  30.7 41.7 l 
30.7 46.2 l  25 46.2 l  25 58.4 l  p
6.3 41.7 m  20.1 41.7 l  20.1 22.7 l  p ef
pom
pum
1865.4 1661.8 t 
4.29999 58 m  4.29999 52.7 l  4.5 52.8 l  5 53 5.4 53.2 5.6 53.2 ct 
7.6 54 9 54.5 9.8 54.6 ct 11 55 12.2 55.1 13.3 55.1 ct 
16.1 55.1 18.3 54.4 19.7 52.7 ct 20.9 51.3 21.6 49.3 21.6 46.8 ct 
21.6 43.9 20.7 41.5 18.69999 40 ct 16.8 38.5 14.1 37.6 10.4 37.6 ct 
8.2 37.6 l  8.2 33.8 l  10.2 33.8 l  13.5 33.8 16 32.89999 17.9 31.5 ct 
19.6 30 20.6 28 20.6 25.3 ct 20.6 21 18.3 18.9 13.7 18.9 ct 
11.4 18.9 8.4 19.7 4.9 21.4 ct 4.9 16.4 l 
8.3 15.3 11.4 14.7 14.1 14.7 ct 18.69999 14.7 22 15.9 24 18 ct 
25.5 19.6 26.2 21.7 26.2 24.5 ct 26.2 27.5 25.2 30.1 23 32 ct 
21.7 33.2 19.9 34.2 17.4 35.3 ct 19.6 35.89999 21.3 36.5 22.3 37.1 ct 
25.9 39.2 27.6 42.4 27.6 46.6 ct 27.6 50.5 26.5 53.5 23.9 55.9 ct 
21.3 58.3 18 59.4 13.7 59.4 ct 11.5 59.4 l 
8.4 59 l  p ef
pom
gr
gs
pum
2214.59999 1659.1 t 
16.19999 14.7 m  20.6 14.7 24 16.69999 26.6 20.7 ct 
29 24.7 30.3 30.1 30.3 36.89999 ct 30.3 43.9 29 49.4 26.6 53.4 ct 
24 57.4 20.6 59.4 16.1 59.4 ct 12.3 59.4 9.09999 57.8 6.8 54.5 ct 
3.7 50.4 2.2 44.6 2.2 36.89999 ct 2.2 30.1 3.5 24.7 6 20.7 ct 
8.5 16.69999 l  12 14.7 l  p
16.19999 18.9 m  13.7 18.9 11.7 20.6 10.3 23.6 ct 
8.9 26.8 8.2 31.3 8.2 37.1 ct 8.2 42.7 8.9 47.2 10.3 50.4 ct 
11.7 53.5 13.7 55.1 16.3 55.1 ct 18.69999 55.1 20.4 53.9 21.7 51.7 ct 
23.4 48.5 24.3 43.7 24.3 36.89999 ct 24.3 31.2 23.6 26.7 22.2 23.6 ct 
20.8 20.6 l  18.8 18.9 l  p ef
pom
pum
2246.8 1659.1 t 
4.5 58.4 m  4.5 51.2 l  11.6 51.2 l  11.6 58.4 l 
p ef
pom
pum
2263.7 1659.1 t 
19.6 58.4 m  19.6 46.2 l  0.8 46.2 l  0.8 42 l 
19.6 15.7 l  25 15.7 l  25 41.7 l  30.7 41.7 l 
30.7 46.2 l  25 46.2 l  25 58.4 l  p
6.3 41.7 m  20.1 41.7 l  20.1 22.7 l  p ef
pom
pum
2296.7 1659.1 t 
19.6 58.4 m  19.6 46.2 l  0.8 46.2 l  0.8 42 l 
19.6 15.7 l  25 15.7 l  25 41.7 l  30.7 41.7 l 
30.7 46.2 l  25 46.2 l  25 58.4 l  p
6.3 41.7 m  20.1 41.7 l  20.1 22.7 l  p ef
pom
gr
gs
pum
569 39.2 t 
32.39999 127.6 m  32.39999 44.5 l  1 44.5 l  1 34.39999 l 
77.2 34.39999 l  77.2 44.5 l  45.8 44.5 l  45.8 127.6 l 
p ef
pom
pum
646.9 39.2 t 
7.9 127.6 m  7.9 59.2 l  20.3 59.2 l  20.3 127.6 l 
p
7.9 46.8 m  7.9 34.39999 l  20.3 34.39999 l  20.3 46.8 l 
p ef
pom
pum
675.7 39.2 t 
9.5 127.6 m  9.5 59.2 l  21.8 59.2 l  21.8 72 l 
25.4 66.6 28.5 63 30.8 61 ct 33.7 58.9 37.3 57.9 41.6 57.9 ct 
47.1 57.9 51.4 59.4 54.8 63 ct 56.8 65.1 58.6 68.2 59.9 72 ct 
63.8 66.6 66.6 62.8 68.9 61 ct 71.79999 58.9 75.4 57.9 79.7 57.9 ct 
92.1 57.9 98 64.6 98 77.9 ct 98 127.6 l  85.7 127.6 l 
85.7 79.7 l  85.7 72 82.6 68.2 76.7 68.2 ct 
71.2 68.2 65.79999 72.5 59.9 81.8 ct 59.9 127.6 l 
47.6 127.6 l  47.6 79.7 l  47.6 72 44.5 68.2 38.6 68.2 ct 
33.2 68.2 27.5 72.5 21.8 81.8 ct 21.8 127.6 l 
p ef
pom
pum
783.2 39.2 t 
51.2 85.9 m  51.2 81.8 50.7 78.7 49.9 76.7 ct 
47.8 70.2 42.9 66.9 35.7 66.9 ct 30.6 66.9 26.7 68.4 23.9 71.5 ct 
20.8 74.29999 19.3 79.2 18.5 85.9 ct p
63.5 115.5 m  63.5 125.3 l  55 127.9 47.3 129.2 40.1 129.2 ct 
29.3 129.2 21.1 125.8 14.6 119.1 ct 8.4 112.4 5.4 103.7 5.4 92.6 ct 
5.4 81.8 7.9 73.6 13.6 67.1 ct 19 61 26.7 57.9 36 57.9 ct 
47.1 57.9 54.5 61.5 59.2 69.2 ct 62.5 75.1 64 82.3 63.8 91.6 ct 
63.8 95.4 l  18.19999 95.4 l  18.69999 100.3 19.5 104.2 20.8 106.8 ct 
24.4 115.3 31.6 119.6 42.7 119.6 ct 49.1 119.6 l 
55.8 118.4 l  p ef
pom
pum
854.3 39.2 t 
pom
pum
889.9 39.2 t 
58.1 125.3 m  50.4 127.9 43.2 129.2 36.5 129.2 ct 
27.2 129.2 19.5 125.8 13.8 119.1 ct 8.2 112.4 5.4 103.9 5.4 93.4 ct 
5.4 82.3 8.2 73.6 14.1 67.1 ct 19.8 61 28 57.9 38.6 57.9 ct 
43.7 57.9 50.1 58.4 57.4 59.9 ct 57.4 70.2 l 
50.4 68.2 45 67.1 40.9 67.1 ct 26.5 67.1 19.3 75.9 19.3 93.4 ct 
19.3 101.6 21.1 107.8 24.7 112.4 ct 28.5 116.8 33.7 119.1 40.4 119.1 ct 
45.3 119.1 51.2 117.6 58.1 114.8 ct p ef
pom
pum
954.2 39.2 t 
35.5 57.9 m  45 57.9 52.2 61 57.9 67.4 ct 63.3 73.6 65.79999 82.3 65.79999 93.4 ct 
65.79999 104.5 63.3 113.2 57.9 119.6 ct 52.2 125.8 44.7 129.2 35.2 129.2 ct 
27 129.2 20.3 126.3 15.1 121.2 ct 8.4 114.8 5.4 105.2 5.4 93.4 ct 
5.4 82.3 7.9 73.6 13.3 67.4 ct 18.69999 61 l 
26.2 57.9 l  p
35.5 67.1 m  24.1 67.1 18.69999 75.9 18.69999 93.4 ct 
18.69999 110.9 24.1 119.6 35.5 119.6 ct 46.8 119.6 52.5 110.9 52.5 93.1 ct 
52.5 75.6 l  46.8 67.1 l  p ef
pom
pum
1026.2 39.2 t 
9.5 127.6 m  9.5 59.2 l  21.8 59.2 l  21.8 72 l 
24.9 67.9 28 64.6 30.8 62.5 ct 35.2 59.4 40.1 57.9 45.3 57.9 ct 
56.6 57.9 62.5 64.6 62.5 78.5 ct 62.5 127.6 l 
50.1 127.6 l  50.1 82.6 l  50.1 76.9 49.4 73.29999 48.3 71.2 ct 
47.1 69.4 45 68.4 41.9 68.4 ct 35 68.4 28.3 73.29999 21.8 83.3 ct 
21.8 127.6 l  p ef
pom
pum
1097.29999 39.2 t 
7.2 125 m  7.2 113.7 l  15.4 117.8 23.1 119.6 30.1 119.6 ct 
39.6 119.6 44.5 116.3 44.5 109.6 ct 44.5 105.2 41.1 101.6 34.39999 99.6 ct 
23.4 96 l  12.8 92.4 7.4 85.9 7.4 76.7 ct 
7.4 64 16.19999 57.9 33.39999 57.9 ct 38.6 57.9 44.5 58.4 51.7 59.7 ct 
51.7 70.2 l  45.3 68.2 39.1 67.1 32.6 67.1 ct 
24.1 67.1 19.8 70 19.8 75.6 ct 19.8 79.7 22.6 82.6 28.5 84.6 ct 
38.6 87.7 l  50.7 91.8 56.8 98.8 56.8 108.6 ct 
56.8 114.8 54.5 119.9 49.6 123.5 ct 44.7 127.1 38 129.2 29.6 129.2 ct 
23.1 129.2 l  15.4 127.6 l  p ef
pom
pum
1161.7 39.2 t 
49.4 127.6 m  49.4 114.8 l  46.3 118.9 43.2 122.2 40.4 124.3 ct 
36 127.6 31.4 129.2 26.2 129.2 ct 14.6 129.2 8.7 122.2 8.7 108.3 ct 
8.7 59.2 l  21.1 59.2 l  21.1 104.2 l  21.1 109.9 21.6 113.5 22.9 115.5 ct 
23.9 117.3 26.2 118.4 29.3 118.4 ct 36.2 118.4 42.7 113.5 49.4 103.4 ct 
49.4 59.2 l  61.7 59.2 l  61.7 127.6 l  p ef
pom
pum
1233.6 39.2 t 
9.5 127.6 m  9.5 59.2 l  21.8 59.2 l  21.8 72 l 
25.4 66.6 28.5 63 30.8 61 ct 33.7 58.9 37.3 57.9 41.6 57.9 ct 
47.1 57.9 51.4 59.4 54.8 63 ct 56.8 65.1 58.6 68.2 59.9 72 ct 
63.8 66.6 66.6 62.8 68.9 61 ct 71.79999 58.9 75.4 57.9 79.7 57.9 ct 
92.1 57.9 98 64.6 98 77.9 ct 98 127.6 l  85.7 127.6 l 
85.7 79.7 l  85.7 72 82.6 68.2 76.7 68.2 ct 
71.2 68.2 65.79999 72.5 59.9 81.8 ct 59.9 127.6 l 
47.6 127.6 l  47.6 79.7 l  47.6 72 44.5 68.2 38.6 68.2 ct 
33.2 68.2 27.5 72.5 21.8 81.8 ct 21.8 127.6 l 
p ef
pom
pum
1340.3 39.2 t 
21.8 152.3 m  9.5 152.3 l  9.5 59.2 l  21.8 59.2 l 
21.8 72 l  24.1 67.9 26.7 64.6 29.3 62.5 ct 
32.89999 59.4 37.3 57.9 42.4 57.9 ct 49.4 57.9 55 60.7 59.4 66.9 ct 
63.8 73.1 65.79999 81.3 65.79999 91.6 ct 65.79999 103.4 63 112.7 57.6 119.4 ct 
51.9 125.8 44 129.2 33.7 129.2 ct 30.1 129.2 25.9 128.7 21.8 127.6 ct 
p
21.8 83.3 m  21.8 118.1 l  27.5 119.1 31.9 119.6 34.7 119.6 ct 
46.5 119.6 52.5 110.9 52.5 92.9 ct 52.5 85.1 51.4 79.2 49.1 75.1 ct 
46.8 70.7 43.7 68.7 39.6 68.7 ct 34.39999 68.7 l 
28.5 73.6 l  p ef
pom
pum
1412.3 39.2 t 
33.2 127.9 m  30.6 128.7 28.3 129.2 25.9 129.2 ct 
14.9 129.2 9.5 122.2 9.5 108.6 ct 9.5 68.7 l 
1.8 68.7 l  1.8 59.2 l  9.5 59.2 l  9.5 46.8 l 
21.8 45.8 l  21.8 59.2 l  35 59.2 l  35 68.7 l 
21.8 68.7 l  21.8 106.3 l  21.8 111.7 22.3 115.3 23.1 117.1 ct 
24.1 118.9 25.9 119.6 29 119.6 ct 30.6 119.6 31.9 119.6 33.2 119.1 ct 
p ef
pom
pum
1447.8 39.2 t 
7.9 127.6 m  7.9 59.2 l  20.3 59.2 l  20.3 127.6 l 
p
7.9 46.8 m  7.9 34.39999 l  20.3 34.39999 l  20.3 46.8 l 
p ef
pom
pum
1476.6 39.2 t 
35.5 57.9 m  45 57.9 52.2 61 57.9 67.4 ct 63.3 73.6 65.79999 82.3 65.79999 93.4 ct 
65.79999 104.5 63.3 113.2 57.9 119.6 ct 52.2 125.8 44.7 129.2 35.2 129.2 ct 
27 129.2 20.3 126.3 15.1 121.2 ct 8.4 114.8 5.4 105.2 5.4 93.4 ct 
5.4 82.3 7.9 73.6 13.3 67.4 ct 18.69999 61 l 
26.2 57.9 l  p
35.5 67.1 m  24.1 67.1 18.69999 75.9 18.69999 93.4 ct 
18.69999 110.9 24.1 119.6 35.5 119.6 ct 46.8 119.6 52.5 110.9 52.5 93.1 ct 
52.5 75.6 l  46.8 67.1 l  p ef
pom
pum
1547.7 39.2 t 
9.5 127.6 m  9.5 59.2 l  21.8 59.2 l  21.8 72 l 
24.9 67.9 28 64.6 30.8 62.5 ct 35.2 59.4 40.1 57.9 45.3 57.9 ct 
56.6 57.9 62.5 64.6 62.5 78.5 ct 62.5 127.6 l 
50.1 127.6 l  50.1 82.6 l  50.1 76.9 49.4 73.29999 48.3 71.2 ct 
47.1 69.4 45 68.4 41.9 68.4 ct 35 68.4 28.3 73.29999 21.8 83.3 ct 
21.8 127.6 l  p ef
pom
pum
1619.7 39.2 t 
pom
pum
1655.3 39.2 t 
7.9 127.6 m  7.9 59.2 l  20.3 59.2 l  20.3 127.6 l 
p
7.9 46.8 m  7.9 34.39999 l  20.3 34.39999 l  20.3 46.8 l 
p ef
pom
pum
1684.1 39.2 t 
9.5 127.6 m  9.5 59.2 l  21.8 59.2 l  21.8 72 l 
24.9 67.9 28 64.6 30.8 62.5 ct 35.2 59.4 40.1 57.9 45.3 57.9 ct 
56.6 57.9 62.5 64.6 62.5 78.5 ct 62.5 127.6 l 
50.1 127.6 l  50.1 82.6 l  50.1 76.9 49.4 73.29999 48.3 71.2 ct 
47.1 69.4 45 68.4 41.9 68.4 ct 35 68.4 28.3 73.29999 21.8 83.3 ct 
21.8 127.6 l  p ef
pom
pum
1755.2 39.2 t 
pom
pum
1790.7 39.2 t 
7.2 125 m  7.2 113.7 l  15.4 117.8 23.1 119.6 30.1 119.6 ct 
39.6 119.6 44.5 116.3 44.5 109.6 ct 44.5 105.2 41.1 101.6 34.39999 99.6 ct 
23.4 96 l  12.8 92.4 7.4 85.9 7.4 76.7 ct 
7.4 64 16.19999 57.9 33.39999 57.9 ct 38.6 57.9 44.5 58.4 51.7 59.7 ct 
51.7 70.2 l  45.3 68.2 39.1 67.1 32.6 67.1 ct 
24.1 67.1 19.8 70 19.8 75.6 ct 19.8 79.7 22.6 82.6 28.5 84.6 ct 
38.6 87.7 l  50.7 91.8 56.8 98.8 56.8 108.6 ct 
56.8 114.8 54.5 119.9 49.6 123.5 ct 44.7 127.1 38 129.2 29.6 129.2 ct 
23.1 129.2 l  15.4 127.6 l  p ef
pom
pum
1855.1 39.2 t 
51.2 85.9 m  51.2 81.8 50.7 78.7 49.9 76.7 ct 
47.8 70.2 42.9 66.9 35.7 66.9 ct 30.6 66.9 26.7 68.4 23.9 71.5 ct 
20.8 74.29999 19.3 79.2 18.5 85.9 ct p
63.5 115.5 m  63.5 125.3 l  55 127.9 47.3 129.2 40.1 129.2 ct 
29.3 129.2 21.1 125.8 14.6 119.1 ct 8.4 112.4 5.4 103.7 5.4 92.6 ct 
5.4 81.8 7.9 73.6 13.6 67.1 ct 19 61 26.7 57.9 36 57.9 ct 
47.1 57.9 54.5 61.5 59.2 69.2 ct 62.5 75.1 64 82.3 63.8 91.6 ct 
63.8 95.4 l  18.19999 95.4 l  18.69999 100.3 19.5 104.2 20.8 106.8 ct 
24.4 115.3 31.6 119.6 42.7 119.6 ct 49.1 119.6 l 
55.8 118.4 l  p ef
pom
pum
1927.1 39.2 t 
58.1 125.3 m  50.4 127.9 43.2 129.2 36.5 129.2 ct 
27.2 129.2 19.5 125.8 13.8 119.1 ct 8.2 112.4 5.4 103.9 5.4 93.4 ct 
5.4 82.3 8.2 73.6 14.1 67.1 ct 19.8 61 28 57.9 38.6 57.9 ct 
43.7 57.9 50.1 58.4 57.4 59.9 ct 57.4 70.2 l 
50.4 68.2 45 67.1 40.9 67.1 ct 26.5 67.1 19.3 75.9 19.3 93.4 ct 
19.3 101.6 21.1 107.8 24.7 112.4 ct 28.5 116.8 33.7 119.1 40.4 119.1 ct 
45.3 119.1 51.2 117.6 58.1 114.8 ct p ef
pom
pum
1991.4 39.2 t 
35.5 57.9 m  45 57.9 52.2 61 57.9 67.4 ct 63.3 73.6 65.79999 82.3 65.79999 93.4 ct 
65.79999 104.5 63.3 113.2 57.9 119.6 ct 52.2 125.8 44.7 129.2 35.2 129.2 ct 
27 129.2 20.3 126.3 15.1 121.2 ct 8.4 114.8 5.4 105.2 5.4 93.4 ct 
5.4 82.3 7.9 73.6 13.3 67.4 ct 18.69999 61 l 
26.2 57.9 l  p
35.5 67.1 m  24.1 67.1 18.69999 75.9 18.69999 93.4 ct 
18.69999 110.9 24.1 119.6 35.5 119.6 ct 46.8 119.6 52.5 110.9 52.5 93.1 ct 
52.5 75.6 l  46.8 67.1 l  p ef
pom
pum
2062.5 39.2 t 
9.5 127.6 m  9.5 59.2 l  21.8 59.2 l  21.8 72 l 
24.9 67.9 28 64.6 30.8 62.5 ct 35.2 59.4 40.1 57.9 45.3 57.9 ct 
56.6 57.9 62.5 64.6 62.5 78.5 ct 62.5 127.6 l 
50.1 127.6 l  50.1 82.6 l  50.1 76.9 49.4 73.29999 48.3 71.2 ct 
47.1 69.4 45 68.4 41.9 68.4 ct 35 68.4 28.3 73.29999 21.8 83.3 ct 
21.8 127.6 l  p ef
pom
pum
2134.5 39.2 t 
49.4 103.4 m  49.4 68.7 l  43.5 67.6 39.1 67.1 36.5 67.1 ct 
24.7 67.1 18.69999 76.1 18.69999 94.2 ct 18.69999 101.6 19.8 107.3 22.1 111.7 ct 
24.4 116 27.5 118.1 31.6 118.1 ct 36.8 118.1 l 
42.7 113.2 l  p
49.4 114.8 m  47.1 119.1 44.5 122.2 41.9 124.5 ct 
38.3 127.6 33.89999 129.2 28.8 129.2 ct 21.8 129.2 16.19999 126.1 11.8 119.6 ct 
7.4 113.7 5.4 105.5 5.4 95.2 ct 5.4 83.3 7.9 74.1 13.6 67.6 ct 
19.3 61 27.2 57.9 37.3 57.9 ct 41.4 57.9 45.3 58.1 49.4 59.2 ct 
49.4 28.3 l  61.7 28.3 l  61.7 127.6 l  49.4 127.6 l 
p ef
pom
pum
2205.59999 39.2 t 
7.2 125 m  7.2 113.7 l  15.4 117.8 23.1 119.6 30.1 119.6 ct 
39.6 119.6 44.5 116.3 44.5 109.6 ct 44.5 105.2 41.1 101.6 34.39999 99.6 ct 
23.4 96 l  12.8 92.4 7.4 85.9 7.4 76.7 ct 
7.4 64 16.19999 57.9 33.39999 57.9 ct 38.6 57.9 44.5 58.4 51.7 59.7 ct 
51.7 70.2 l  45.3 68.2 39.1 67.1 32.6 67.1 ct 
24.1 67.1 19.8 70 19.8 75.6 ct 19.8 79.7 22.6 82.6 28.5 84.6 ct 
38.6 87.7 l  50.7 91.8 56.8 98.8 56.8 108.6 ct 
56.8 114.8 54.5 119.9 49.6 123.5 ct 44.7 127.1 38 129.2 29.6 129.2 ct 
23.1 129.2 l  15.4 127.6 l  p ef
pom
gr
2602.8 1294.6 m  2400.9 1294.6 l  2400.9 1010.5 l 
2804.8 1010.5 l  2804.8 1294.6 l  2602.8 1294.6 l 
ps
0.601 0.601 1.000 c 2420.5 1036.6 m  2479.3 1036.6 l 
2479.3 1095.4 l  2420.5 1095.4 l  2420.5 1036.6 l 
p ef
0.003 0.003 0.003 c 2449.9 1095.4 m  2420.5 1095.4 l  2420.5 1036.6 l 
2479.3 1036.6 l  2479.3 1095.4 l  2449.9 1095.4 l 
ps
gs
pum
2500.3 1029.4 t 
11.5 58.4 m  0.4 27 l  6.2 27 l  14.8 51.4 l 
24 27 l  29 27 l  17.1 58.4 l  p ef
pom
pum
2529.9 1029.4 t 
4.29999 58.4 m  4.29999 27 l  10 27 l  10 32.89999 l  11.6 30.5 13 28.8 14.1 27.9 ct 
15.4 26.9 17 26.5 19 26.5 ct 21.5 26.5 23.5 27.2 25 28.8 ct 
26 29.8 26.8 31.2 27.4 32.89999 ct 29.2 30.5 30.5 28.7 31.5 27.9 ct 
32.8 26.9 34.5 26.5 36.5 26.5 ct 42.1 26.5 44.8 29.5 44.8 35.6 ct 
44.8 58.4 l  39.2 58.4 l  39.2 36.5 l  39.2 32.89999 37.8 31.2 35.1 31.2 ct 
32.6 31.2 30.1 33.2 27.4 37.39999 ct 27.4 58.4 l 
21.7 58.4 l  21.7 36.5 l  21.7 32.89999 20.3 31.2 17.6 31.2 ct 
15.1 31.2 12.6 33.2 10 37.39999 ct 10 58.4 l  p ef
pom
gr
0.601 0.203 0.402 c 2420.5 1124.79999 m  2479.3 1124.79999 l 
2479.3 1183.6 l  2420.5 1183.6 l  2420.5 1124.79999 l 
p ef
0.003 0.003 0.003 c 2449.9 1183.6 m  2420.5 1183.6 l  2420.5 1124.79999 l 
2479.3 1124.79999 l  2479.3 1183.6 l  2449.9 1183.6 l 
ps
gs
pum
2500.3 1119.4 t 
3.6 58.4 m  3.6 27 l  9.3 27 l  9.3 58.4 l 
p
3.6 21.4 m  3.6 15.7 l  9.3 15.7 l  9.3 21.4 l 
p ef
pom
pum
2513 1119.4 t 
4.29999 58.4 m  4.29999 27 l  10 27 l  10 32.89999 l  11.4 31 12.8 29.5 14.1 28.6 ct 
16.1 27.2 18.3 26.5 20.7 26.5 ct 25.9 26.5 28.6 29.5 28.6 35.89999 ct 
28.6 58.4 l  22.9 58.4 l  22.9 37.8 l  22.9 35.2 22.6 33.5 22.1 32.6 ct 
21.5 31.8 20.6 31.3 19.2 31.3 ct 16 31.3 12.9 33.5 10 38.1 ct 
10 58.4 l  p ef
pom
pum
2546 1119.4 t 
15.1 58.5 m  14 58.9 12.9 59.1 11.8 59.1 ct 
6.8 59.1 4.29999 55.9 4.29999 49.7 ct 4.29999 31.4 l 
0.8 31.4 l  0.8 27 l  4.29999 27 l  4.29999 21.4 l 
10 20.9 l  10 27 l  16 27 l  16 31.4 l  10 31.4 l  10 48.6 l 
10 51.1 10.2 52.7 10.6 53.5 ct 11 54.4 11.8 54.7 13.3 54.7 ct 
14 54.7 14.6 54.7 15.1 54.5 ct p ef
pom
pum
2562.1 1119.4 t 
23.4 39.3 m  23.4 37.39999 23.2 36 22.8 35.1 ct 
21.9 32.1 19.6 30.6 16.3 30.6 ct 14 30.6 12.2 31.3 10.9 32.7 ct 
9.5 34 8.8 36.2 8.4 39.3 ct p
29 52.8 m  29 57.3 l  25.2 58.5 21.6 59.1 18.3 59.1 ct 
13.4 59.1 9.6 57.6 6.7 54.5 ct 3.8 51.4 2.4 47.4 2.4 42.4 ct 
2.4 37.39999 3.6 33.6 6.2 30.7 ct 8.7 27.9 12.2 26.5 16.4 26.5 ct 
21.5 26.5 24.9 28.1 27 31.6 ct 28.6 34.3 29.3 37.6 29.2 41.9 ct 
29.2 43.7 l  8.3 43.7 l  8.5 45.9 8.9 47.7 9.5 48.8 ct 
11.1 52.7 14.4 54.7 19.5 54.7 ct 22.4 54.7 l 
25.5 54.1 l  p ef
pom
pum
2595.1 1119.4 t 
4.29999 58.4 m  4.29999 27 l  10 27 l  10 32.89999 l  10.8 30.9 11.7 29.5 12.7 28.6 ct 
14 27.2 15.6 26.5 17.5 26.5 ct 17.9 26.5 18.4 26.5 19.2 26.6 ct 
19.2 31.9 l  18.1 31.5 17.3 31.4 16.69999 31.4 ct 
14.6 31.4 12.3 33.5 10 37.8 ct 10 58.4 l  p ef
pom
pum
2615.4 1119.4 t 
10 69.7 m  4.29999 69.7 l  4.29999 27 l  10 27 l  10 32.89999 l 
11 31 12.2 29.5 13.4 28.6 ct 15 27.2 17 26.5 19.4 26.5 ct 
22.6 26.5 25.2 27.8 27.2 30.6 ct 29.2 33.39999 30.1 37.2 30.1 41.9 ct 
30.1 47.3 28.8 51.5 26.3 54.6 ct 23.7 57.6 20.1 59.1 15.4 59.1 ct 
13.7 59.1 11.8 58.9 10 58.4 ct p
10 38.1 m  10 54 l  12.6 54.5 14.6 54.7 15.9 54.7 ct 
21.3 54.7 24 50.7 24 42.5 ct 24 38.9 23.5 36.2 22.4 34.3 ct 
21.4 32.3 20 31.4 18.1 31.4 ct 15.7 31.4 l 
13 33.6 l  p ef
pom
pum
2648.5 1119.4 t 
4.29999 58.4 m  4.29999 27 l  10 27 l  10 32.89999 l  10.8 30.9 11.7 29.5 12.7 28.6 ct 
14 27.2 15.6 26.5 17.5 26.5 ct 17.9 26.5 18.4 26.5 19.2 26.6 ct 
19.2 31.9 l  18.1 31.5 17.3 31.4 16.69999 31.4 ct 
14.6 31.4 12.3 33.5 10 37.8 ct 10 58.4 l  p ef
pom
gr
1.000 1.000 0.800 c 2420.5 1213 m  2479.3 1213 l  2479.3 1271.8 l 
2420.5 1271.8 l  2420.5 1213 l  p ef
0.003 0.003 0.003 c 2449.9 1271.8 m  2420.5 1271.8 l  2420.5 1213 l 
2479.3 1213 l  2479.3 1271.8 l  2449.9 1271.8 l 
ps
gs
pum
2500.3 1206.7 t 
3.2 57.2 m  3.2 52 l  7 53.9 10.6 54.7 13.7 54.7 ct 
18.1 54.7 20.3 53.2 20.3 50.1 ct 20.3 48.1 18.8 46.5 15.7 45.5 ct 
10.7 43.9 l  5.8 42.2 3.4 39.3 3.4 35.1 ct 
3.4 29.3 7.4 26.5 15.3 26.5 ct 17.6 26.5 20.3 26.7 23.6 27.3 ct 
23.6 32.1 l  20.7 31.2 17.9 30.7 14.9 30.7 ct 
11 30.7 9 32 9 34.6 ct 9 36.5 10.3 37.8 13 38.7 ct 
17.6 40.1 l  23.2 42 26 45.2 26 49.7 ct 26 52.5 24.9 54.8 22.7 56.5 ct 
20.4 58.1 17.4 59.1 13.5 59.1 ct 10.6 59.1 l 
7 58.4 l  p ef
pom
pum
2529.9 1206.7 t 
22.6 58.4 m  22.6 52.5 l  21.2 54.4 19.7 55.9 18.4 56.8 ct 
16.4 58.4 14.3 59.1 12 59.1 ct 6.7 59.1 4 55.9 4 49.5 ct 
4 27 l  9.6 27 l  9.6 47.7 l  9.6 50.3 9.8 51.9 10.4 52.8 ct 
10.9 53.7 12 54.1 13.4 54.1 ct 16.6 54.1 19.5 51.9 22.6 47.3 ct 
22.6 27 l  28.2 27 l  28.2 58.4 l  p ef
pom
pum
2562.1 1206.7 t 
4.29999 58.4 m  4.29999 27 l  10 27 l  10 32.89999 l  11.4 31 12.8 29.5 14.1 28.6 ct 
16.1 27.2 18.3 26.5 20.7 26.5 ct 25.9 26.5 28.6 29.5 28.6 35.89999 ct 
28.6 58.4 l  22.9 58.4 l  22.9 37.8 l  22.9 35.2 22.6 33.5 22.1 32.6 ct 
21.5 31.8 20.6 31.3 19.2 31.3 ct 16 31.3 12.9 33.5 10 38.1 ct 
10 58.4 l  p ef
pom
pum
2595.1 1206.7 t 
pom
pum
2612.1 1206.7 t 
-4.29999 69.5 m  -4.29999 65 l  -2.8 65.7 -1.4 66.2 -0.1 66.2 ct 
1.6 66.2 2.8 65.4 3.2 64 ct 3.6 62.9 3.7 61 3.7 58.4 ct 
3.7 27 l  9.4 27 l  9.4 58.4 l  9.4 66.4 6.3 70.4 0.2 70.4 ct 
-1.2 70.4 l  -2.9 70 l  p
3.7 21.4 m  3.7 15.7 l  9.4 15.7 l  9.4 21.4 l 
p ef
pom
pum
2624.8 1206.7 t 
22.6 47.3 m  22.6 31.4 l  19.9 30.9 17.9 30.7 16.69999 30.7 ct 
11.3 30.7 8.5 34.8 8.5 43.1 ct 8.5 46.5 9 49.1 10.1 51.1 ct 
11.1 53.1 12.6 54 14.4 54 ct 16.8 54 l  19.5 51.8 l 
p
22.6 52.5 m  21.5 54.5 20.3 55.9 19.2 57 ct 
17.5 58.4 15.5 59.1 13.1 59.1 ct 10 59.1 7.4 57.7 5.4 54.7 ct 
3.4 52 2.4 48.2 2.4 43.5 ct 2.4 38.1 3.6 33.89999 6.2 30.9 ct 
8.8 27.9 12.4 26.5 17 26.5 ct 18.9 26.5 20.7 26.6 22.6 27 ct 
22.6 12.9 l  28.2 12.9 l  28.2 58.4 l  22.6 58.4 l 
p ef
pom
pum
2657.8 1206.7 t 
4.29999 58.4 m  4.29999 12.9 l  10 12.9 l  10 42.2 l 
20.4 27 l  25.9 27 l  15.9 41.9 l  28.8 58.4 l 
22 58.4 l  10 42.4 l  10 58.4 l  p ef
pom
pum
2687.4 1206.7 t 
pom
pum
2704.3 1206.7 t 
6.5 58.4 m  6.5 54 l  15 54 l  15 20.4 l  6.5 22.6 l 
6.5 18.19999 l  20.7 14.7 l  20.7 54 l  29.3 54 l 
29.3 58.4 l  p ef
pom
pum
2737.4 1206.7 t 
4.5 58.4 m  4.5 51.2 l  11.6 51.2 l  11.6 58.4 l 
p ef
pom
pum
2753.5 1206.7 t 
19.6 58.4 m  19.6 46.2 l  0.8 46.2 l  0.8 42 l 
19.6 15.7 l  25 15.7 l  25 41.7 l  30.7 41.7 l 
30.7 46.2 l  25 46.2 l  25 58.4 l  p
6.3 41.7 m  20.1 41.7 l  20.1 22.7 l  p ef
pom
gr
1264.63227 1264.63227 t 
-1264.63227 -1264.63227 m -57822.57222 -1264.63227 l -57822.57222 -40476.19886 l -1264.63227 -40476.19886 l -1264.63227 -1264.63227 l
eoclip newpath
gr
63.5 63.5 m 2903.4 63.5 l 2903.4 2032.4 l 63.5 2032.4 l 63.5 63.5 l
eoclip newpath
gr
gr
0 1969 t 
pom
count op_count sub {pop} repeat countdictstack dict_count sub {end} repeat b4_inc_state restore
%%PageTrailer
%%Trailer
%%EOF
