(JNukeThread (num 0) (alive) (ready_to_run) (assigned))
(JNukeMethodEvent Test5Main.main (methodstart) (vmState "Test5Main.main ([Ljava/lang/String;)V" (pc 0) (thread 0)))
(JNukeRByteCode 0 "r1 = New" "Test5Main" (line 9))
(JNukeRByteCode 1 "r2 = Get" r1 (line 9))
(JNukeMethodEvent Test5Main.<init> (methodstart) (vmState "Test5Main.<init> ()V" (pc 0) (thread 0)))
(JNukeRByteCode 2 "     InvokeSpecial" (JNukeMethod "Test5Main.<init>" (JNukeSignature "V" (JNukeVector))) r2 (line 9))
(JNukeRByteCode 0 "r1 = Get" r0 (line 1))
(JNukeRByteCode 1 "     InvokeSpecial" (JNukeMethod "java/lang/Object.<init>" (JNukeSignature "V" (JNukeVector))) r1 (line 1))
(JNukeMethodEvent Test5Main.<init> (methodend) (vmState "Test5Main.<init> ()V" (line 1) (pc 2) (thread 0)))
(JNukeRByteCode 2 "     Return" void (line 1))
(JNukeLockAccess (JNukeLockInfo "Test5Main") (vmState "Test5Main.sync ()V" (line 5) (pc 3) (thread 0)))
(JNukeMethodEvent Test5Main.sync (methodstart) (vmState "Test5Main.sync ()V" (pc 0) (thread 0)))
(JNukeRByteCode 3 "     InvokeVirtual" (JNukeMethod "Test5Main.sync" (JNukeSignature "V" (JNukeVector))) r1 (line 9))
(JNukeRByteCode 0 "r3 = Get" r0 (line 5))
(JNukeRByteCode 1 "r4 = Get" r3 (line 5))
(JNukeRByteCode 2 "r1 = Get" r4 (line 5))
(JNukeLockAccess (JNukeLockInfo "Test5Main") (vmState "Test5Main.sync ()V" (line 5) (pc 3) (thread 0)))
(JNukeRByteCode 3 "     MonitorEnter" r3 (line 5))
(JNukeRByteCode 4 "r3 = Get" r0 (line 5))
(JNukeLockAccess (JNukeLockInfo "Test5Main") (vmState "Test5Main.sync2 ()V" (line 2) (pc 5) (thread 0)))
(JNukeMethodEvent Test5Main.sync2 (methodstart) (vmState "Test5Main.sync2 ()V" (pc 0) (thread 0)))
(JNukeRByteCode 5 "     InvokeVirtual" (JNukeMethod "Test5Main.sync2" (JNukeSignature "V" (JNukeVector))) r3 (line 5))
(JNukeMethodEvent Test5Main.sync2 (methodend) (vmState "Test5Main.sync2 ()V" (line 2) (pc 0) (thread 0)))
(JNukeLockAccess (JNukeLockInfo "Test5Main") (vmState "Test5Main.sync ()V" (line 5) (pc 6) (thread 0)))
(JNukeRByteCode 0 "     Return" void (line 2))
(JNukeRByteCode 6 "r3 = Get" r1 (line 5))
(JNukeLockAccess (JNukeLockInfo "Test5Main") (vmState "Test5Main.sync ()V" (line 5) (pc 8) (thread 0)))
(JNukeRByteCode 7 "     MonitorExit" r3 (line 5))
(JNukeRByteCode 8 "     Goto" 14 (line 5))
(JNukeMethodEvent Test5Main.sync (methodend) (vmState "Test5Main.sync ()V" (line 6) (pc 14) (thread 0)))
(JNukeLockAccess (JNukeLockInfo "Test5Main") (vmState "Test5Main.main ([Ljava/lang/String;)V" (line 9) (pc 4) (thread 0)))
(JNukeRByteCode 14 "     Return" void (line 6))
(JNukeMethodEvent Test5Main.main (methodend) (vmState "Test5Main.main ([Ljava/lang/String;)V" (line 10) (pc 4) (thread 0)))
(JNukeRByteCode 4 "     Return" void (line 10))
