%!PS-Adobe-2.0 EPSF-2.0
%%Title: alignment.dia
%%Creator: Dia v0.90
%%CreationDate: Wed Feb 26 15:31:01 2003
%%For: pascal
%%Magnification: 1.0000
%%Orientation: Portrait
%%BoundingBox: 0 0 1143 169
%%Pages: 1
%%EndComments
%%BeginProlog
/cp {closepath} bind def
/c {curveto} bind def
/f {fill} bind def
/a {arc} bind def
/ef {eofill} bind def
/ex {exch} bind def
/gr {grestore} bind def
/gs {gsave} bind def
/sa {save} bind def
/rs {restore} bind def
/l {lineto} bind def
/m {moveto} bind def
/rm {rmoveto} bind def
/n {newpath} bind def
/s {stroke} bind def
/sh {show} bind def
/slc {setlinecap} bind def
/slj {setlinejoin} bind def
/slw {setlinewidth} bind def
/srgb {setrgbcolor} bind def
/rot {rotate} bind def
/sc {scale} bind def
/sd {setdash} bind def
/ff {findfont} bind def
/sf {setfont} bind def
/scf {scalefont} bind def
/sw {stringwidth pop} bind def
/tr {translate} bind def

/ellipsedict 8 dict def
ellipsedict /mtrx matrix put
/ellipse
{ ellipsedict begin
   /endangle exch def
   /startangle exch def
   /yrad exch def
   /xrad exch def
   /y exch def
   /x exch def   /savematrix mtrx currentmatrix def
   x y tr xrad yrad sc
   0 0 1 startangle endangle arc
   savematrix setmatrix
   end
} def

/mergeprocs {
dup length
3 -1 roll
dup
length
dup
5 1 roll
3 -1 roll
add
array cvx
dup
3 -1 roll
0 exch
putinterval
dup
4 2 roll
putinterval
} bind def
%%EndProlog

%%BeginSetup
%%EndSetup
28.346000 -28.346000 scale
6.773970 -8.053509 translate

[] 0 sd
0 slj
0.050000 slw
0.000000 0.000000 0.000000 srgb
n 2.350000 2.150000 m 2.350000 2.550000 l s
n 3.343333 2.150000 m 3.343333 2.550000 l s
n 4.336667 2.150000 m 4.336667 2.550000 l s
n 5.330000 2.150000 m 5.330000 2.550000 l s
n 6.323333 2.150000 m 6.323333 2.550000 l s
n 7.316667 2.150000 m 7.316667 2.550000 l s
n 8.310000 2.150000 m 8.310000 2.550000 l s
n 9.303333 2.150000 m 9.303333 2.550000 l s
n 10.296667 2.150000 m 10.296667 2.550000 l s
n 11.290000 2.150000 m 11.290000 2.550000 l s
n 12.283333 2.150000 m 12.283333 2.550000 l s
n 13.276667 2.150000 m 13.276667 2.550000 l s
n 14.270000 2.150000 m 14.270000 2.550000 l s
n 15.263333 2.150000 m 15.263333 2.550000 l s
n 16.256667 2.150000 m 16.256667 2.550000 l s
n 17.250000 2.150000 m 17.250000 2.550000 l s
n 18.243333 2.150000 m 18.243333 2.550000 l s
n 19.236667 2.150000 m 19.236667 2.550000 l s
n 20.230000 2.150000 m 20.230000 2.550000 l s
n 21.223333 2.150000 m 21.223333 2.550000 l s
n 22.216667 2.150000 m 22.216667 2.550000 l s
n 23.210000 2.150000 m 23.210000 2.550000 l s
n 24.203333 2.150000 m 24.203333 2.550000 l s
n 25.196667 2.150000 m 25.196667 2.550000 l s
n 26.190000 2.150000 m 26.190000 2.550000 l s
n 27.183333 2.150000 m 27.183333 2.550000 l s
n 28.176667 2.150000 m 28.176667 2.550000 l s
n 29.170000 2.150000 m 29.170000 2.550000 l s
n 30.163333 2.150000 m 30.163333 2.550000 l s
n 31.156667 2.150000 m 31.156667 2.550000 l s
n 32.150000 2.150000 m 32.150000 2.550000 l s
0.100000 slw
n 2.350000 2.150000 m 2.350000 3.350000 l s
 [ /xi /xi /xi /xi /xi /xi /xi /xi /xi /xi /xi /xi /xi /xi /xi /xi
 /xi /xi /xi /xi /xi /xi /xi /xi /xi /xi /xi /xi /xi /xi /xi /xi
 /zero /four /eight /one /two /six /hyphen /b /xi /xi /y /t /e /space /a /l
 /i /g /n /m /c /xi /xi /xi /xi /xi /xi /xi /xi /xi /xi /xi
 /xi /xi /xi /xi /xi /xi /xi /xi /xi /xi /xi /xi /xi /xi /xi /xi
 /xi /xi /xi /xi /xi /xi /xi /xi /xi /xi /xi /xi /xi /xi /xi /xi
 /xi /xi /xi /xi /xi /xi /xi /xi /xi /xi /xi /xi /xi /xi /xi /xi
 /xi /xi /xi /xi /xi /xi /xi /xi /xi /xi /xi /xi /xi /xi /xi /xi
 /xi /xi /xi /xi /xi /xi /xi /xi /xi /xi /xi /xi /xi /xi /xi /xi
 /xi /xi /xi /xi /xi /xi /xi /xi /xi /xi /xi /xi /xi /xi /xi /xi
 /xi /xi /xi /xi /xi /xi /xi /xi /xi /xi /xi /xi /xi /xi /xi /xi
 /xi /xi /xi /xi /xi /xi /xi /xi /xi /xi /xi /xi /xi /xi /xi /xi
 /xi /xi /xi /xi /xi /xi /xi /xi /xi /xi /xi /xi /xi /xi /xi /xi
 /xi /xi /xi /xi /xi /xi /xi /xi /xi /xi /xi /xi /xi /xi /xi /xi
 /xi /xi /xi /xi /xi /xi /xi /xi /xi /xi /xi /xi /xi /xi /xi /xi
 /xi /xi /xi /xi /xi /xi /xi /xi /xi /xi /xi /xi /xi /xi /xi /xi
] /e0 exch def
/Helvetica_e0 undefinefont
/Helvetica_e0
  /Helvetica findfont
  dup length dict begin
  {1 index /FID ne {def} {pop pop} ifelse} forall
  /Encoding e0 def
  currentdict end
definefont pop
/Helvetica_e0 ff 1.000000 scf sf
( ) sw
2 div 2.350000 ex sub 4.095614 m ( )
 gs 1 -1 sc sh gr
n 6.323333 2.150000 m 6.323333 3.350000 l s
(!) sw
2 div 6.323333 ex sub 4.095614 m (!)
 gs 1 -1 sc sh gr
n 10.296667 2.150000 m 10.296667 3.350000 l s
(") sw
2 div 10.296667 ex sub 4.095614 m (")
 gs 1 -1 sc sh gr
n 14.270000 2.150000 m 14.270000 3.350000 l s
(#$) sw
2 div 14.270000 ex sub 4.095614 m (#$)
 gs 1 -1 sc sh gr
n 18.243333 2.150000 m 18.243333 3.350000 l s
(#%) sw
2 div 18.243333 ex sub 4.095614 m (#%)
 gs 1 -1 sc sh gr
n 22.216667 2.150000 m 22.216667 3.350000 l s
($ ) sw
2 div 22.216667 ex sub 4.095614 m ($ )
 gs 1 -1 sc sh gr
n 26.190000 2.150000 m 26.190000 3.350000 l s
($!) sw
2 div 26.190000 ex sub 4.095614 m ($!)
 gs 1 -1 sc sh gr
n 30.163333 2.150000 m 30.163333 3.350000 l s
($") sw
2 div 30.163333 ex sub 4.095614 m ($")
 gs 1 -1 sc sh gr
n 2.350000 2.150000 m 32.150000 2.150000 l s
0.807843 0.807843 0.807843 srgb
n 2.350000 4.990000 m 2.350000 5.990000 l 6.350000 5.990000 l 6.350000 4.990000 l f
0.100000 slw
[] 0 sd
[] 0 sd
0 slj
0.000000 0.000000 0.000000 srgb
n 2.350000 4.990000 m 2.350000 5.990000 l 6.350000 5.990000 l 6.350000 4.990000 l cp s
0.807843 0.807843 0.807843 srgb
n 10.220000 4.990000 m 10.220000 5.990000 l 18.350000 5.990000 l 18.350000 4.990000 l f
0.100000 slw
[] 0 sd
[] 0 sd
0 slj
0.000000 0.000000 0.000000 srgb
n 10.220000 4.990000 m 10.220000 5.990000 l 18.350000 5.990000 l 18.350000 4.990000 l cp s
0.807843 0.807843 0.807843 srgb
n 6.320000 4.990000 m 6.320000 5.990000 l 10.320000 5.990000 l 10.320000 4.990000 l f
0.100000 slw
[] 0 sd
[] 0 sd
0 slj
0.000000 0.000000 0.000000 srgb
n 6.320000 4.990000 m 6.320000 5.990000 l 10.320000 5.990000 l 10.320000 4.990000 l cp s
/Courier_e0 undefinefont
/Courier_e0
  /Courier findfont
  dup length dict begin
  {1 index /FID ne {def} {pop pop} ifelse} forall
  /Encoding e0 def
  currentdict end
definefont pop
/Courier_e0 ff 0.800000 scf sf
(!&'*+,-./0123,2+) sw
2 div -2.500000 ex sub 5.750000 m (!&'*+,-./0123,2+)
 gs 1 -1 sc sh gr
0.807843 0.807843 0.807843 srgb
n 2.291230 6.990000 m 2.291230 7.990000 l 6.291230 7.990000 l 6.291230 6.990000 l f
0.100000 slw
[] 0 sd
[] 0 sd
0 slj
0.000000 0.000000 0.000000 srgb
n 2.291230 6.990000 m 2.291230 7.990000 l 6.291230 7.990000 l 6.291230 6.990000 l cp s
0.807843 0.807843 0.807843 srgb
n 18.361200 6.990000 m 18.361200 7.990000 l 26.491200 7.990000 l 26.491200 6.990000 l f
0.100000 slw
[] 0 sd
[] 0 sd
0 slj
0.000000 0.000000 0.000000 srgb
n 18.361200 6.990000 m 18.361200 7.990000 l 26.491200 7.990000 l 26.491200 6.990000 l cp s
0.807843 0.807843 0.807843 srgb
n 10.161200 6.990000 m 10.161200 7.990000 l 14.161200 7.990000 l 14.161200 6.990000 l f
0.100000 slw
[] 0 sd
[] 0 sd
0 slj
0.000000 0.000000 0.000000 srgb
n 10.161200 6.990000 m 10.161200 7.990000 l 14.161200 7.990000 l 14.161200 6.990000 l cp s
/Courier_e0 ff 0.800000 scf sf
("&'*+,-./0123,2+) sw
2 div -2.558770 ex sub 7.750000 m ("&'*+,-./0123,2+)
 gs 1 -1 sc sh gr
/Courier_e0 ff 0.800000 scf sf
(.) sw
2 div 4.388430 ex sub 5.650000 m (.)
 gs 1 -1 sc sh gr
/Courier_e0 ff 0.800000 scf sf
(.) sw
2 div 4.288430 ex sub 7.650000 m (.)
 gs 1 -1 sc sh gr
/Courier_e0 ff 0.800000 scf sf
(') sw
2 div 8.388430 ex sub 5.750000 m (')
 gs 1 -1 sc sh gr
/Courier_e0 ff 0.800000 scf sf
(') sw
2 div 12.188400 ex sub 7.750000 m (')
 gs 1 -1 sc sh gr
/Courier_e0 ff 0.800000 scf sf
(4) sw
2 div 14.388400 ex sub 5.750000 m (4)
 gs 1 -1 sc sh gr
/Courier_e0 ff 0.800000 scf sf
(4) sw
2 div 22.424000 ex sub 7.736490 m (4)
 gs 1 -1 sc sh gr
showpage
