(classPool
(JNukeClass "Dup2_2" "Dup2_2.java"
  (JNukeVar "[J" "a")
  (JNukeVar "J" "f")
  (JNukeMethod "Dup2_2.<init>" (JNukeSignature "V" (JNukeVector))
  (JNukeByteCodes
    (JNukeAByteCode 0 "Load" ref 0x0 (line 1))
    (JNukeAByteCode 1 "InvokeSpecial" (JNukeMethod "java/lang/Object.<init>" (JNukeSignature "V" (JNukeVector))))
    (JNukeAByteCode 2 "Return" void)
))
  (JNukeMethod "Dup2_2.test" (JNukeSignature "J" (JNukeVector "I" "J"))
  (JNukeByteCodes
    (JNukeAByteCode 0 "Load" ref 0x0 (line 6))
    (JNukeAByteCode 1 "GetField" "Dup2_2" (pair "a" "[J"))
    (JNukeAByteCode 2 "Load" int 0x1)
    (JNukeAByteCode 3 "Load" ref 0x0)
    (JNukeAByteCode 4 "Load" long 0x2)
    (JNukeAByteCode 5 "Dupx" 0x2 0x1)
    (JNukeAByteCode 6 "PutField" "Dup2_2" (pair "f" "J"))
    (JNukeAByteCode 7 "Dupx" 0x2 0x2)
    (JNukeAByteCode 8 "AStore" long)
    (JNukeAByteCode 9 "Return" long)
))
)
)
