#FIG 3.2
Landscape
Center
Metric
A4      
100.00
Single
-2
1200 2
0 32 #404040
0 33 #808080
0 34 #c0c0c0
0 35 #e0e0e0
0 36 #808080
0 37 #c0c0c0
0 38 #e0e0e0
0 39 #444444
0 40 #8e8f8e
2 3 0 2 0 11 50 0 -1 0.000 0 0 -1 0 0 4
	 2025 1125 2700 2925 1350 2925 2025 1125
2 2 0 2 0 11 60 0 20 0.000 0 0 -1 0 0 5
	 1800 1125 2250 1125 2250 1575 1800 1575 1800 1125
2 2 0 2 0 11 60 0 20 0.000 0 0 -1 0 0 5
	 1665 1575 2385 1575 2385 2025 1665 2025 1665 1575
2 2 0 2 0 11 60 0 20 0.000 0 0 -1 0 0 5
	 1350 2475 2700 2475 2700 2925 1350 2925 1350 2475
2 2 0 2 0 11 60 0 20 0.000 0 0 -1 0 0 5
	 1485 2025 2565 2025 2565 2475 1485 2475 1485 2025
