(classPool
(JNukeClass "TCFNested2" "TCFNested2.java"
  (JNukeMethod "TCFNested2.<init>" (JNukeSignature "V" (JNukeVector))
  (JNukeByteCodes
    (JNukeAByteCode 0 "Load" ref 0x0 (line 1))
    (JNukeAByteCode 1 "InvokeSpecial" (JNukeMethod "java/lang/Object.<init>" (JNukeSignature "V" (JNukeVector))))
    (JNukeAByteCode 2 "Return" void)
))
  (JNukeMethod "TCFNested2.m" (JNukeSignature "V" (JNukeVector "Z"))
  (JNukeEHandlers
    (JNukeEHandlerDesc (JNukeMethod "TCFNested2.m" (JNukeSignature "V" (JNukeVector "Z"))) "java/lang/Exception" 0 1 8)
    (JNukeEHandlerDesc (JNukeMethod "TCFNested2.m" (JNukeSignature "V" (JNukeVector "Z"))) "java/lang/Exception" 4 4 8)
    (JNukeEHandlerDesc (JNukeMethod "TCFNested2.m" (JNukeSignature "V" (JNukeVector "Z"))) "java/lang/Exception" 11 12 16)
    (JNukeEHandlerDesc (JNukeMethod "TCFNested2.m" (JNukeSignature "V" (JNukeVector "Z"))) "<Any exception>" 11 12 22)
    (JNukeEHandlerDesc (JNukeMethod "TCFNested2.m" (JNukeSignature "V" (JNukeVector "Z"))) "<Any exception>" 15 18 22)
    (JNukeEHandlerDesc (JNukeMethod "TCFNested2.m" (JNukeSignature "V" (JNukeVector "Z"))) "<Any exception>" 21 21 22)
    (JNukeEHandlerDesc (JNukeMethod "TCFNested2.m" (JNukeSignature "V" (JNukeVector "Z"))) "<Any exception>" 0 1 30)
    (JNukeEHandlerDesc (JNukeMethod "TCFNested2.m" (JNukeSignature "V" (JNukeVector "Z"))) "<Any exception>" 4 4 30)
    (JNukeEHandlerDesc (JNukeMethod "TCFNested2.m" (JNukeSignature "V" (JNukeVector "Z"))) "<Any exception>" 7 26 30)
    (JNukeEHandlerDesc (JNukeMethod "TCFNested2.m" (JNukeSignature "V" (JNukeVector "Z"))) "<Any exception>" 29 29 30)
  )
  (JNukeByteCodes
    (JNukeAByteCode 0 "Load" int 0x1 (line 4))
    (JNukeAByteCode 1 "Cond" ifeq 5)
      (JNukeAByteCode 2 "Const" int 0 (line 15))
      (JNukeAByteCode 3 "Store" int 0x1)
    (JNukeAByteCode 4 "Return" void (line 4))
      (JNukeAByteCode 5 "Const" int 0 (line 15))
      (JNukeAByteCode 6 "Store" int 0x1)
    (JNukeAByteCode 7 "Goto" 35 (line 4))
    (JNukeAByteCode 8 "Store" ref 0x2 (line 6))
    (JNukeAByteCode 9 "Const" int 1)
    (JNukeAByteCode 10 "Store" int 0x1)
    (JNukeAByteCode 11 "Const" int 0 (line 8))
    (JNukeAByteCode 12 "Store" int 0x1)
      (JNukeAByteCode 13 "Const" int 0 (line 12))
      (JNukeAByteCode 14 "Store" int 0x1)
    (JNukeAByteCode 15 "Goto" 27 (line 8))
    (JNukeAByteCode 16 "Store" ref 0x3 (line 10))
    (JNukeAByteCode 17 "Const" int 1)
    (JNukeAByteCode 18 "Store" int 0x1)
      (JNukeAByteCode 19 "Const" int 0 (line 12))
      (JNukeAByteCode 20 "Store" int 0x1)
    (JNukeAByteCode 21 "Goto" 27 (line 10))
    (JNukeAByteCode 22 "Store" ref 0x4 (line 12))
      (JNukeAByteCode 23 "Const" int 0)
      (JNukeAByteCode 24 "Store" int 0x1)
    (JNukeAByteCode 25 "Load" ref 0x4)
    (JNukeAByteCode 26 "Athrow")
      (JNukeAByteCode 27 "Const" int 0 (line 15))
      (JNukeAByteCode 28 "Store" int 0x1)
    (JNukeAByteCode 29 "Goto" 35 (line 12))
    (JNukeAByteCode 30 "Store" ref 0x6 (line 15))
      (JNukeAByteCode 31 "Const" int 0)
      (JNukeAByteCode 32 "Store" int 0x1)
    (JNukeAByteCode 33 "Load" ref 0x6)
    (JNukeAByteCode 34 "Athrow")
    (JNukeAByteCode 35 "Return" void (line 17))
))
)
)
