(classPool
(JNukeClass "Consts" "Consts.java"
  (JNukeMethod "Consts.<init>" (JNukeSignature "V" (JNukeVector))
  (JNukeByteCodes
    (JNukeAByteCode 0 "Load" ref 0x0 (line 3))
    (JNukeAByteCode 1 "InvokeSpecial" (JNukeMethod "java/lang/Object.<init>" (JNukeSignature "V" (JNukeVector))))
    (JNukeAByteCode 2 "Const" long 1 (line 8))
    (JNukeAByteCode 3 "Store" long 0x1)
    (JNukeAByteCode 4 "Const" float 2 (line 9))
    (JNukeAByteCode 5 "Store" float 0x6)
    (JNukeAByteCode 6 "Const" int -1 (line 10))
    (JNukeAByteCode 7 "Store" int 0x3)
    (JNukeAByteCode 8 "Const" int 4 (line 11))
    (JNukeAByteCode 9 "Store" int 0x4)
    (JNukeAByteCode 10 "Const" int 5 (line 12))
    (JNukeAByteCode 11 "Store" int 0x5)
    (JNukeAByteCode 12 "GetStatic" "java/lang/System" (pair "out" "Ljava/io/PrintStream;") (line 13))
    (JNukeAByteCode 13 "Load" long 0x1)
    (JNukeAByteCode 14 "InvokeVirtual" (JNukeMethod "java/io/PrintStream.println" (JNukeSignature "V" (JNukeVector "J"))))
    (JNukeAByteCode 15 "Return" void (line 14))
))
)
)
