(classPool
(JNukeClass "javaIncrement" "javaIncrement.java"
  (JNukeMethod "javaIncrement.<init>" (JNukeSignature "V" (JNukeVector))
  (JNukeByteCodes
    (JNukeAByteCode 0 "Load" ref 0x0 (line 1))
    (JNukeAByteCode 1 "InvokeSpecial" (JNukeMethod "java/lang/Object.<init>" (JNukeSignature "V" (JNukeVector))))
    (JNukeAByteCode 2 "Return" void)
))
  (JNukeMethod "javaIncrement.javaIncrement" (JNukeSignature "[I" (JNukeVector "[I"))
  (JNukeByteCodes
    (JNukeAByteCode 0 "Const" int 0 (line 4))
    (JNukeAByteCode 1 "Store" int 0x2)
    (JNukeAByteCode 2 "Const" int 0 (line 5))
    (JNukeAByteCode 3 "Store" int 0x3)
    (JNukeAByteCode 4 "Load" ref 0x1 (line 6))
    (JNukeAByteCode 5 "ArrayLength")
    (JNukeAByteCode 6 "Const" int 1)
    (JNukeAByteCode 7 "Prim" isub)
    (JNukeAByteCode 8 "Store" int 0x4)
    (JNukeAByteCode 9 "Goto" 20)
    (JNukeAByteCode 10 "Load" ref 0x1 (line 7))
    (JNukeAByteCode 11 "Load" int 0x4)
    (JNukeAByteCode 12 "Dupx" 0x2 0x0)
    (JNukeAByteCode 13 "ALoad" int)
    (JNukeAByteCode 14 "Const" int 1)
    (JNukeAByteCode 15 "Prim" iadd)
    (JNukeAByteCode 16 "Dupx" 0x1 0x2)
    (JNukeAByteCode 17 "AStore" int)
    (JNukeAByteCode 18 "Store" int 0x3)
    (JNukeAByteCode 19 "Inc" l4 0xffffffff (line 6))
    (JNukeAByteCode 20 "Load" int 0x4)
    (JNukeAByteCode 21 "Cond" iflt 24)
    (JNukeAByteCode 22 "Load" int 0x3)
    (JNukeAByteCode 23 "Cond" ifeq 10)
    (JNukeAByteCode 24 "Load" int 0x3 (line 8))
    (JNukeAByteCode 25 "Cond" ifne 36)
    (JNukeAByteCode 26 "Load" ref 0x1 (line 9))
    (JNukeAByteCode 27 "ArrayLength")
    (JNukeAByteCode 28 "Const" int 1)
    (JNukeAByteCode 29 "Prim" iadd)
    (JNukeAByteCode 30 "NewArray" int 0x1)
    (JNukeAByteCode 31 "Store" ref 0x1)
    (JNukeAByteCode 32 "Load" ref 0x1 (line 10))
    (JNukeAByteCode 33 "Const" int 0)
    (JNukeAByteCode 34 "Const" int 1)
    (JNukeAByteCode 35 "AStore" int)
    (JNukeAByteCode 36 "Load" ref 0x1 (line 12))
    (JNukeAByteCode 37 "Return" ref)
))
)
)
