#FIG 3.2
Landscape
Center
Inches
Letter  
100.00
Single
-2
1200 2
2 2 0 1 0 7 50 0 -1 0.000 0 0 -1 0 0 5
	 600 1575 975 1575 975 1950 600 1950 600 1575
2 2 0 1 0 7 50 0 -1 0.000 0 0 -1 0 0 5
	 1650 2400 1425 2400 1425 2775 1650 2775 1650 2400
2 2 0 1 0 7 50 0 -1 0.000 0 0 -1 0 0 5
	 1650 3225 1425 3225 1425 3600 1650 3600 1650 3225
2 2 0 1 0 7 50 0 -1 0.000 0 0 -1 0 0 5
	 1650 4050 1425 4050 1425 4425 1650 4425 1650 4050
2 2 0 1 0 7 50 0 -1 0.000 0 0 -1 0 0 5
	 1650 2400 2025 2400 2025 2775 1650 2775 1650 2400
2 2 0 1 0 7 50 0 -1 0.000 0 0 -1 0 0 5
	 2025 2400 2400 2400 2400 2775 2025 2775 2025 2400
2 2 0 1 0 7 50 0 -1 0.000 0 0 -1 0 0 5
	 2400 2400 2775 2400 2775 2775 2400 2775 2400 2400
2 2 0 1 0 7 50 0 -1 0.000 0 0 -1 0 0 5
	 1650 3225 2025 3225 2025 3600 1650 3600 1650 3225
2 2 0 1 0 7 50 0 -1 0.000 0 0 -1 0 0 5
	 2025 3225 2400 3225 2400 3600 2025 3600 2025 3225
2 2 0 1 0 7 50 0 -1 0.000 0 0 -1 0 0 5
	 2400 3225 2775 3225 2775 3600 2400 3600 2400 3225
2 2 0 1 0 7 50 0 -1 0.000 0 0 -1 0 0 5
	 1650 4050 2025 4050 2025 4425 1650 4425 1650 4050
2 2 0 1 0 7 50 0 -1 0.000 0 0 -1 0 0 5
	 2025 4050 2400 4050 2400 4425 2025 4425 2025 4050
2 1 0 1 0 7 50 0 -1 0.000 0 0 -1 1 0 2
	1 1 1.00 60.00 120.00
	 1800 2625 1800 3225
2 1 0 1 0 7 50 0 -1 0.000 0 0 -1 1 0 2
	1 1 1.00 60.00 120.00
	 2550 3375 2550 2775
2 1 0 1 0 7 50 0 -1 0.000 0 0 -1 1 0 2
	1 1 1.00 60.00 120.00
	 1800 3450 1800 4050
2 2 0 1 0 7 50 0 -1 0.000 0 0 -1 0 0 5
	 2400 4050 2775 4050 2775 4425 2400 4425 2400 4050
2 1 0 1 0 7 50 0 -1 0.000 0 0 -1 1 0 2
	1 1 1.00 60.00 120.00
	 2550 4200 2550 3600
2 1 0 1 0 7 50 0 -1 0.000 0 0 -1 1 0 2
	1 1 1.00 60.00 120.00
	 862 1837 1425 2400
4 0 0 50 0 0 12 0.0000 4 135 90 1500 2650 2\001
4 0 0 50 0 0 12 0.0000 4 135 90 1500 3475 2\001
4 0 0 50 0 0 12 0.0000 4 135 90 1500 4350 1\001
