(classPool
(JNukeClass "NonAtomic" "NonAtomic.java"
  (JNukeVar "I" "i")
  (JNukeMethod "NonAtomic.<init>" (JNukeSignature "V" (JNukeVector))
  (JNukeByteCodes
    (JNukeRByteCode 0 "r0 = Get" l0 (line 1))
    (JNukeRByteCode 1 "     InvokeSpecial" (JNukeMethod "java/lang/Object.<init>" (JNukeSignature "V" (JNukeVector))) r0)
    (JNukeRByteCode 2 "     Return" void)
))
  (JNukeMethod "NonAtomic.inc" (JNukeSignature "V" (JNukeVector))
  (JNukeEHandlers
    (JNukeEHandlerDesc (JNukeMethod "NonAtomic.inc" (JNukeSignature "V" (JNukeVector))) "<Any exception>" 4 8 10)
    (JNukeEHandlerDesc (JNukeMethod "NonAtomic.inc" (JNukeSignature "V" (JNukeVector))) "<Any exception>" 10 12 10)
    (JNukeEHandlerDesc (JNukeMethod "NonAtomic.inc" (JNukeSignature "V" (JNukeVector))) "<Any exception>" 20 24 26)
    (JNukeEHandlerDesc (JNukeMethod "NonAtomic.inc" (JNukeSignature "V" (JNukeVector))) "<Any exception>" 26 28 26)
  )
  (JNukeByteCodes
    (JNukeRByteCode 0 "r0 = Get" l0 (line 6))
    (JNukeRByteCode 1 "r1 = Get" r0)
    (JNukeRByteCode 2 "l2 = Get" r1)
    (JNukeRByteCode 3 "     MonitorEnter" r0)
    (JNukeRByteCode 4 "r0 = Get" l0 (line 7))
    (JNukeRByteCode 5 "r0 = GetField" "NonAtomic" (pair "i" "I") r0)
    (JNukeRByteCode 6 "l1 = Get" r0)
    (JNukeRByteCode 7 "r0 = Get" l2 (line 8))
    (JNukeRByteCode 8 "     MonitorExit" r0)
    (JNukeRByteCode 9 "     Goto" 15)
    (JNukeRByteCode 10 "l3 = Get" r0)
    (JNukeRByteCode 11 "r0 = Get" l2)
    (JNukeRByteCode 12 "     MonitorExit" r0)
    (JNukeRByteCode 13 "r0 = Get" l3)
    (JNukeRByteCode 14 "     Athrow" r0)
    (JNukeRByteCode 15 "     Inc" l1 0x1 (line 9))
    (JNukeRByteCode 16 "r0 = Get" l0 (line 10))
    (JNukeRByteCode 17 "r1 = Get" r0)
    (JNukeRByteCode 18 "l3 = Get" r1)
    (JNukeRByteCode 19 "     MonitorEnter" r0)
    (JNukeRByteCode 20 "r0 = Get" l0 (line 11))
    (JNukeRByteCode 21 "r1 = Get" l1)
    (JNukeRByteCode 22 "     PutField" "NonAtomic" (pair "i" "I") r0 r1)
    (JNukeRByteCode 23 "r0 = Get" l3 (line 12))
    (JNukeRByteCode 24 "     MonitorExit" r0)
    (JNukeRByteCode 25 "     Goto" 31)
    (JNukeRByteCode 26 "l4 = Get" r0)
    (JNukeRByteCode 27 "r0 = Get" l3)
    (JNukeRByteCode 28 "     MonitorExit" r0)
    (JNukeRByteCode 29 "r0 = Get" l4)
    (JNukeRByteCode 30 "     Athrow" r0)
    (JNukeRByteCode 31 "     Return" void (line 13))
))
)
)
