%!PS-Adobe-2.0 EPSF-2.0
%%Title: /home/zboris/semesterarbeit/doku/filerollbackcache.fig
%%Creator: fig2dev Version 3.2 Patchlevel 4
%%CreationDate: Tue Mar 22 23:04:39 2005
%%For: zboris@linux (Boris Z.)
%%BoundingBox: 0 0 772 433
%%Magnification: 1.0000
%%EndComments
/$F2psDict 200 dict def
$F2psDict begin
$F2psDict /mtrx matrix put
/col-1 {0 setgray} bind def
/col0 {0.000 0.000 0.000 srgb} bind def
/col1 {0.000 0.000 1.000 srgb} bind def
/col2 {0.000 1.000 0.000 srgb} bind def
/col3 {0.000 1.000 1.000 srgb} bind def
/col4 {1.000 0.000 0.000 srgb} bind def
/col5 {1.000 0.000 1.000 srgb} bind def
/col6 {1.000 1.000 0.000 srgb} bind def
/col7 {1.000 1.000 1.000 srgb} bind def
/col8 {0.000 0.000 0.560 srgb} bind def
/col9 {0.000 0.000 0.690 srgb} bind def
/col10 {0.000 0.000 0.820 srgb} bind def
/col11 {0.530 0.810 1.000 srgb} bind def
/col12 {0.000 0.560 0.000 srgb} bind def
/col13 {0.000 0.690 0.000 srgb} bind def
/col14 {0.000 0.820 0.000 srgb} bind def
/col15 {0.000 0.560 0.560 srgb} bind def
/col16 {0.000 0.690 0.690 srgb} bind def
/col17 {0.000 0.820 0.820 srgb} bind def
/col18 {0.560 0.000 0.000 srgb} bind def
/col19 {0.690 0.000 0.000 srgb} bind def
/col20 {0.820 0.000 0.000 srgb} bind def
/col21 {0.560 0.000 0.560 srgb} bind def
/col22 {0.690 0.000 0.690 srgb} bind def
/col23 {0.820 0.000 0.820 srgb} bind def
/col24 {0.500 0.190 0.000 srgb} bind def
/col25 {0.630 0.250 0.000 srgb} bind def
/col26 {0.750 0.380 0.000 srgb} bind def
/col27 {1.000 0.500 0.500 srgb} bind def
/col28 {1.000 0.630 0.630 srgb} bind def
/col29 {1.000 0.750 0.750 srgb} bind def
/col30 {1.000 0.880 0.880 srgb} bind def
/col31 {1.000 0.840 0.000 srgb} bind def

end
save
newpath 0 433 moveto 0 0 lineto 772 0 lineto 772 433 lineto closepath clip newpath
-28.3 477.0 translate
1 -1 scale

/cp {closepath} bind def
/ef {eofill} bind def
/gr {grestore} bind def
/gs {gsave} bind def
/sa {save} bind def
/rs {restore} bind def
/l {lineto} bind def
/m {moveto} bind def
/rm {rmoveto} bind def
/n {newpath} bind def
/s {stroke} bind def
/sh {show} bind def
/slc {setlinecap} bind def
/slj {setlinejoin} bind def
/slw {setlinewidth} bind def
/srgb {setrgbcolor} bind def
/rot {rotate} bind def
/sc {scale} bind def
/sd {setdash} bind def
/ff {findfont} bind def
/sf {setfont} bind def
/scf {scalefont} bind def
/sw {stringwidth} bind def
/tr {translate} bind def
/tnt {dup dup currentrgbcolor
  4 -2 roll dup 1 exch sub 3 -1 roll mul add
  4 -2 roll dup 1 exch sub 3 -1 roll mul add
  4 -2 roll dup 1 exch sub 3 -1 roll mul add srgb}
  bind def
/shd {dup dup currentrgbcolor 4 -2 roll mul 4 -2 roll mul
  4 -2 roll mul srgb} bind def
/$F2psBegin {$F2psDict begin /$F2psEnteredState save def} def
/$F2psEnd {$F2psEnteredState restore end} def

$F2psBegin
10 setmiterlimit
0 slj 0 slc
 0.06299 0.06299 sc
%
% Fig objects follow
%
% 
% here starts figure with depth 50
% Polyline
7.500 slw
gs  clippath
6630 6645 m 6630 6585 l 6479 6585 l 6599 6615 l 6479 6645 l cp
eoclip
n 6210 6615 m
 6615 6615 l gs col0 s gr gr

% arrowhead
n 6479 6645 m 6599 6615 l 6479 6585 l 6479 6645 l  cp gs 0.00 setgray ef gr  col0 s
% Polyline
gs  clippath
10410 6645 m 10410 6585 l 10259 6585 l 10379 6615 l 10259 6645 l cp
eoclip
n 9990 6615 m
 10395 6615 l gs col0 s gr gr

% arrowhead
n 10259 6645 m 10379 6615 l 10259 6585 l 10259 6645 l  cp gs 0.00 setgray ef gr  col0 s
% Polyline
 [15 45] 45 sd
n 1440 3870 m 1170 3870 l 1170 7560 l
 1440 7560 l gs col0 s gr  [] 0 sd
% Polyline
gs  clippath
5550 1875 m 5550 1815 l 5399 1815 l 5519 1845 l 5399 1875 l cp
eoclip
n 5130 1845 m
 5535 1845 l gs col0 s gr gr

% arrowhead
n 5399 1875 m 5519 1845 l 5399 1815 l 5399 1875 l  cp gs 0.00 setgray ef gr  col0 s
% Polyline
gs  clippath
7440 1875 m 7440 1815 l 7289 1815 l 7409 1845 l 7289 1875 l cp
eoclip
n 7020 1845 m
 7425 1845 l gs col0 s gr gr

% arrowhead
n 7289 1875 m 7409 1845 l 7289 1815 l 7289 1875 l  cp gs 0.00 setgray ef gr  col0 s
% Polyline
gs  clippath
8175 2775 m 8115 2775 l 8115 2926 l 8145 2806 l 8175 2926 l cp
eoclip
n 8145 3960 m
 8145 2790 l gs col0 s gr gr

% arrowhead
n 8175 2926 m 8145 2806 l 8115 2926 l 8175 2926 l  cp gs 0.00 setgray ef gr  col0 s
% Polyline
gs  clippath
4350 2775 m 4290 2775 l 4290 2926 l 4320 2806 l 4350 2926 l cp
eoclip
n 4320 3960 m
 4320 2790 l gs col0 s gr gr

% arrowhead
n 4350 2926 m 4320 2806 l 4290 2926 l 4350 2926 l  cp gs 0.00 setgray ef gr  col0 s
% Polyline
gs  clippath
6225 4785 m 6285 4785 l 6285 4634 l 6255 4754 l 6225 4634 l cp
eoclip
n 6255 4275 m
 6255 4770 l gs col0 s gr gr

% arrowhead
n 6225 4634 m 6255 4754 l 6285 4634 l 6225 4634 l  cp gs 0.00 setgray ef gr  col0 s
% Polyline
gs  clippath
10005 4785 m 10065 4785 l 10065 4634 l 10035 4754 l 10005 4634 l cp
eoclip
n 10035 4275 m
 10035 4770 l gs col0 s gr gr

% arrowhead
n 10005 4634 m 10035 4754 l 10065 4634 l 10005 4634 l  cp gs 0.00 setgray ef gr  col0 s
% Polyline
gs  clippath
9330 4170 m 9330 4110 l 9179 4110 l 9299 4140 l 9179 4170 l cp
eoclip
n 8910 4140 m
 9315 4140 l gs col0 s gr gr

% arrowhead
n 9179 4170 m 9299 4140 l 9179 4110 l 9179 4170 l  cp gs 0.00 setgray ef gr  col0 s
% Polyline
n 3645 3960 m 5130 3960 l 5130 4275 l 3645 4275 l
 cp gs col0 s gr 
% Polyline
n 5535 3960 m 7020 3960 l 7020 4275 l 5535 4275 l
 cp gs col0 s gr 
% Polyline
n 7425 3960 m 8910 3960 l 8910 4275 l 7425 4275 l
 cp gs col0 s gr 
% Polyline
n 9315 3960 m 10800 3960 l 10800 4275 l 9315 4275 l
 cp gs col0 s gr 
% Polyline
gs  clippath
2400 7260 m 2460 7260 l 2460 7109 l 2430 7229 l 2400 7109 l cp
eoclip
n 2430 6750 m
 2430 7245 l gs col0 s gr gr

% arrowhead
n 2400 7109 m 2430 7229 l 2460 7109 l 2400 7109 l  cp gs 0.00 setgray ef gr  col0 s
% Polyline
gs  clippath
3660 6645 m 3660 6585 l 3509 6585 l 3629 6615 l 3509 6645 l cp
eoclip
n 3240 6615 m
 3645 6615 l gs col0 s gr gr

% arrowhead
n 3509 6645 m 3629 6615 l 3509 6585 l 3509 6645 l  cp gs 0.00 setgray ef gr  col0 s
% Polyline
n 1755 6435 m 3240 6435 l 3240 6750 l 1755 6750 l
 cp gs col0 s gr 
% Polyline
gs  clippath
4290 7260 m 4350 7260 l 4350 7109 l 4320 7229 l 4290 7109 l cp
eoclip
n 4320 6750 m
 4320 7245 l gs col0 s gr gr

% arrowhead
n 4290 7109 m 4320 7229 l 4350 7109 l 4290 7109 l  cp gs 0.00 setgray ef gr  col0 s
% Polyline
gs  clippath
5550 6645 m 5550 6585 l 5399 6585 l 5519 6615 l 5399 6645 l cp
eoclip
n 5130 6615 m
 5535 6615 l gs col0 s gr gr

% arrowhead
n 5399 6645 m 5519 6615 l 5399 6585 l 5399 6645 l  cp gs 0.00 setgray ef gr  col0 s
% Polyline
n 3645 6435 m 5130 6435 l 5130 6750 l 3645 6750 l
 cp gs col0 s gr 
% Polyline
gs  clippath
6180 7260 m 6240 7260 l 6240 7109 l 6210 7229 l 6180 7109 l cp
eoclip
n 6210 6750 m
 6210 7245 l gs col0 s gr gr

% arrowhead
n 6180 7109 m 6210 7229 l 6240 7109 l 6180 7109 l  cp gs 0.00 setgray ef gr  col0 s
% Polyline
n 5535 6435 m 7020 6435 l 7020 6750 l 5535 6750 l
 cp gs col0 s gr 
% Polyline
gs  clippath
9330 6645 m 9330 6585 l 9179 6585 l 9299 6615 l 9179 6645 l cp
eoclip
n 8910 6615 m
 9315 6615 l gs col0 s gr gr

% arrowhead
n 9179 6645 m 9299 6615 l 9179 6585 l 9179 6645 l  cp gs 0.00 setgray ef gr  col0 s
% Polyline
n 7425 6435 m 8910 6435 l 8910 6750 l 7425 6750 l
 cp gs col0 s gr 
% Polyline
gs  clippath
9960 7260 m 10020 7260 l 10020 7109 l 9990 7229 l 9960 7109 l cp
eoclip
n 9990 6750 m
 9990 7245 l gs col0 s gr gr

% arrowhead
n 9960 7109 m 9990 7229 l 10020 7109 l 9960 7109 l  cp gs 0.00 setgray ef gr  col0 s
% Polyline
n 9315 6435 m 10800 6435 l 10800 6750 l 9315 6750 l
 cp gs col0 s gr 
% Polyline
gs  clippath
11850 7260 m 11910 7260 l 11910 7109 l 11880 7229 l 11850 7109 l cp
eoclip
n 11880 6750 m
 11880 7245 l gs col0 s gr gr

% arrowhead
n 11850 7109 m 11880 7229 l 11910 7109 l 11850 7109 l  cp gs 0.00 setgray ef gr  col0 s
% Polyline
n 11205 6435 m 12690 6435 l 12690 6750 l 11205 6750 l
 cp gs col0 s gr 
% Polyline
gs  clippath
6225 2490 m 6285 2490 l 6285 2339 l 6255 2459 l 6225 2339 l cp
eoclip
n 6255 1980 m
 6255 2475 l gs col0 s gr gr

% arrowhead
n 6225 2339 m 6255 2459 l 6285 2339 l 6225 2339 l  cp gs 0.00 setgray ef gr  col0 s
% Polyline
gs  clippath
10005 2490 m 10065 2490 l 10065 2339 l 10035 2459 l 10005 2339 l cp
eoclip
n 10035 1980 m
 10035 2475 l gs col0 s gr gr

% arrowhead
n 10005 2339 m 10035 2459 l 10065 2339 l 10005 2339 l  cp gs 0.00 setgray ef gr  col0 s
% Polyline
gs  clippath
3660 1875 m 3660 1815 l 3509 1815 l 3629 1845 l 3509 1875 l cp
eoclip
n 3240 1845 m
 3645 1845 l gs col0 s gr gr

% arrowhead
n 3509 1875 m 3629 1845 l 3509 1815 l 3509 1875 l  cp gs 0.00 setgray ef gr  col0 s
% Polyline
gs  clippath
9330 1875 m 9330 1815 l 9179 1815 l 9299 1845 l 9179 1875 l cp
eoclip
n 8910 1845 m
 9315 1845 l gs col0 s gr gr

% arrowhead
n 9179 1875 m 9299 1845 l 9179 1815 l 9179 1875 l  cp gs 0.00 setgray ef gr  col0 s
% Polyline
n 3645 1665 m 5130 1665 l 5130 1980 l 3645 1980 l
 cp gs col0 s gr 
% Polyline
n 5535 1665 m 7020 1665 l 7020 1980 l 5535 1980 l
 cp gs col0 s gr 
% Polyline
n 7425 1665 m 8910 1665 l 8910 1980 l 7425 1980 l
 cp gs col0 s gr 
% Polyline
n 9315 1665 m 10800 1665 l 10800 1980 l 9315 1980 l
 cp gs col0 s gr 
% Polyline
gs  clippath
4290 2490 m 4350 2490 l 4350 2339 l 4320 2459 l 4290 2339 l cp
eoclip
n 4320 1980 m
 4320 2475 l gs col0 s gr gr

% arrowhead
n 4290 2339 m 4320 2459 l 4350 2339 l 4290 2339 l  cp gs 0.00 setgray ef gr  col0 s
% Polyline
gs  clippath
8115 2490 m 8175 2490 l 8175 2339 l 8145 2459 l 8115 2339 l cp
eoclip
n 8145 1980 m
 8145 2475 l gs col0 s gr gr

% arrowhead
n 8115 2339 m 8145 2459 l 8175 2339 l 8115 2339 l  cp gs 0.00 setgray ef gr  col0 s
% Polyline
n 3645 2475 m 5130 2475 l 5130 2790 l 3645 2790 l
 cp gs 0.50 setgray ef gr gs col0 s gr 
% Polyline
n 7425 2475 m 8910 2475 l 8910 2790 l 7425 2790 l
 cp gs 0.50 setgray ef gr gs col0 s gr 
% Polyline
n 3645 7245 m 5130 7245 l 5130 7560 l 3645 7560 l
 cp gs 0.50 setgray ef gr gs col0 s gr 
% Polyline
n 9315 7245 m 10800 7245 l 10800 7560 l 9315 7560 l
 cp gs 0.50 setgray ef gr gs col0 s gr 
% Polyline
gs  clippath
2400 4785 m 2460 4785 l 2460 4634 l 2430 4754 l 2400 4634 l cp
eoclip
n 2430 4275 m
 2430 4770 l gs col0 s gr gr

% arrowhead
n 2400 4634 m 2430 4754 l 2460 4634 l 2400 4634 l  cp gs 0.00 setgray ef gr  col0 s
% Polyline
gs  clippath
3660 4170 m 3660 4110 l 3509 4110 l 3629 4140 l 3509 4170 l cp
eoclip
n 3240 4140 m
 3645 4140 l gs col0 s gr gr

% arrowhead
n 3509 4170 m 3629 4140 l 3509 4110 l 3509 4170 l  cp gs 0.00 setgray ef gr  col0 s
% Polyline
n 1755 3960 m 3240 3960 l 3240 4275 l 1755 4275 l
 cp gs col0 s gr 
% Polyline
gs  clippath
8535 2775 m 8475 2775 l 8475 2926 l 8505 2806 l 8535 2926 l cp
eoclip
n 8505 6435 m
 8505 2790 l gs col4 s gr gr

% arrowhead
n 8535 2926 m 8505 2806 l 8475 2926 l 8535 2926 l  cp gs col4 1.00 shd ef gr  col4 s
% Polyline
n 1755 720 m 3240 720 l 3240 1035 l 1755 1035 l
 cp gs col0 s gr 
% Polyline
gs  clippath
2400 2490 m 2460 2490 l 2460 2339 l 2430 2459 l 2400 2339 l cp
eoclip
n 2430 1980 m
 2430 2475 l gs col0 s gr gr

% arrowhead
n 2400 2339 m 2430 2459 l 2460 2339 l 2400 2339 l  cp gs 0.00 setgray ef gr  col0 s
% Polyline
n 1755 1665 m 3240 1665 l 3240 1980 l 1755 1980 l
 cp gs col0 s gr 
/Helvetica ff 180.00 scf sf
1710 5850 m
gs 1 -1 sc (Bei Schreibzugriffen => VERSCHMELZEN) col0 sh gr
/Helvetica ff 180.00 scf sf
450 990 m
gs 1 -1 sc (kein MS:) col0 sh gr
/Helvetica ff 180.00 scf sf
450 1890 m
gs 1 -1 sc (MS1:) col0 sh gr
/Helvetica ff 180.00 scf sf
1710 3465 m
gs 1 -1 sc (setzten von MS2 => KOPIE) col0 sh gr
/Helvetica ff 180.00 scf sf
450 4185 m
gs 1 -1 sc (MS2:) col0 sh gr
/Helvetica ff 180.00 scf sf
7515 4185 m
gs 1 -1 sc (50) col0 sh gr
/Helvetica ff 180.00 scf sf
8595 4185 m
gs 1 -1 sc (69) col0 sh gr
/Helvetica ff 180.00 scf sf
9405 4185 m
gs 1 -1 sc (70) col0 sh gr
/Helvetica ff 180.00 scf sf
6165 4995 m
gs 1 -1 sc (File) col0 sh gr
/Helvetica ff 180.00 scf sf
9900 4995 m
gs 1 -1 sc (File) col0 sh gr
/Helvetica ff 180.00 scf sf
4410 3510 m
gs 1 -1 sc (0) col0 sh gr
/Helvetica ff 180.00 scf sf
8235 3510 m
gs 1 -1 sc (0) col0 sh gr
/Helvetica ff 180.00 scf sf
1845 6660 m
gs 1 -1 sc (0) col0 sh gr
/Helvetica ff 180.00 scf sf
2295 7470 m
gs 1 -1 sc (File) col0 sh gr
/Helvetica ff 180.00 scf sf
6075 7470 m
gs 1 -1 sc (File) col0 sh gr
/Helvetica ff 180.00 scf sf
11745 7470 m
gs 1 -1 sc (File) col0 sh gr
/Helvetica ff 180.00 scf sf
10350 4185 m
gs 1 -1 sc (EOF) col0 sh gr
/Helvetica ff 180.00 scf sf
3735 1890 m
gs 1 -1 sc (10) col0 sh gr
/Helvetica ff 180.00 scf sf
4815 1890 m
gs 1 -1 sc (29) col0 sh gr
/Helvetica ff 180.00 scf sf
5625 1890 m
gs 1 -1 sc (30) col0 sh gr
/Helvetica ff 180.00 scf sf
6705 1890 m
gs 1 -1 sc (49) col0 sh gr
/Helvetica ff 180.00 scf sf
7515 1890 m
gs 1 -1 sc (50) col0 sh gr
/Helvetica ff 180.00 scf sf
8595 1890 m
gs 1 -1 sc (69) col0 sh gr
/Helvetica ff 180.00 scf sf
9405 1890 m
gs 1 -1 sc (70) col0 sh gr
/Helvetica ff 180.00 scf sf
6165 2700 m
gs 1 -1 sc (File) col0 sh gr
/Helvetica ff 180.00 scf sf
9900 2700 m
gs 1 -1 sc (File) col0 sh gr
/Helvetica ff 180.00 scf sf
4410 2250 m
gs 1 -1 sc (1) col0 sh gr
/Helvetica ff 180.00 scf sf
8190 2250 m
gs 1 -1 sc (1) col0 sh gr
/Helvetica ff 180.00 scf sf
10305 1890 m
gs 1 -1 sc (EOF) col0 sh gr
/Helvetica ff 180.00 scf sf
4365 7020 m
gs 1 -1 sc (1) col0 sh gr
/Helvetica ff 180.00 scf sf
10035 6975 m
gs 1 -1 sc (1) col0 sh gr
/Helvetica ff 180.00 scf sf
2925 6660 m
gs 1 -1 sc (9) col0 sh gr
/Helvetica ff 180.00 scf sf
3735 6660 m
gs 1 -1 sc (10) col0 sh gr
/Helvetica ff 180.00 scf sf
4815 6660 m
gs 1 -1 sc (44) col0 sh gr
/Helvetica ff 180.00 scf sf
5625 6660 m
gs 1 -1 sc (45) col0 sh gr
/Helvetica ff 180.00 scf sf
6705 6660 m
gs 1 -1 sc (49) col0 sh gr
/Helvetica ff 180.00 scf sf
7515 6660 m
gs 1 -1 sc (50) col0 sh gr
/Helvetica ff 180.00 scf sf
8595 6660 m
gs 1 -1 sc (54) col0 sh gr
/Helvetica ff 180.00 scf sf
9405 6660 m
gs 1 -1 sc (55) col0 sh gr
/Helvetica ff 180.00 scf sf
10485 6660 m
gs 1 -1 sc (79) col0 sh gr
/Helvetica ff 180.00 scf sf
11295 6660 m
gs 1 -1 sc (80) col0 sh gr
/Helvetica ff 180.00 scf sf
1845 4185 m
gs 1 -1 sc (0) col0 sh gr
/Helvetica ff 180.00 scf sf
2295 4995 m
gs 1 -1 sc (File) col0 sh gr
/Helvetica ff 180.00 scf sf
2925 4185 m
gs 1 -1 sc (9) col0 sh gr
/Helvetica ff 180.00 scf sf
3735 4185 m
gs 1 -1 sc (10) col0 sh gr
/Helvetica ff 180.00 scf sf
4815 4185 m
gs 1 -1 sc (29) col0 sh gr
/Helvetica ff 180.00 scf sf
5625 4185 m
gs 1 -1 sc (30) col0 sh gr
/Helvetica ff 180.00 scf sf
6705 4185 m
gs 1 -1 sc (49) col0 sh gr
/Helvetica ff 180.00 scf sf
8550 5040 m
gs 1 -1 sc (1) col4 sh gr
/Helvetica ff 180.00 scf sf
12195 6660 m
gs 1 -1 sc (EOF) col0 sh gr
/Helvetica ff 180.00 scf sf
1845 945 m
gs 1 -1 sc (0) col0 sh gr
/Helvetica ff 180.00 scf sf
2835 945 m
gs 1 -1 sc (EOF) col0 sh gr
/Helvetica ff 180.00 scf sf
1845 1890 m
gs 1 -1 sc (0) col0 sh gr
/Helvetica ff 180.00 scf sf
2295 2700 m
gs 1 -1 sc (File) col0 sh gr
/Helvetica ff 180.00 scf sf
2925 1890 m
gs 1 -1 sc (9) col0 sh gr
% here ends figure;
$F2psEnd
rs
showpage
