(JNukeVirtualTable "java/lang/String"
  (JNukeVTableEntry (java) (JNukeMethod "java/lang/String.<init>" (JNukeSignature "V" (JNukeVector))))
  (JNukeVTableEntry (java) (JNukeMethod "java/lang/String.<init>" (JNukeSignature "V" (JNukeVector "Ljava/lang/String;"))))
  (JNukeVTableEntry (java) (JNukeMethod "java/lang/String.<init>" (JNukeSignature "V" (JNukeVector "[C"))))
  (JNukeVTableEntry (java) (JNukeMethod "java/lang/String.<init>" (JNukeSignature "V" (JNukeVector "[C" "I" "I"))))
  (JNukeVTableEntry (java) (JNukeMethod "java/lang/String.<init>" (JNukeSignature "V" (JNukeVector "[B" "I" "I" "I"))))
  (JNukeVTableEntry (java) (JNukeMethod "java/lang/String.<init>" (JNukeSignature "V" (JNukeVector "[B" "I"))))
  (JNukeVTableEntry (java) (JNukeMethod "java/lang/String.<init>" (JNukeSignature "V" (JNukeVector "[B" "I" "I" "Lsun/io/ByteToCharConverter;"))))
  (JNukeVTableEntry (java) (JNukeMethod "java/lang/String.<init>" (JNukeSignature "V" (JNukeVector "[B" "I" "I" "Ljava/lang/String;"))))
  (JNukeVTableEntry (java) (JNukeMethod "java/lang/String.<init>" (JNukeSignature "V" (JNukeVector "[B" "Ljava/lang/String;"))))
  (JNukeVTableEntry (java) (JNukeMethod "java/lang/String.<init>" (JNukeSignature "V" (JNukeVector "[B" "I" "I"))))
  (JNukeVTableEntry (java) (JNukeMethod "java/lang/String.<init>" (JNukeSignature "V" (JNukeVector "[B"))))
  (JNukeVTableEntry (java) (JNukeMethod "java/lang/String.<init>" (JNukeSignature "V" (JNukeVector "Ljava/lang/StringBuffer;"))))
  (JNukeVTableEntry (java) (JNukeMethod "java/lang/String.<init>" (JNukeSignature "V" (JNukeVector "I" "I" "[C"))))
  (JNukeVTableEntry (java) (JNukeMethod "java/lang/String.length" (JNukeSignature "I" (JNukeVector))))
  (JNukeVTableEntry (java) (JNukeMethod "java/lang/String.charAt" (JNukeSignature "C" (JNukeVector "I"))))
  (JNukeVTableEntry (java) (JNukeMethod "java/lang/String.getChars" (JNukeSignature "V" (JNukeVector "I" "I" "[C" "I"))))
  (JNukeVTableEntry (java) (JNukeMethod "java/lang/String.getBytes" (JNukeSignature "V" (JNukeVector "I" "I" "[B" "I"))))
  (JNukeVTableEntry (java) (JNukeMethod "java/lang/String.getBytes" (JNukeSignature "[B" (JNukeVector "Lsun/io/CharToByteConverter;"))))
  (JNukeVTableEntry (java) (JNukeMethod "java/lang/String.getBytes" (JNukeSignature "[B" (JNukeVector "Ljava/lang/String;"))))
  (JNukeVTableEntry (java) (JNukeMethod "java/lang/String.getBytes" (JNukeSignature "[B" (JNukeVector))))
  (JNukeVTableEntry (java) (JNukeMethod "java/lang/String.equals" (JNukeSignature "Z" (JNukeVector "Ljava/lang/Object;"))))
  (JNukeVTableEntry (java) (JNukeMethod "java/lang/String.equalsIgnoreCase" (JNukeSignature "Z" (JNukeVector "Ljava/lang/String;"))))
  (JNukeVTableEntry (java) (JNukeMethod "java/lang/String.compareTo" (JNukeSignature "I" (JNukeVector "Ljava/lang/String;"))))
  (JNukeVTableEntry (java) (JNukeMethod "java/lang/String.regionMatches" (JNukeSignature "Z" (JNukeVector "I" "Ljava/lang/String;" "I" "I"))))
  (JNukeVTableEntry (java) (JNukeMethod "java/lang/String.regionMatches" (JNukeSignature "Z" (JNukeVector "Z" "I" "Ljava/lang/String;" "I" "I"))))
  (JNukeVTableEntry (java) (JNukeMethod "java/lang/String.startsWith" (JNukeSignature "Z" (JNukeVector "Ljava/lang/String;" "I"))))
  (JNukeVTableEntry (java) (JNukeMethod "java/lang/String.startsWith" (JNukeSignature "Z" (JNukeVector "Ljava/lang/String;"))))
  (JNukeVTableEntry (java) (JNukeMethod "java/lang/String.endsWith" (JNukeSignature "Z" (JNukeVector "Ljava/lang/String;"))))
  (JNukeVTableEntry (java) (JNukeMethod "java/lang/String.hashCode" (JNukeSignature "I" (JNukeVector))))
  (JNukeVTableEntry (java) (JNukeMethod "java/lang/String.indexOf" (JNukeSignature "I" (JNukeVector "I"))))
  (JNukeVTableEntry (java) (JNukeMethod "java/lang/String.indexOf" (JNukeSignature "I" (JNukeVector "I" "I"))))
  (JNukeVTableEntry (java) (JNukeMethod "java/lang/String.lastIndexOf" (JNukeSignature "I" (JNukeVector "I"))))
  (JNukeVTableEntry (java) (JNukeMethod "java/lang/String.lastIndexOf" (JNukeSignature "I" (JNukeVector "I" "I"))))
  (JNukeVTableEntry (java) (JNukeMethod "java/lang/String.indexOf" (JNukeSignature "I" (JNukeVector "Ljava/lang/String;"))))
  (JNukeVTableEntry (java) (JNukeMethod "java/lang/String.indexOf" (JNukeSignature "I" (JNukeVector "Ljava/lang/String;" "I"))))
  (JNukeVTableEntry (java) (JNukeMethod "java/lang/String.lastIndexOf" (JNukeSignature "I" (JNukeVector "Ljava/lang/String;"))))
  (JNukeVTableEntry (java) (JNukeMethod "java/lang/String.lastIndexOf" (JNukeSignature "I" (JNukeVector "Ljava/lang/String;" "I"))))
  (JNukeVTableEntry (java) (JNukeMethod "java/lang/String.substring" (JNukeSignature "Ljava/lang/String;" (JNukeVector "I"))))
  (JNukeVTableEntry (java) (JNukeMethod "java/lang/String.substring" (JNukeSignature "Ljava/lang/String;" (JNukeVector "I" "I"))))
  (JNukeVTableEntry (java) (JNukeMethod "java/lang/String.concat" (JNukeSignature "Ljava/lang/String;" (JNukeVector "Ljava/lang/String;"))))
  (JNukeVTableEntry (java) (JNukeMethod "java/lang/String.replace" (JNukeSignature "Ljava/lang/String;" (JNukeVector "C" "C"))))
  (JNukeVTableEntry (java) (JNukeMethod "java/lang/String.toLowerCase" (JNukeSignature "Ljava/lang/String;" (JNukeVector "Ljava/util/Locale;"))))
  (JNukeVTableEntry (java) (JNukeMethod "java/lang/String.toLowerCase" (JNukeSignature "Ljava/lang/String;" (JNukeVector))))
  (JNukeVTableEntry (java) (JNukeMethod "java/lang/String.toUpperCase" (JNukeSignature "Ljava/lang/String;" (JNukeVector "Ljava/util/Locale;"))))
  (JNukeVTableEntry (java) (JNukeMethod "java/lang/String.toUpperCase" (JNukeSignature "Ljava/lang/String;" (JNukeVector))))
  (JNukeVTableEntry (java) (JNukeMethod "java/lang/String.trim" (JNukeSignature "Ljava/lang/String;" (JNukeVector))))
  (JNukeVTableEntry (java) (JNukeMethod "java/lang/String.toString" (JNukeSignature "Ljava/lang/String;" (JNukeVector))))
  (JNukeVTableEntry (java) (JNukeMethod "java/lang/String.toCharArray" (JNukeSignature "[C" (JNukeVector))))
  (JNukeVTableEntry (java) (JNukeMethod "java/lang/String.valueOf" (JNukeSignature "Ljava/lang/String;" (JNukeVector "Ljava/lang/Object;"))))
  (JNukeVTableEntry (java) (JNukeMethod "java/lang/String.valueOf" (JNukeSignature "Ljava/lang/String;" (JNukeVector "[C"))))
  (JNukeVTableEntry (java) (JNukeMethod "java/lang/String.valueOf" (JNukeSignature "Ljava/lang/String;" (JNukeVector "[C" "I" "I"))))
  (JNukeVTableEntry (java) (JNukeMethod "java/lang/String.copyValueOf" (JNukeSignature "Ljava/lang/String;" (JNukeVector "[C" "I" "I"))))
  (JNukeVTableEntry (java) (JNukeMethod "java/lang/String.copyValueOf" (JNukeSignature "Ljava/lang/String;" (JNukeVector "[C"))))
  (JNukeVTableEntry (java) (JNukeMethod "java/lang/String.valueOf" (JNukeSignature "Ljava/lang/String;" (JNukeVector "Z"))))
  (JNukeVTableEntry (java) (JNukeMethod "java/lang/String.valueOf" (JNukeSignature "Ljava/lang/String;" (JNukeVector "C"))))
  (JNukeVTableEntry (java) (JNukeMethod "java/lang/String.valueOf" (JNukeSignature "Ljava/lang/String;" (JNukeVector "I"))))
  (JNukeVTableEntry (java) (JNukeMethod "java/lang/String.valueOf" (JNukeSignature "Ljava/lang/String;" (JNukeVector "J"))))
  (JNukeVTableEntry (java) (JNukeMethod "java/lang/String.valueOf" (JNukeSignature "Ljava/lang/String;" (JNukeVector "F"))))
  (JNukeVTableEntry (java) (JNukeMethod "java/lang/String.valueOf" (JNukeSignature "Ljava/lang/String;" (JNukeVector "D"))))
  (JNukeVTableEntry (java) (JNukeMethod "java/lang/String.utfLength" (JNukeSignature "I" (JNukeVector))))
)
