#FIG 3.2
Landscape
Center
Metric
A4      
100.00
Single
-2
1200 2
0 32 #e1e1e1
0 33 #acacac
6 5355 1035 8190 2970
2 3 0 1 0 11 120 0 62 0.000 0 0 -1 0 0 5
	 7470 1215 8190 1035 7695 1440 6975 1620 7470 1215
2 3 0 1 0 11 120 0 62 0.000 0 0 -1 0 0 5
	 6930 1665 7650 1485 7155 1890 6435 2070 6930 1665
2 3 0 1 0 11 120 0 62 0.000 0 0 -1 0 0 5
	 6390 2115 7110 1935 6615 2340 5895 2520 6390 2115
2 3 0 1 0 11 120 0 62 0.000 0 0 -1 0 0 5
	 5850 2565 6570 2385 6075 2790 5355 2970 5850 2565
-6
6 2449 3511 5284 5446
2 3 0 1 0 11 50 0 62 0.000 0 0 -1 0 0 5
	 4564 3691 5284 3511 4789 3916 4069 4096 4564 3691
2 3 0 1 0 11 50 0 62 0.000 0 0 -1 0 0 5
	 4024 4141 4744 3961 4249 4366 3529 4546 4024 4141
2 3 0 1 0 11 50 0 62 0.000 0 0 -1 0 0 5
	 3484 4591 4204 4411 3709 4816 2989 4996 3484 4591
2 3 0 1 0 11 50 0 62 0.000 0 0 -1 0 0 5
	 2944 5041 3664 4861 3169 5266 2449 5446 2944 5041
-6
6 4530 2575 6332 4067
1 2 0 1 0 31 40 0 20 0.000 1 5.9341 6099 3529 112 450 5994 3490 6204 3567
1 2 0 0 0 31 70 0 20 0.000 1 5.9341 5676 3375 112 450 5571 3337 5782 3413
1 2 0 0 0 32 80 0 20 0.000 1 5.9341 5635 3360 112 450 5530 3322 5740 3398
1 2 0 0 0 32 60 0 20 0.000 1 5.9341 6015 3498 112 450 5909 3460 6120 3536
1 2 0 1 0 31 100 0 20 0.000 1 5.9341 4912 3105 112 450 4800 3105 5024 3105
2 1 0 2 33 32 120 0 20 0.000 0 0 -1 0 0 2
	 6075 2790 5760 2970
2 1 0 2 33 32 40 0 20 0.000 0 0 -1 0 0 2
	 4905 3555 4545 3690
2 3 0 0 33 33 55 0 20 0.000 0 0 -1 0 0 5
	 5698 3909 5694 4052 5736 4067 5740 3925 5698 3909
2 3 0 0 33 7 45 0 20 0.000 0 0 -1 0 0 5
	 6075 3137 5955 3333 6040 3364 6159 3168 6075 3137
2 3 0 0 33 7 45 0 20 0.000 0 0 -1 0 0 5
	 5694 2998 5575 3194 5617 3210 5736 3014 5694 2998
2 3 0 0 33 18 55 0 20 0.000 0 0 -1 0 0 5
	 5617 3210 5955 3333 5863 3587 5525 3463 5617 3210
2 3 0 0 33 18 55 0 20 0.000 0 0 -1 0 0 5
	 6205 3041 6332 3087 6275 3114 6148 3068 6205 3041
2 1 0 0 33 33 55 0 20 0.000 0 0 -1 0 0 4
	 5840 2860 5779 3029 5906 3075 5967 2906
2 3 0 0 33 32 60 0 20 0.000 0 0 -1 0 0 5
	 6148 3068 6232 3098 5925 3944 5840 3913 6148 3068
2 3 0 0 33 31 70 0 20 0.000 0 0 -1 0 0 5
	 5809 2944 6148 3068 5840 3913 5544 3806 5809 2944
2 3 0 0 33 31 100 0 20 0.000 0 0 -1 0 0 5
	 5048 2667 5852 2960 5544 3806 4783 3529 5048 2667
2 3 0 0 33 33 90 0 20 0.000 0 0 -1 0 0 5
	 4748 3229 5467 3490 5417 3759 4741 3513 4748 3229
2 1 0 2 0 31 80 0 20 0.000 0 0 -1 0 0 2
	 5040 3479 5421 3617
2 1 0 2 0 31 80 0 20 0.000 0 0 -1 0 0 2
	 5210 3540 5375 3744
2 1 0 2 7 31 80 0 20 0.000 0 0 -1 0 0 2
	 5040 3479 5171 3383
2 3 0 0 17 17 80 0 20 0.000 0 0 -1 0 0 5
	 5475 3206 5517 3221 5456 3390 5413 3375 5475 3206
2 3 0 0 32 32 80 0 20 0.000 0 0 -1 0 0 5
	 5248 3171 5333 3202 5302 3287 5217 3256 5248 3171
2 3 0 0 32 19 80 0 61 0.000 0 0 -1 0 0 5
	 4968 3021 5137 3083 5075 3252 4906 3190 4968 3021
2 3 0 1 0 33 70 0 20 0.000 0 0 -1 0 0 5
	 4841 2975 4756 2944 4725 3029 4810 3060 4841 2975
2 3 0 0 32 32 65 0 20 0.000 0 0 -1 0 0 5
	 5198 2914 5494 3021 5640 2883 5344 2775 5198 2914
2 1 0 1 18 31 70 0 20 0.000 0 0 -1 0 0 2
	 4929 2863 5606 3110
2 3 0 0 32 33 60 0 20 0.000 0 0 -1 0 0 5
	 5256 2887 5552 2994 5698 2856 5402 2748 5256 2887
2 3 0 0 32 32 55 0 20 0.000 0 0 -1 0 0 5
	 5271 2844 5567 2952 5713 2814 5417 2706 5271 2844
2 3 0 0 32 32 65 0 20 0.000 0 0 -1 0 0 5
	 4902 2806 5114 2883 5187 2814 4975 2737 4902 2806
2 1 0 2 0 32 50 0 20 0.000 0 0 -1 0 0 2
	 4902 2806 4948 2679
2 1 0 2 0 32 65 0 20 0.000 0 0 -1 0 0 2
	 5187 2814 5233 2687
2 3 0 0 32 32 55 0 20 0.000 0 0 -1 0 0 5
	 4948 2679 5160 2756 5233 2687 5021 2610 4948 2679
2 3 0 0 32 33 65 0 20 0.000 0 0 -1 0 0 5
	 4918 2764 5129 2840 5202 2771 4991 2694 4918 2764
2 1 0 1 18 32 60 0 20 0.000 0 0 -1 0 0 2
	 5494 3548 5832 3671
2 3 0 0 32 32 55 0 20 0.000 0 0 -1 0 0 5
	 5786 3798 5698 3909 5740 3925 5828 3813 5786 3798
2 1 0 1 18 32 60 0 20 0.000 0 0 -1 0 0 2
	 5494 3548 5840 3913
2 1 0 1 18 32 60 0 20 0.000 0 0 -1 0 0 2
	 5832 3671 5502 3790
2 3 0 1 0 31 70 0 20 0.000 0 0 -1 0 0 5
	 4929 2863 4633 2756 4795 2575 5091 2683 4929 2863
2 3 0 1 0 33 70 0 20 0.000 0 0 -1 0 0 5
	 4764 3186 4679 3156 4656 3482 4741 3513 4764 3186
2 1 0 1 0 32 55 0 20 0.000 0 0 -1 0 0 2
	 5947 3952 4656 3482
2 1 0 1 0 32 60 0 20 0.000 0 0 -1 0 0 2
	 6240 3103 4795 2575
-6
6 6030 3375 6615 3780
2 1 0 0 11 11 35 0 20 0.000 0 0 -1 0 0 11
	 6120 3375 6390 3465 6525 3555 6570 3645 6615 3735 6480 3780
	 6390 3780 6255 3735 6030 3645 6030 3555 6075 3420
2 1 0 0 11 15 34 0 20 0.000 0 0 -1 0 0 11
	 6120 3391 6380 3478 6512 3569 6574 3687 6594 3730 6484 3767
	 6390 3763 6300 3735 6039 3640 6042 3563 6069 3466
2 1 0 0 11 16 33 0 20 0.000 0 0 -1 0 0 11
	 6126 3407 6386 3494 6503 3581 6566 3701 6570 3723 6495 3753
	 6406 3751 6301 3725 6051 3632 6051 3569 6075 3482
2 1 0 0 11 17 32 0 20 0.000 0 0 -1 0 0 10
	 6125 3434 6376 3520 6484 3597 6556 3710 6491 3729 6406 3719
	 6313 3699 6065 3607 6068 3557 6082 3498
2 1 0 0 11 11 31 0 20 0.000 0 0 -1 0 0 8
	 6126 3462 6357 3544 6471 3620 6528 3698 6492 3702 6317 3675
	 6078 3585 6092 3514
2 1 0 0 11 3 31 0 20 0.000 0 0 -1 0 0 8
	 6125 3485 6356 3567 6470 3643 6507 3688 6464 3682 6326 3654
	 6088 3571 6105 3522
2 1 0 0 11 3 30 0 20 0.000 0 0 -1 0 0 8
	 6120 3483 6351 3565 6465 3641 6502 3686 6459 3680 6321 3652
	 6083 3569 6100 3520
2 1 0 0 11 32 29 0 20 0.000 0 0 -1 0 0 5
	 6119 3505 6350 3587 6479 3672 6332 3632 6100 3552
2 1 0 0 11 7 28 0 20 0.000 0 0 -1 0 0 5
	 6126 3526 6357 3608 6424 3645 6352 3621 6124 3540
-6
