(JNukeExitBlock (JNukeSchedule 
  (JNukeThreadSwitch (from_thread 0) (to_thread 0) (JNukeMethod "SplitSync.<init>" (JNukeSignature "V" (JNukeVector))) (pc 7) (line 11))
  (JNukeThreadSwitch (from_thread 0) (to_thread 0) (JNukeMethod "SplitSync.<init>" (JNukeSignature "V" (JNukeVector))) (pc 7) (line 11))
  (JNukeThreadSwitch (from_thread 0) (to_thread 1) (JNukeMethod "SplitSync.main" (JNukeSignature "V" (JNukeVector "[Ljava/lang/String;"))) (pc 9) (line 8))
  (JNukeThreadSwitch (from_thread 1) (to_thread 1) (JNukeMethod "SplitSync.run" (JNukeSignature "V" (JNukeVector))) (pc 9) (line 18))
  (JNukeThreadSwitch (from_thread 1) (to_thread 1) (JNukeMethod "SplitSync.run" (JNukeSignature "V" (JNukeVector))) (pc 34) (line 23))
  (JNukeThreadSwitch (from_thread 1) (to_thread 2) (JNukeMethod "java/lang/Thread.run" (JNukeSignature "V" (JNukeVector))) (pc 7) (line 57))
)
)

Assertion failed at (vmState "SplitSync.run ()V" (line 21) (pc 26) (thread 1))
(JNukeExitBlock (JNukeSchedule 
  (JNukeThreadSwitch (from_thread 0) (to_thread 0) (JNukeMethod "SplitSync.<init>" (JNukeSignature "V" (JNukeVector))) (pc 7) (line 11))
  (JNukeThreadSwitch (from_thread 0) (to_thread 0) (JNukeMethod "SplitSync.<init>" (JNukeSignature "V" (JNukeVector))) (pc 7) (line 11))
  (JNukeThreadSwitch (from_thread 0) (to_thread 1) (JNukeMethod "SplitSync.main" (JNukeSignature "V" (JNukeVector "[Ljava/lang/String;"))) (pc 9) (line 8))
  (JNukeThreadSwitch (from_thread 1) (to_thread 2) (JNukeMethod "SplitSync.run" (JNukeSignature "V" (JNukeVector))) (pc 9) (line 18))
  (JNukeThreadSwitch (from_thread 2) (to_thread 2) (JNukeMethod "SplitSync.run" (JNukeSignature "V" (JNukeVector))) (pc 9) (line 18))
  (JNukeThreadSwitch (from_thread 2) (to_thread 2) (JNukeMethod "SplitSync.run" (JNukeSignature "V" (JNukeVector))) (pc 34) (line 23))
  (JNukeThreadSwitch (from_thread 2) (to_thread 1) (JNukeMethod "java/lang/Thread.run" (JNukeSignature "V" (JNukeVector))) (pc 7) (line 57))
)
)

Assertion failed at (vmState "SplitSync.run ()V" (line 21) (pc 26) (thread 2))
(JNukeExitBlock (JNukeSchedule 
  (JNukeThreadSwitch (from_thread 0) (to_thread 0) (JNukeMethod "SplitSync.<init>" (JNukeSignature "V" (JNukeVector))) (pc 7) (line 11))
  (JNukeThreadSwitch (from_thread 0) (to_thread 0) (JNukeMethod "SplitSync.<init>" (JNukeSignature "V" (JNukeVector))) (pc 7) (line 11))
  (JNukeThreadSwitch (from_thread 0) (to_thread 1) (JNukeMethod "SplitSync.main" (JNukeSignature "V" (JNukeVector "[Ljava/lang/String;"))) (pc 9) (line 8))
  (JNukeThreadSwitch (from_thread 1) (to_thread 2) (JNukeMethod "SplitSync.run" (JNukeSignature "V" (JNukeVector))) (pc 9) (line 18))
  (JNukeThreadSwitch (from_thread 2) (to_thread 1) (JNukeMethod "SplitSync.run" (JNukeSignature "V" (JNukeVector))) (pc 9) (line 18))
  (JNukeThreadSwitch (from_thread 1) (to_thread 1) (JNukeMethod "SplitSync.run" (JNukeSignature "V" (JNukeVector))) (pc 34) (line 23))
  (JNukeThreadSwitch (from_thread 1) (to_thread 2) (JNukeMethod "java/lang/Thread.run" (JNukeSignature "V" (JNukeVector))) (pc 7) (line 57))
)
)

(JNukeExitBlock (JNukeSchedule 
  (JNukeThreadSwitch (from_thread 0) (to_thread 0) (JNukeMethod "SplitSync.<init>" (JNukeSignature "V" (JNukeVector))) (pc 7) (line 11))
  (JNukeThreadSwitch (from_thread 0) (to_thread 2) (JNukeMethod "SplitSync.<init>" (JNukeSignature "V" (JNukeVector))) (pc 7) (line 11))
  (JNukeThreadSwitch (from_thread 2) (to_thread 2) (JNukeMethod "SplitSync.run" (JNukeSignature "V" (JNukeVector))) (pc 9) (line 18))
  (JNukeThreadSwitch (from_thread 2) (to_thread 2) (JNukeMethod "SplitSync.run" (JNukeSignature "V" (JNukeVector))) (pc 34) (line 23))
  (JNukeThreadSwitch (from_thread 2) (to_thread 0) (JNukeMethod "java/lang/Thread.run" (JNukeSignature "V" (JNukeVector))) (pc 7) (line 57))
  (JNukeThreadSwitch (from_thread 0) (to_thread 1) (JNukeMethod "SplitSync.main" (JNukeSignature "V" (JNukeVector "[Ljava/lang/String;"))) (pc 9) (line 8))
)
)

Assertion failed at (vmState "SplitSync.run ()V" (line 21) (pc 26) (thread 2))
(JNukeExitBlock (JNukeSchedule 
  (JNukeThreadSwitch (from_thread 0) (to_thread 0) (JNukeMethod "SplitSync.<init>" (JNukeSignature "V" (JNukeVector))) (pc 7) (line 11))
  (JNukeThreadSwitch (from_thread 0) (to_thread 2) (JNukeMethod "SplitSync.<init>" (JNukeSignature "V" (JNukeVector))) (pc 7) (line 11))
  (JNukeThreadSwitch (from_thread 2) (to_thread 1) (JNukeMethod "SplitSync.run" (JNukeSignature "V" (JNukeVector))) (pc 9) (line 18))
  (JNukeThreadSwitch (from_thread 1) (to_thread 1) (JNukeMethod "SplitSync.run" (JNukeSignature "V" (JNukeVector))) (pc 9) (line 18))
  (JNukeThreadSwitch (from_thread 1) (to_thread 1) (JNukeMethod "SplitSync.run" (JNukeSignature "V" (JNukeVector))) (pc 34) (line 23))
  (JNukeThreadSwitch (from_thread 1) (to_thread 2) (JNukeMethod "java/lang/Thread.run" (JNukeSignature "V" (JNukeVector))) (pc 7) (line 57))
  (JNukeThreadSwitch (from_thread 2) (to_thread 2) (JNukeMethod "SplitSync.run" (JNukeSignature "V" (JNukeVector))) (pc 34) (line 23))
  (JNukeThreadSwitch (from_thread 2) (to_thread 0) (JNukeMethod "java/lang/Thread.run" (JNukeSignature "V" (JNukeVector))) (pc 7) (line 57))
)
)

Assertion failed at (vmState "SplitSync.run ()V" (line 21) (pc 26) (thread 2))
(JNukeExitBlock (JNukeSchedule 
  (JNukeThreadSwitch (from_thread 0) (to_thread 0) (JNukeMethod "SplitSync.<init>" (JNukeSignature "V" (JNukeVector))) (pc 7) (line 11))
  (JNukeThreadSwitch (from_thread 0) (to_thread 2) (JNukeMethod "SplitSync.<init>" (JNukeSignature "V" (JNukeVector))) (pc 7) (line 11))
  (JNukeThreadSwitch (from_thread 2) (to_thread 1) (JNukeMethod "SplitSync.run" (JNukeSignature "V" (JNukeVector))) (pc 9) (line 18))
  (JNukeThreadSwitch (from_thread 1) (to_thread 1) (JNukeMethod "SplitSync.run" (JNukeSignature "V" (JNukeVector))) (pc 9) (line 18))
  (JNukeThreadSwitch (from_thread 1) (to_thread 2) (JNukeMethod "SplitSync.run" (JNukeSignature "V" (JNukeVector))) (pc 34) (line 23))
  (JNukeThreadSwitch (from_thread 2) (to_thread 2) (JNukeMethod "SplitSync.run" (JNukeSignature "V" (JNukeVector))) (pc 34) (line 23))
  (JNukeThreadSwitch (from_thread 2) (to_thread 0) (JNukeMethod "java/lang/Thread.run" (JNukeSignature "V" (JNukeVector))) (pc 7) (line 57))
  (JNukeThreadSwitch (from_thread 0) (to_thread 1) (JNukeMethod "SplitSync.main" (JNukeSignature "V" (JNukeVector "[Ljava/lang/String;"))) (pc 9) (line 8))
)
)

Assertion failed at (vmState "SplitSync.run ()V" (line 21) (pc 26) (thread 2))
(JNukeExitBlock (JNukeSchedule 
  (JNukeThreadSwitch (from_thread 0) (to_thread 0) (JNukeMethod "SplitSync.<init>" (JNukeSignature "V" (JNukeVector))) (pc 7) (line 11))
  (JNukeThreadSwitch (from_thread 0) (to_thread 2) (JNukeMethod "SplitSync.<init>" (JNukeSignature "V" (JNukeVector))) (pc 7) (line 11))
  (JNukeThreadSwitch (from_thread 2) (to_thread 1) (JNukeMethod "SplitSync.run" (JNukeSignature "V" (JNukeVector))) (pc 9) (line 18))
  (JNukeThreadSwitch (from_thread 1) (to_thread 1) (JNukeMethod "SplitSync.run" (JNukeSignature "V" (JNukeVector))) (pc 9) (line 18))
  (JNukeThreadSwitch (from_thread 1) (to_thread 0) (JNukeMethod "SplitSync.run" (JNukeSignature "V" (JNukeVector))) (pc 34) (line 23))
  (JNukeThreadSwitch (from_thread 0) (to_thread 1) (JNukeMethod "SplitSync.main" (JNukeSignature "V" (JNukeVector "[Ljava/lang/String;"))) (pc 9) (line 8))
  (JNukeThreadSwitch (from_thread 1) (to_thread 2) (JNukeMethod "java/lang/Thread.run" (JNukeSignature "V" (JNukeVector))) (pc 7) (line 57))
)
)

Assertion failed at (vmState "SplitSync.run ()V" (line 21) (pc 26) (thread 1))
(JNukeExitBlock (JNukeSchedule 
  (JNukeThreadSwitch (from_thread 0) (to_thread 0) (JNukeMethod "SplitSync.<init>" (JNukeSignature "V" (JNukeVector))) (pc 7) (line 11))
  (JNukeThreadSwitch (from_thread 0) (to_thread 2) (JNukeMethod "SplitSync.<init>" (JNukeSignature "V" (JNukeVector))) (pc 7) (line 11))
  (JNukeThreadSwitch (from_thread 2) (to_thread 1) (JNukeMethod "SplitSync.run" (JNukeSignature "V" (JNukeVector))) (pc 9) (line 18))
  (JNukeThreadSwitch (from_thread 1) (to_thread 2) (JNukeMethod "SplitSync.run" (JNukeSignature "V" (JNukeVector))) (pc 9) (line 18))
  (JNukeThreadSwitch (from_thread 2) (to_thread 2) (JNukeMethod "SplitSync.run" (JNukeSignature "V" (JNukeVector))) (pc 34) (line 23))
  (JNukeThreadSwitch (from_thread 2) (to_thread 0) (JNukeMethod "java/lang/Thread.run" (JNukeSignature "V" (JNukeVector))) (pc 7) (line 57))
  (JNukeThreadSwitch (from_thread 0) (to_thread 1) (JNukeMethod "SplitSync.main" (JNukeSignature "V" (JNukeVector "[Ljava/lang/String;"))) (pc 9) (line 8))
)
)

Assertion failed at (vmState "SplitSync.run ()V" (line 21) (pc 26) (thread 2))
(JNukeExitBlock (JNukeSchedule 
  (JNukeThreadSwitch (from_thread 0) (to_thread 0) (JNukeMethod "SplitSync.<init>" (JNukeSignature "V" (JNukeVector))) (pc 7) (line 11))
  (JNukeThreadSwitch (from_thread 0) (to_thread 2) (JNukeMethod "SplitSync.<init>" (JNukeSignature "V" (JNukeVector))) (pc 7) (line 11))
  (JNukeThreadSwitch (from_thread 2) (to_thread 1) (JNukeMethod "SplitSync.run" (JNukeSignature "V" (JNukeVector))) (pc 9) (line 18))
  (JNukeThreadSwitch (from_thread 1) (to_thread 0) (JNukeMethod "SplitSync.run" (JNukeSignature "V" (JNukeVector))) (pc 9) (line 18))
  (JNukeThreadSwitch (from_thread 0) (to_thread 1) (JNukeMethod "SplitSync.main" (JNukeSignature "V" (JNukeVector "[Ljava/lang/String;"))) (pc 9) (line 8))
  (JNukeThreadSwitch (from_thread 1) (to_thread 1) (JNukeMethod "SplitSync.run" (JNukeSignature "V" (JNukeVector))) (pc 34) (line 23))
  (JNukeThreadSwitch (from_thread 1) (to_thread 2) (JNukeMethod "java/lang/Thread.run" (JNukeSignature "V" (JNukeVector))) (pc 7) (line 57))
)
)

Assertion failed at (vmState "SplitSync.run ()V" (line 21) (pc 26) (thread 2))
(JNukeExitBlock (JNukeSchedule 
  (JNukeThreadSwitch (from_thread 0) (to_thread 0) (JNukeMethod "SplitSync.<init>" (JNukeSignature "V" (JNukeVector))) (pc 7) (line 11))
  (JNukeThreadSwitch (from_thread 0) (to_thread 2) (JNukeMethod "SplitSync.<init>" (JNukeSignature "V" (JNukeVector))) (pc 7) (line 11))
  (JNukeThreadSwitch (from_thread 2) (to_thread 0) (JNukeMethod "SplitSync.run" (JNukeSignature "V" (JNukeVector))) (pc 9) (line 18))
  (JNukeThreadSwitch (from_thread 0) (to_thread 1) (JNukeMethod "SplitSync.main" (JNukeSignature "V" (JNukeVector "[Ljava/lang/String;"))) (pc 9) (line 8))
  (JNukeThreadSwitch (from_thread 1) (to_thread 1) (JNukeMethod "SplitSync.run" (JNukeSignature "V" (JNukeVector))) (pc 9) (line 18))
  (JNukeThreadSwitch (from_thread 1) (to_thread 1) (JNukeMethod "SplitSync.run" (JNukeSignature "V" (JNukeVector))) (pc 34) (line 23))
  (JNukeThreadSwitch (from_thread 1) (to_thread 2) (JNukeMethod "java/lang/Thread.run" (JNukeSignature "V" (JNukeVector))) (pc 7) (line 57))
)
)

Assertion failed at (vmState "SplitSync.run ()V" (line 21) (pc 26) (thread 1))
(JNukeExitBlock (JNukeSchedule 
  (JNukeThreadSwitch (from_thread 0) (to_thread 0) (JNukeMethod "SplitSync.<init>" (JNukeSignature "V" (JNukeVector))) (pc 7) (line 11))
  (JNukeThreadSwitch (from_thread 0) (to_thread 2) (JNukeMethod "SplitSync.<init>" (JNukeSignature "V" (JNukeVector))) (pc 7) (line 11))
  (JNukeThreadSwitch (from_thread 2) (to_thread 0) (JNukeMethod "SplitSync.run" (JNukeSignature "V" (JNukeVector))) (pc 9) (line 18))
  (JNukeThreadSwitch (from_thread 0) (to_thread 1) (JNukeMethod "SplitSync.main" (JNukeSignature "V" (JNukeVector "[Ljava/lang/String;"))) (pc 9) (line 8))
  (JNukeThreadSwitch (from_thread 1) (to_thread 2) (JNukeMethod "SplitSync.run" (JNukeSignature "V" (JNukeVector))) (pc 9) (line 18))
  (JNukeThreadSwitch (from_thread 2) (to_thread 2) (JNukeMethod "SplitSync.run" (JNukeSignature "V" (JNukeVector))) (pc 34) (line 23))
  (JNukeThreadSwitch (from_thread 2) (to_thread 1) (JNukeMethod "java/lang/Thread.run" (JNukeSignature "V" (JNukeVector))) (pc 7) (line 57))
)
)

(JNukeExitBlock (JNukeSchedule 
  (JNukeThreadSwitch (from_thread 0) (to_thread 0) (JNukeMethod "SplitSync.<init>" (JNukeSignature "V" (JNukeVector))) (pc 7) (line 11))
  (JNukeThreadSwitch (from_thread 0) (to_thread 1) (JNukeMethod "SplitSync.<init>" (JNukeSignature "V" (JNukeVector))) (pc 7) (line 11))
  (JNukeThreadSwitch (from_thread 1) (to_thread 1) (JNukeMethod "SplitSync.run" (JNukeSignature "V" (JNukeVector))) (pc 9) (line 18))
  (JNukeThreadSwitch (from_thread 1) (to_thread 1) (JNukeMethod "SplitSync.run" (JNukeSignature "V" (JNukeVector))) (pc 34) (line 23))
  (JNukeThreadSwitch (from_thread 1) (to_thread 2) (JNukeMethod "java/lang/Thread.run" (JNukeSignature "V" (JNukeVector))) (pc 7) (line 57))
  (JNukeThreadSwitch (from_thread 2) (to_thread 2) (JNukeMethod "SplitSync.run" (JNukeSignature "V" (JNukeVector))) (pc 9) (line 18))
  (JNukeThreadSwitch (from_thread 2) (to_thread 2) (JNukeMethod "SplitSync.run" (JNukeSignature "V" (JNukeVector))) (pc 34) (line 23))
  (JNukeThreadSwitch (from_thread 2) (to_thread 0) (JNukeMethod "java/lang/Thread.run" (JNukeSignature "V" (JNukeVector))) (pc 7) (line 57))
)
)

(JNukeExitBlock (JNukeSchedule 
  (JNukeThreadSwitch (from_thread 0) (to_thread 0) (JNukeMethod "SplitSync.<init>" (JNukeSignature "V" (JNukeVector))) (pc 7) (line 11))
  (JNukeThreadSwitch (from_thread 0) (to_thread 1) (JNukeMethod "SplitSync.<init>" (JNukeSignature "V" (JNukeVector))) (pc 7) (line 11))
  (JNukeThreadSwitch (from_thread 1) (to_thread 1) (JNukeMethod "SplitSync.run" (JNukeSignature "V" (JNukeVector))) (pc 9) (line 18))
  (JNukeThreadSwitch (from_thread 1) (to_thread 1) (JNukeMethod "SplitSync.run" (JNukeSignature "V" (JNukeVector))) (pc 34) (line 23))
  (JNukeThreadSwitch (from_thread 1) (to_thread 2) (JNukeMethod "java/lang/Thread.run" (JNukeSignature "V" (JNukeVector))) (pc 7) (line 57))
  (JNukeThreadSwitch (from_thread 2) (to_thread 0) (JNukeMethod "SplitSync.run" (JNukeSignature "V" (JNukeVector))) (pc 9) (line 18))
  (JNukeThreadSwitch (from_thread 0) (to_thread 2) (JNukeMethod "SplitSync.main" (JNukeSignature "V" (JNukeVector "[Ljava/lang/String;"))) (pc 9) (line 8))
)
)

(JNukeExitBlock (JNukeSchedule 
  (JNukeThreadSwitch (from_thread 0) (to_thread 0) (JNukeMethod "SplitSync.<init>" (JNukeSignature "V" (JNukeVector))) (pc 7) (line 11))
  (JNukeThreadSwitch (from_thread 0) (to_thread 1) (JNukeMethod "SplitSync.<init>" (JNukeSignature "V" (JNukeVector))) (pc 7) (line 11))
  (JNukeThreadSwitch (from_thread 1) (to_thread 1) (JNukeMethod "SplitSync.run" (JNukeSignature "V" (JNukeVector))) (pc 9) (line 18))
  (JNukeThreadSwitch (from_thread 1) (to_thread 2) (JNukeMethod "SplitSync.run" (JNukeSignature "V" (JNukeVector))) (pc 34) (line 23))
  (JNukeThreadSwitch (from_thread 2) (to_thread 2) (JNukeMethod "SplitSync.run" (JNukeSignature "V" (JNukeVector))) (pc 9) (line 18))
  (JNukeThreadSwitch (from_thread 2) (to_thread 2) (JNukeMethod "SplitSync.run" (JNukeSignature "V" (JNukeVector))) (pc 34) (line 23))
  (JNukeThreadSwitch (from_thread 2) (to_thread 0) (JNukeMethod "java/lang/Thread.run" (JNukeSignature "V" (JNukeVector))) (pc 7) (line 57))
  (JNukeThreadSwitch (from_thread 0) (to_thread 1) (JNukeMethod "SplitSync.main" (JNukeSignature "V" (JNukeVector "[Ljava/lang/String;"))) (pc 9) (line 8))
)
)

(JNukeExitBlock (JNukeSchedule 
  (JNukeThreadSwitch (from_thread 0) (to_thread 0) (JNukeMethod "SplitSync.<init>" (JNukeSignature "V" (JNukeVector))) (pc 7) (line 11))
  (JNukeThreadSwitch (from_thread 0) (to_thread 1) (JNukeMethod "SplitSync.<init>" (JNukeSignature "V" (JNukeVector))) (pc 7) (line 11))
  (JNukeThreadSwitch (from_thread 1) (to_thread 1) (JNukeMethod "SplitSync.run" (JNukeSignature "V" (JNukeVector))) (pc 9) (line 18))
  (JNukeThreadSwitch (from_thread 1) (to_thread 2) (JNukeMethod "SplitSync.run" (JNukeSignature "V" (JNukeVector))) (pc 34) (line 23))
  (JNukeThreadSwitch (from_thread 2) (to_thread 1) (JNukeMethod "SplitSync.run" (JNukeSignature "V" (JNukeVector))) (pc 9) (line 18))
  (JNukeThreadSwitch (from_thread 1) (to_thread 2) (JNukeMethod "java/lang/Thread.run" (JNukeSignature "V" (JNukeVector))) (pc 7) (line 57))
  (JNukeThreadSwitch (from_thread 2) (to_thread 2) (JNukeMethod "SplitSync.run" (JNukeSignature "V" (JNukeVector))) (pc 34) (line 23))
  (JNukeThreadSwitch (from_thread 2) (to_thread 0) (JNukeMethod "java/lang/Thread.run" (JNukeSignature "V" (JNukeVector))) (pc 7) (line 57))
)
)

(JNukeExitBlock (JNukeSchedule 
  (JNukeThreadSwitch (from_thread 0) (to_thread 0) (JNukeMethod "SplitSync.<init>" (JNukeSignature "V" (JNukeVector))) (pc 7) (line 11))
  (JNukeThreadSwitch (from_thread 0) (to_thread 1) (JNukeMethod "SplitSync.<init>" (JNukeSignature "V" (JNukeVector))) (pc 7) (line 11))
  (JNukeThreadSwitch (from_thread 1) (to_thread 1) (JNukeMethod "SplitSync.run" (JNukeSignature "V" (JNukeVector))) (pc 9) (line 18))
  (JNukeThreadSwitch (from_thread 1) (to_thread 2) (JNukeMethod "SplitSync.run" (JNukeSignature "V" (JNukeVector))) (pc 34) (line 23))
  (JNukeThreadSwitch (from_thread 2) (to_thread 0) (JNukeMethod "SplitSync.run" (JNukeSignature "V" (JNukeVector))) (pc 9) (line 18))
  (JNukeThreadSwitch (from_thread 0) (to_thread 1) (JNukeMethod "SplitSync.main" (JNukeSignature "V" (JNukeVector "[Ljava/lang/String;"))) (pc 9) (line 8))
  (JNukeThreadSwitch (from_thread 1) (to_thread 2) (JNukeMethod "java/lang/Thread.run" (JNukeSignature "V" (JNukeVector))) (pc 7) (line 57))
)
)

(JNukeExitBlock (JNukeSchedule 
  (JNukeThreadSwitch (from_thread 0) (to_thread 0) (JNukeMethod "SplitSync.<init>" (JNukeSignature "V" (JNukeVector))) (pc 7) (line 11))
  (JNukeThreadSwitch (from_thread 0) (to_thread 1) (JNukeMethod "SplitSync.<init>" (JNukeSignature "V" (JNukeVector))) (pc 7) (line 11))
  (JNukeThreadSwitch (from_thread 1) (to_thread 1) (JNukeMethod "SplitSync.run" (JNukeSignature "V" (JNukeVector))) (pc 9) (line 18))
  (JNukeThreadSwitch (from_thread 1) (to_thread 0) (JNukeMethod "SplitSync.run" (JNukeSignature "V" (JNukeVector))) (pc 34) (line 23))
  (JNukeThreadSwitch (from_thread 0) (to_thread 1) (JNukeMethod "SplitSync.main" (JNukeSignature "V" (JNukeVector "[Ljava/lang/String;"))) (pc 9) (line 8))
  (JNukeThreadSwitch (from_thread 1) (to_thread 2) (JNukeMethod "java/lang/Thread.run" (JNukeSignature "V" (JNukeVector))) (pc 7) (line 57))
)
)

Assertion failed at (vmState "SplitSync.run ()V" (line 21) (pc 26) (thread 1))
(JNukeExitBlock (JNukeSchedule 
  (JNukeThreadSwitch (from_thread 0) (to_thread 0) (JNukeMethod "SplitSync.<init>" (JNukeSignature "V" (JNukeVector))) (pc 7) (line 11))
  (JNukeThreadSwitch (from_thread 0) (to_thread 1) (JNukeMethod "SplitSync.<init>" (JNukeSignature "V" (JNukeVector))) (pc 7) (line 11))
  (JNukeThreadSwitch (from_thread 1) (to_thread 2) (JNukeMethod "SplitSync.run" (JNukeSignature "V" (JNukeVector))) (pc 9) (line 18))
  (JNukeThreadSwitch (from_thread 2) (to_thread 2) (JNukeMethod "SplitSync.run" (JNukeSignature "V" (JNukeVector))) (pc 9) (line 18))
  (JNukeThreadSwitch (from_thread 2) (to_thread 2) (JNukeMethod "SplitSync.run" (JNukeSignature "V" (JNukeVector))) (pc 34) (line 23))
  (JNukeThreadSwitch (from_thread 2) (to_thread 0) (JNukeMethod "java/lang/Thread.run" (JNukeSignature "V" (JNukeVector))) (pc 7) (line 57))
  (JNukeThreadSwitch (from_thread 0) (to_thread 1) (JNukeMethod "SplitSync.main" (JNukeSignature "V" (JNukeVector "[Ljava/lang/String;"))) (pc 9) (line 8))
)
)

Assertion failed at (vmState "SplitSync.run ()V" (line 21) (pc 26) (thread 2))
(JNukeExitBlock (JNukeSchedule 
  (JNukeThreadSwitch (from_thread 0) (to_thread 0) (JNukeMethod "SplitSync.<init>" (JNukeSignature "V" (JNukeVector))) (pc 7) (line 11))
  (JNukeThreadSwitch (from_thread 0) (to_thread 1) (JNukeMethod "SplitSync.<init>" (JNukeSignature "V" (JNukeVector))) (pc 7) (line 11))
  (JNukeThreadSwitch (from_thread 1) (to_thread 2) (JNukeMethod "SplitSync.run" (JNukeSignature "V" (JNukeVector))) (pc 9) (line 18))
  (JNukeThreadSwitch (from_thread 2) (to_thread 1) (JNukeMethod "SplitSync.run" (JNukeSignature "V" (JNukeVector))) (pc 9) (line 18))
  (JNukeThreadSwitch (from_thread 1) (to_thread 1) (JNukeMethod "SplitSync.run" (JNukeSignature "V" (JNukeVector))) (pc 34) (line 23))
  (JNukeThreadSwitch (from_thread 1) (to_thread 2) (JNukeMethod "java/lang/Thread.run" (JNukeSignature "V" (JNukeVector))) (pc 7) (line 57))
  (JNukeThreadSwitch (from_thread 2) (to_thread 2) (JNukeMethod "SplitSync.run" (JNukeSignature "V" (JNukeVector))) (pc 34) (line 23))
  (JNukeThreadSwitch (from_thread 2) (to_thread 0) (JNukeMethod "java/lang/Thread.run" (JNukeSignature "V" (JNukeVector))) (pc 7) (line 57))
)
)

Assertion failed at (vmState "SplitSync.run ()V" (line 21) (pc 26) (thread 2))
(JNukeExitBlock (JNukeSchedule 
  (JNukeThreadSwitch (from_thread 0) (to_thread 0) (JNukeMethod "SplitSync.<init>" (JNukeSignature "V" (JNukeVector))) (pc 7) (line 11))
  (JNukeThreadSwitch (from_thread 0) (to_thread 1) (JNukeMethod "SplitSync.<init>" (JNukeSignature "V" (JNukeVector))) (pc 7) (line 11))
  (JNukeThreadSwitch (from_thread 1) (to_thread 2) (JNukeMethod "SplitSync.run" (JNukeSignature "V" (JNukeVector))) (pc 9) (line 18))
  (JNukeThreadSwitch (from_thread 2) (to_thread 1) (JNukeMethod "SplitSync.run" (JNukeSignature "V" (JNukeVector))) (pc 9) (line 18))
  (JNukeThreadSwitch (from_thread 1) (to_thread 2) (JNukeMethod "SplitSync.run" (JNukeSignature "V" (JNukeVector))) (pc 34) (line 23))
  (JNukeThreadSwitch (from_thread 2) (to_thread 2) (JNukeMethod "SplitSync.run" (JNukeSignature "V" (JNukeVector))) (pc 34) (line 23))
  (JNukeThreadSwitch (from_thread 2) (to_thread 0) (JNukeMethod "java/lang/Thread.run" (JNukeSignature "V" (JNukeVector))) (pc 7) (line 57))
  (JNukeThreadSwitch (from_thread 0) (to_thread 1) (JNukeMethod "SplitSync.main" (JNukeSignature "V" (JNukeVector "[Ljava/lang/String;"))) (pc 9) (line 8))
)
)

Assertion failed at (vmState "SplitSync.run ()V" (line 21) (pc 26) (thread 2))
(JNukeExitBlock (JNukeSchedule 
  (JNukeThreadSwitch (from_thread 0) (to_thread 0) (JNukeMethod "SplitSync.<init>" (JNukeSignature "V" (JNukeVector))) (pc 7) (line 11))
  (JNukeThreadSwitch (from_thread 0) (to_thread 1) (JNukeMethod "SplitSync.<init>" (JNukeSignature "V" (JNukeVector))) (pc 7) (line 11))
  (JNukeThreadSwitch (from_thread 1) (to_thread 2) (JNukeMethod "SplitSync.run" (JNukeSignature "V" (JNukeVector))) (pc 9) (line 18))
  (JNukeThreadSwitch (from_thread 2) (to_thread 1) (JNukeMethod "SplitSync.run" (JNukeSignature "V" (JNukeVector))) (pc 9) (line 18))
  (JNukeThreadSwitch (from_thread 1) (to_thread 0) (JNukeMethod "SplitSync.run" (JNukeSignature "V" (JNukeVector))) (pc 34) (line 23))
  (JNukeThreadSwitch (from_thread 0) (to_thread 1) (JNukeMethod "SplitSync.main" (JNukeSignature "V" (JNukeVector "[Ljava/lang/String;"))) (pc 9) (line 8))
  (JNukeThreadSwitch (from_thread 1) (to_thread 2) (JNukeMethod "java/lang/Thread.run" (JNukeSignature "V" (JNukeVector))) (pc 7) (line 57))
)
)

Assertion failed at (vmState "SplitSync.run ()V" (line 21) (pc 26) (thread 2))
(JNukeExitBlock (JNukeSchedule 
  (JNukeThreadSwitch (from_thread 0) (to_thread 0) (JNukeMethod "SplitSync.<init>" (JNukeSignature "V" (JNukeVector))) (pc 7) (line 11))
  (JNukeThreadSwitch (from_thread 0) (to_thread 1) (JNukeMethod "SplitSync.<init>" (JNukeSignature "V" (JNukeVector))) (pc 7) (line 11))
  (JNukeThreadSwitch (from_thread 1) (to_thread 2) (JNukeMethod "SplitSync.run" (JNukeSignature "V" (JNukeVector))) (pc 9) (line 18))
  (JNukeThreadSwitch (from_thread 2) (to_thread 0) (JNukeMethod "SplitSync.run" (JNukeSignature "V" (JNukeVector))) (pc 9) (line 18))
  (JNukeThreadSwitch (from_thread 0) (to_thread 1) (JNukeMethod "SplitSync.main" (JNukeSignature "V" (JNukeVector "[Ljava/lang/String;"))) (pc 9) (line 8))
  (JNukeThreadSwitch (from_thread 1) (to_thread 1) (JNukeMethod "SplitSync.run" (JNukeSignature "V" (JNukeVector))) (pc 34) (line 23))
  (JNukeThreadSwitch (from_thread 1) (to_thread 2) (JNukeMethod "java/lang/Thread.run" (JNukeSignature "V" (JNukeVector))) (pc 7) (line 57))
)
)

(JNukeExitBlock (JNukeSchedule 
  (JNukeThreadSwitch (from_thread 0) (to_thread 0) (JNukeMethod "SplitSync.<init>" (JNukeSignature "V" (JNukeVector))) (pc 7) (line 11))
  (JNukeThreadSwitch (from_thread 0) (to_thread 1) (JNukeMethod "SplitSync.<init>" (JNukeSignature "V" (JNukeVector))) (pc 7) (line 11))
  (JNukeThreadSwitch (from_thread 1) (to_thread 0) (JNukeMethod "SplitSync.run" (JNukeSignature "V" (JNukeVector))) (pc 9) (line 18))
  (JNukeThreadSwitch (from_thread 0) (to_thread 1) (JNukeMethod "SplitSync.main" (JNukeSignature "V" (JNukeVector "[Ljava/lang/String;"))) (pc 9) (line 8))
  (JNukeThreadSwitch (from_thread 1) (to_thread 1) (JNukeMethod "SplitSync.run" (JNukeSignature "V" (JNukeVector))) (pc 34) (line 23))
  (JNukeThreadSwitch (from_thread 1) (to_thread 2) (JNukeMethod "java/lang/Thread.run" (JNukeSignature "V" (JNukeVector))) (pc 7) (line 57))
)
)

(JNukeExitBlock (JNukeSchedule 
  (JNukeThreadSwitch (from_thread 0) (to_thread 1) (JNukeMethod "SplitSync.<init>" (JNukeSignature "V" (JNukeVector))) (pc 7) (line 11))
  (JNukeThreadSwitch (from_thread 1) (to_thread 1) (JNukeMethod "SplitSync.run" (JNukeSignature "V" (JNukeVector))) (pc 9) (line 18))
  (JNukeThreadSwitch (from_thread 1) (to_thread 1) (JNukeMethod "SplitSync.run" (JNukeSignature "V" (JNukeVector))) (pc 34) (line 23))
  (JNukeThreadSwitch (from_thread 1) (to_thread 0) (JNukeMethod "java/lang/Thread.run" (JNukeSignature "V" (JNukeVector))) (pc 7) (line 57))
  (JNukeThreadSwitch (from_thread 0) (to_thread 0) (JNukeMethod "SplitSync.<init>" (JNukeSignature "V" (JNukeVector))) (pc 7) (line 11))
  (JNukeThreadSwitch (from_thread 0) (to_thread 2) (JNukeMethod "SplitSync.main" (JNukeSignature "V" (JNukeVector "[Ljava/lang/String;"))) (pc 9) (line 8))
)
)

(JNukeExitBlock (JNukeSchedule 
  (JNukeThreadSwitch (from_thread 0) (to_thread 1) (JNukeMethod "SplitSync.<init>" (JNukeSignature "V" (JNukeVector))) (pc 7) (line 11))
  (JNukeThreadSwitch (from_thread 1) (to_thread 1) (JNukeMethod "SplitSync.run" (JNukeSignature "V" (JNukeVector))) (pc 9) (line 18))
  (JNukeThreadSwitch (from_thread 1) (to_thread 0) (JNukeMethod "SplitSync.run" (JNukeSignature "V" (JNukeVector))) (pc 34) (line 23))
  (JNukeThreadSwitch (from_thread 0) (to_thread 0) (JNukeMethod "SplitSync.<init>" (JNukeSignature "V" (JNukeVector))) (pc 7) (line 11))
  (JNukeThreadSwitch (from_thread 0) (to_thread 1) (JNukeMethod "SplitSync.main" (JNukeSignature "V" (JNukeVector "[Ljava/lang/String;"))) (pc 9) (line 8))
  (JNukeThreadSwitch (from_thread 1) (to_thread 2) (JNukeMethod "java/lang/Thread.run" (JNukeSignature "V" (JNukeVector))) (pc 7) (line 57))
)
)

(JNukeExitBlock (JNukeSchedule 
  (JNukeThreadSwitch (from_thread 0) (to_thread 1) (JNukeMethod "SplitSync.<init>" (JNukeSignature "V" (JNukeVector))) (pc 7) (line 11))
  (JNukeThreadSwitch (from_thread 1) (to_thread 0) (JNukeMethod "SplitSync.run" (JNukeSignature "V" (JNukeVector))) (pc 9) (line 18))
  (JNukeThreadSwitch (from_thread 0) (to_thread 0) (JNukeMethod "SplitSync.<init>" (JNukeSignature "V" (JNukeVector))) (pc 7) (line 11))
  (JNukeThreadSwitch (from_thread 0) (to_thread 1) (JNukeMethod "SplitSync.main" (JNukeSignature "V" (JNukeVector "[Ljava/lang/String;"))) (pc 9) (line 8))
  (JNukeThreadSwitch (from_thread 1) (to_thread 1) (JNukeMethod "SplitSync.run" (JNukeSignature "V" (JNukeVector))) (pc 34) (line 23))
  (JNukeThreadSwitch (from_thread 1) (to_thread 2) (JNukeMethod "java/lang/Thread.run" (JNukeSignature "V" (JNukeVector))) (pc 7) (line 57))
)
)

Assertion failed at (vmState "SplitSync.run ()V" (line 21) (pc 26) (thread 1))
(JNukeExitBlock (JNukeSchedule 
  (JNukeThreadSwitch (from_thread 0) (to_thread 1) (JNukeMethod "SplitSync.<init>" (JNukeSignature "V" (JNukeVector))) (pc 7) (line 11))
  (JNukeThreadSwitch (from_thread 1) (to_thread 0) (JNukeMethod "SplitSync.run" (JNukeSignature "V" (JNukeVector))) (pc 9) (line 18))
  (JNukeThreadSwitch (from_thread 0) (to_thread 2) (JNukeMethod "SplitSync.<init>" (JNukeSignature "V" (JNukeVector))) (pc 7) (line 11))
  (JNukeThreadSwitch (from_thread 2) (to_thread 2) (JNukeMethod "SplitSync.run" (JNukeSignature "V" (JNukeVector))) (pc 9) (line 18))
  (JNukeThreadSwitch (from_thread 2) (to_thread 2) (JNukeMethod "SplitSync.run" (JNukeSignature "V" (JNukeVector))) (pc 34) (line 23))
  (JNukeThreadSwitch (from_thread 2) (to_thread 0) (JNukeMethod "java/lang/Thread.run" (JNukeSignature "V" (JNukeVector))) (pc 7) (line 57))
  (JNukeThreadSwitch (from_thread 0) (to_thread 1) (JNukeMethod "SplitSync.main" (JNukeSignature "V" (JNukeVector "[Ljava/lang/String;"))) (pc 9) (line 8))
)
)

Assertion failed at (vmState "SplitSync.run ()V" (line 21) (pc 26) (thread 2))
(JNukeExitBlock (JNukeSchedule 
  (JNukeThreadSwitch (from_thread 0) (to_thread 1) (JNukeMethod "SplitSync.<init>" (JNukeSignature "V" (JNukeVector))) (pc 7) (line 11))
  (JNukeThreadSwitch (from_thread 1) (to_thread 0) (JNukeMethod "SplitSync.run" (JNukeSignature "V" (JNukeVector))) (pc 9) (line 18))
  (JNukeThreadSwitch (from_thread 0) (to_thread 2) (JNukeMethod "SplitSync.<init>" (JNukeSignature "V" (JNukeVector))) (pc 7) (line 11))
  (JNukeThreadSwitch (from_thread 2) (to_thread 1) (JNukeMethod "SplitSync.run" (JNukeSignature "V" (JNukeVector))) (pc 9) (line 18))
  (JNukeThreadSwitch (from_thread 1) (to_thread 1) (JNukeMethod "SplitSync.run" (JNukeSignature "V" (JNukeVector))) (pc 34) (line 23))
  (JNukeThreadSwitch (from_thread 1) (to_thread 2) (JNukeMethod "java/lang/Thread.run" (JNukeSignature "V" (JNukeVector))) (pc 7) (line 57))
  (JNukeThreadSwitch (from_thread 2) (to_thread 2) (JNukeMethod "SplitSync.run" (JNukeSignature "V" (JNukeVector))) (pc 34) (line 23))
  (JNukeThreadSwitch (from_thread 2) (to_thread 0) (JNukeMethod "java/lang/Thread.run" (JNukeSignature "V" (JNukeVector))) (pc 7) (line 57))
)
)

Assertion failed at (vmState "SplitSync.run ()V" (line 21) (pc 26) (thread 2))
(JNukeExitBlock (JNukeSchedule 
  (JNukeThreadSwitch (from_thread 0) (to_thread 1) (JNukeMethod "SplitSync.<init>" (JNukeSignature "V" (JNukeVector))) (pc 7) (line 11))
  (JNukeThreadSwitch (from_thread 1) (to_thread 0) (JNukeMethod "SplitSync.run" (JNukeSignature "V" (JNukeVector))) (pc 9) (line 18))
  (JNukeThreadSwitch (from_thread 0) (to_thread 2) (JNukeMethod "SplitSync.<init>" (JNukeSignature "V" (JNukeVector))) (pc 7) (line 11))
  (JNukeThreadSwitch (from_thread 2) (to_thread 1) (JNukeMethod "SplitSync.run" (JNukeSignature "V" (JNukeVector))) (pc 9) (line 18))
  (JNukeThreadSwitch (from_thread 1) (to_thread 2) (JNukeMethod "SplitSync.run" (JNukeSignature "V" (JNukeVector))) (pc 34) (line 23))
  (JNukeThreadSwitch (from_thread 2) (to_thread 2) (JNukeMethod "SplitSync.run" (JNukeSignature "V" (JNukeVector))) (pc 34) (line 23))
  (JNukeThreadSwitch (from_thread 2) (to_thread 0) (JNukeMethod "java/lang/Thread.run" (JNukeSignature "V" (JNukeVector))) (pc 7) (line 57))
  (JNukeThreadSwitch (from_thread 0) (to_thread 1) (JNukeMethod "SplitSync.main" (JNukeSignature "V" (JNukeVector "[Ljava/lang/String;"))) (pc 9) (line 8))
)
)

Assertion failed at (vmState "SplitSync.run ()V" (line 21) (pc 26) (thread 2))
(JNukeExitBlock (JNukeSchedule 
  (JNukeThreadSwitch (from_thread 0) (to_thread 1) (JNukeMethod "SplitSync.<init>" (JNukeSignature "V" (JNukeVector))) (pc 7) (line 11))
  (JNukeThreadSwitch (from_thread 1) (to_thread 0) (JNukeMethod "SplitSync.run" (JNukeSignature "V" (JNukeVector))) (pc 9) (line 18))
  (JNukeThreadSwitch (from_thread 0) (to_thread 2) (JNukeMethod "SplitSync.<init>" (JNukeSignature "V" (JNukeVector))) (pc 7) (line 11))
  (JNukeThreadSwitch (from_thread 2) (to_thread 1) (JNukeMethod "SplitSync.run" (JNukeSignature "V" (JNukeVector))) (pc 9) (line 18))
  (JNukeThreadSwitch (from_thread 1) (to_thread 0) (JNukeMethod "SplitSync.run" (JNukeSignature "V" (JNukeVector))) (pc 34) (line 23))
  (JNukeThreadSwitch (from_thread 0) (to_thread 1) (JNukeMethod "SplitSync.main" (JNukeSignature "V" (JNukeVector "[Ljava/lang/String;"))) (pc 9) (line 8))
  (JNukeThreadSwitch (from_thread 1) (to_thread 2) (JNukeMethod "java/lang/Thread.run" (JNukeSignature "V" (JNukeVector))) (pc 7) (line 57))
)
)

Assertion failed at (vmState "SplitSync.run ()V" (line 21) (pc 26) (thread 2))
(JNukeExitBlock (JNukeSchedule 
  (JNukeThreadSwitch (from_thread 0) (to_thread 1) (JNukeMethod "SplitSync.<init>" (JNukeSignature "V" (JNukeVector))) (pc 7) (line 11))
  (JNukeThreadSwitch (from_thread 1) (to_thread 0) (JNukeMethod "SplitSync.run" (JNukeSignature "V" (JNukeVector))) (pc 9) (line 18))
  (JNukeThreadSwitch (from_thread 0) (to_thread 2) (JNukeMethod "SplitSync.<init>" (JNukeSignature "V" (JNukeVector))) (pc 7) (line 11))
  (JNukeThreadSwitch (from_thread 2) (to_thread 0) (JNukeMethod "SplitSync.run" (JNukeSignature "V" (JNukeVector))) (pc 9) (line 18))
  (JNukeThreadSwitch (from_thread 0) (to_thread 1) (JNukeMethod "SplitSync.main" (JNukeSignature "V" (JNukeVector "[Ljava/lang/String;"))) (pc 9) (line 8))
  (JNukeThreadSwitch (from_thread 1) (to_thread 1) (JNukeMethod "SplitSync.run" (JNukeSignature "V" (JNukeVector))) (pc 34) (line 23))
  (JNukeThreadSwitch (from_thread 1) (to_thread 2) (JNukeMethod "java/lang/Thread.run" (JNukeSignature "V" (JNukeVector))) (pc 7) (line 57))
)
)

(JNukeExitBlock (JNukeSchedule 
  (JNukeThreadSwitch (from_thread 0) (to_thread 1) (JNukeMethod "SplitSync.<init>" (JNukeSignature "V" (JNukeVector))) (pc 7) (line 11))
  (JNukeThreadSwitch (from_thread 1) (to_thread 0) (JNukeMethod "SplitSync.run" (JNukeSignature "V" (JNukeVector))) (pc 9) (line 18))
  (JNukeThreadSwitch (from_thread 0) (to_thread 1) (JNukeMethod "SplitSync.<init>" (JNukeSignature "V" (JNukeVector))) (pc 7) (line 11))
  (JNukeThreadSwitch (from_thread 1) (to_thread 1) (JNukeMethod "SplitSync.run" (JNukeSignature "V" (JNukeVector))) (pc 34) (line 23))
  (JNukeThreadSwitch (from_thread 1) (to_thread 2) (JNukeMethod "java/lang/Thread.run" (JNukeSignature "V" (JNukeVector))) (pc 7) (line 57))
  (JNukeThreadSwitch (from_thread 2) (to_thread 2) (JNukeMethod "SplitSync.run" (JNukeSignature "V" (JNukeVector))) (pc 9) (line 18))
  (JNukeThreadSwitch (from_thread 2) (to_thread 2) (JNukeMethod "SplitSync.run" (JNukeSignature "V" (JNukeVector))) (pc 34) (line 23))
  (JNukeThreadSwitch (from_thread 2) (to_thread 0) (JNukeMethod "java/lang/Thread.run" (JNukeSignature "V" (JNukeVector))) (pc 7) (line 57))
)
)

(JNukeExitBlock (JNukeSchedule 
  (JNukeThreadSwitch (from_thread 0) (to_thread 1) (JNukeMethod "SplitSync.<init>" (JNukeSignature "V" (JNukeVector))) (pc 7) (line 11))
  (JNukeThreadSwitch (from_thread 1) (to_thread 0) (JNukeMethod "SplitSync.run" (JNukeSignature "V" (JNukeVector))) (pc 9) (line 18))
  (JNukeThreadSwitch (from_thread 0) (to_thread 1) (JNukeMethod "SplitSync.<init>" (JNukeSignature "V" (JNukeVector))) (pc 7) (line 11))
  (JNukeThreadSwitch (from_thread 1) (to_thread 1) (JNukeMethod "SplitSync.run" (JNukeSignature "V" (JNukeVector))) (pc 34) (line 23))
  (JNukeThreadSwitch (from_thread 1) (to_thread 2) (JNukeMethod "java/lang/Thread.run" (JNukeSignature "V" (JNukeVector))) (pc 7) (line 57))
  (JNukeThreadSwitch (from_thread 2) (to_thread 0) (JNukeMethod "SplitSync.run" (JNukeSignature "V" (JNukeVector))) (pc 9) (line 18))
  (JNukeThreadSwitch (from_thread 0) (to_thread 2) (JNukeMethod "SplitSync.main" (JNukeSignature "V" (JNukeVector "[Ljava/lang/String;"))) (pc 9) (line 8))
)
)

(JNukeExitBlock (JNukeSchedule 
  (JNukeThreadSwitch (from_thread 0) (to_thread 1) (JNukeMethod "SplitSync.<init>" (JNukeSignature "V" (JNukeVector))) (pc 7) (line 11))
  (JNukeThreadSwitch (from_thread 1) (to_thread 0) (JNukeMethod "SplitSync.run" (JNukeSignature "V" (JNukeVector))) (pc 9) (line 18))
  (JNukeThreadSwitch (from_thread 0) (to_thread 1) (JNukeMethod "SplitSync.<init>" (JNukeSignature "V" (JNukeVector))) (pc 7) (line 11))
  (JNukeThreadSwitch (from_thread 1) (to_thread 2) (JNukeMethod "SplitSync.run" (JNukeSignature "V" (JNukeVector))) (pc 34) (line 23))
  (JNukeThreadSwitch (from_thread 2) (to_thread 2) (JNukeMethod "SplitSync.run" (JNukeSignature "V" (JNukeVector))) (pc 9) (line 18))
  (JNukeThreadSwitch (from_thread 2) (to_thread 2) (JNukeMethod "SplitSync.run" (JNukeSignature "V" (JNukeVector))) (pc 34) (line 23))
  (JNukeThreadSwitch (from_thread 2) (to_thread 0) (JNukeMethod "java/lang/Thread.run" (JNukeSignature "V" (JNukeVector))) (pc 7) (line 57))
  (JNukeThreadSwitch (from_thread 0) (to_thread 1) (JNukeMethod "SplitSync.main" (JNukeSignature "V" (JNukeVector "[Ljava/lang/String;"))) (pc 9) (line 8))
)
)

(JNukeExitBlock (JNukeSchedule 
  (JNukeThreadSwitch (from_thread 0) (to_thread 1) (JNukeMethod "SplitSync.<init>" (JNukeSignature "V" (JNukeVector))) (pc 7) (line 11))
  (JNukeThreadSwitch (from_thread 1) (to_thread 0) (JNukeMethod "SplitSync.run" (JNukeSignature "V" (JNukeVector))) (pc 9) (line 18))
  (JNukeThreadSwitch (from_thread 0) (to_thread 1) (JNukeMethod "SplitSync.<init>" (JNukeSignature "V" (JNukeVector))) (pc 7) (line 11))
  (JNukeThreadSwitch (from_thread 1) (to_thread 2) (JNukeMethod "SplitSync.run" (JNukeSignature "V" (JNukeVector))) (pc 34) (line 23))
  (JNukeThreadSwitch (from_thread 2) (to_thread 1) (JNukeMethod "SplitSync.run" (JNukeSignature "V" (JNukeVector))) (pc 9) (line 18))
  (JNukeThreadSwitch (from_thread 1) (to_thread 2) (JNukeMethod "java/lang/Thread.run" (JNukeSignature "V" (JNukeVector))) (pc 7) (line 57))
  (JNukeThreadSwitch (from_thread 2) (to_thread 2) (JNukeMethod "SplitSync.run" (JNukeSignature "V" (JNukeVector))) (pc 34) (line 23))
  (JNukeThreadSwitch (from_thread 2) (to_thread 0) (JNukeMethod "java/lang/Thread.run" (JNukeSignature "V" (JNukeVector))) (pc 7) (line 57))
)
)

(JNukeExitBlock (JNukeSchedule 
  (JNukeThreadSwitch (from_thread 0) (to_thread 1) (JNukeMethod "SplitSync.<init>" (JNukeSignature "V" (JNukeVector))) (pc 7) (line 11))
  (JNukeThreadSwitch (from_thread 1) (to_thread 0) (JNukeMethod "SplitSync.run" (JNukeSignature "V" (JNukeVector))) (pc 9) (line 18))
  (JNukeThreadSwitch (from_thread 0) (to_thread 1) (JNukeMethod "SplitSync.<init>" (JNukeSignature "V" (JNukeVector))) (pc 7) (line 11))
  (JNukeThreadSwitch (from_thread 1) (to_thread 2) (JNukeMethod "SplitSync.run" (JNukeSignature "V" (JNukeVector))) (pc 34) (line 23))
  (JNukeThreadSwitch (from_thread 2) (to_thread 0) (JNukeMethod "SplitSync.run" (JNukeSignature "V" (JNukeVector))) (pc 9) (line 18))
  (JNukeThreadSwitch (from_thread 0) (to_thread 1) (JNukeMethod "SplitSync.main" (JNukeSignature "V" (JNukeVector "[Ljava/lang/String;"))) (pc 9) (line 8))
  (JNukeThreadSwitch (from_thread 1) (to_thread 2) (JNukeMethod "java/lang/Thread.run" (JNukeSignature "V" (JNukeVector))) (pc 7) (line 57))
)
)

(JNukeExitBlock (JNukeSchedule 
  (JNukeThreadSwitch (from_thread 0) (to_thread 1) (JNukeMethod "SplitSync.<init>" (JNukeSignature "V" (JNukeVector))) (pc 7) (line 11))
  (JNukeThreadSwitch (from_thread 1) (to_thread 0) (JNukeMethod "SplitSync.run" (JNukeSignature "V" (JNukeVector))) (pc 9) (line 18))
  (JNukeThreadSwitch (from_thread 0) (to_thread 1) (JNukeMethod "SplitSync.<init>" (JNukeSignature "V" (JNukeVector))) (pc 7) (line 11))
  (JNukeThreadSwitch (from_thread 1) (to_thread 0) (JNukeMethod "SplitSync.run" (JNukeSignature "V" (JNukeVector))) (pc 34) (line 23))
  (JNukeThreadSwitch (from_thread 0) (to_thread 1) (JNukeMethod "SplitSync.main" (JNukeSignature "V" (JNukeVector "[Ljava/lang/String;"))) (pc 9) (line 8))
  (JNukeThreadSwitch (from_thread 1) (to_thread 2) (JNukeMethod "java/lang/Thread.run" (JNukeSignature "V" (JNukeVector))) (pc 7) (line 57))
)
)

