Reindeer 0 is on vacation
Reindeer 1 is on vacation
Reindeer 2 is on vacation
Reindeer 3 is on vacation
Reindeer 4 is on vacation
Reindeer 5 is on vacation
Reindeer 6 is on vacation
Reindeer 7 is on vacation
Reindeer 8 is on vacation
Elf 0 is building toys
7 is harnessed to sleigh
Elf 1 is building toys
Elf 2 is building toys
Reindeer 7 is pulling the sleigh
8 is harnessed to sleigh
Elf 3 is building toys
Elf 4 is building toys
0 is harnessed to sleigh
Reindeer 8 is pulling the sleigh
Elf 5 is building toys
1 is harnessed to sleigh
Elf 6 is building toys
Reindeer 0 is pulling the sleigh
Elf 7 is building toys
Reindeer 1 is pulling the sleigh
2 is harnessed to sleigh
Elf 8 is building toys
Santa is sleeping
Elf 9 is building toys
Reindeer 2 is pulling the sleigh
3 is harnessed to sleigh
4 is harnessed to sleigh
Reindeer 3 is pulling the sleigh
5 is harnessed to sleigh
Reindeer 4 is pulling the sleigh
6 is harnessed to sleigh
Santa is delivering toys
Reindeer 5 is pulling the sleigh
Santa is sleeping
Reindeer 6 is pulling the sleigh
0 is unharnessed
1 is unharnessed
Reindeer 0 is on vacation
2 is unharnessed
Reindeer 1 is on vacation
3 is unharnessed
Reindeer 2 is on vacation
4 is unharnessed
Reindeer 3 is on vacation
5 is unharnessed
Reindeer 4 is on vacation
6 is unharnessed
Reindeer 5 is on vacation
7 is unharnessed
Reindeer 6 is on vacation
8 is unharnessed
Reindeer 7 is on vacation
1 is in Santa's office
Reindeer 8 is on vacation
2 is in Santa's office
Elf 1 is asking questions
0 is in Santa's office
Elf 2 is asking questions
Santa is consulting
Santa is sleeping
Elf 0 is asking questions
1 has left Santa's office
2 has left Santa's office
Elf 1 is building toys
0 has left Santa's office
Elf 2 is building toys
7 is harnessed to sleigh
Elf 0 is building toys
8 is harnessed to sleigh
Reindeer 7 is pulling the sleigh
0 is harnessed to sleigh
Reindeer 8 is pulling the sleigh
1 is harnessed to sleigh
Reindeer 0 is pulling the sleigh
2 is harnessed to sleigh
Reindeer 1 is pulling the sleigh
3 is harnessed to sleigh
Reindeer 2 is pulling the sleigh
4 is harnessed to sleigh
Reindeer 3 is pulling the sleigh
5 is harnessed to sleigh
Reindeer 4 is pulling the sleigh
6 is harnessed to sleigh
Santa is delivering toys
Reindeer 5 is pulling the sleigh
Santa is sleeping
Reindeer 6 is pulling the sleigh
0 is unharnessed
1 is unharnessed
Reindeer 0 is on vacation
2 is unharnessed
Reindeer 1 is on vacation
3 is unharnessed
Reindeer 2 is on vacation
4 is unharnessed
Reindeer 3 is on vacation
5 is unharnessed
Reindeer 4 is on vacation
6 is unharnessed
Reindeer 5 is on vacation
7 is unharnessed
Reindeer 6 is on vacation
8 is unharnessed
Reindeer 7 is on vacation
3 is in Santa's office
Reindeer 8 is on vacation
4 is in Santa's office
Elf 3 is asking questions
1 is in Santa's office
Elf 4 is asking questions
Santa is consulting
Santa is sleeping
Elf 1 is asking questions
3 has left Santa's office
4 has left Santa's office
Elf 3 is building toys
1 has left Santa's office
Elf 4 is building toys
7 is harnessed to sleigh
Elf 1 is building toys
8 is harnessed to sleigh
Reindeer 7 is pulling the sleigh
0 is harnessed to sleigh
Reindeer 8 is pulling the sleigh
1 is harnessed to sleigh
Reindeer 0 is pulling the sleigh
2 is harnessed to sleigh
Reindeer 1 is pulling the sleigh
3 is harnessed to sleigh
Reindeer 2 is pulling the sleigh
4 is harnessed to sleigh
Reindeer 3 is pulling the sleigh
5 is harnessed to sleigh
Reindeer 4 is pulling the sleigh
6 is harnessed to sleigh
Santa is delivering toys
Reindeer 5 is pulling the sleigh
Santa is sleeping
Reindeer 6 is pulling the sleigh
0 is unharnessed
1 is unharnessed
Reindeer 0 is on vacation
2 is unharnessed
Reindeer 1 is on vacation
3 is unharnessed
Reindeer 2 is on vacation
4 is unharnessed
Reindeer 3 is on vacation
5 is unharnessed
Reindeer 4 is on vacation
6 is unharnessed
Reindeer 5 is on vacation
7 is unharnessed
Reindeer 6 is on vacation
8 is unharnessed
Reindeer 7 is on vacation
3 is in Santa's office
Reindeer 8 is on vacation
5 is in Santa's office
Elf 3 is asking questions
2 is in Santa's office
Elf 5 is asking questions
Santa is consulting
Santa is sleeping
Elf 2 is asking questions
3 has left Santa's office
5 has left Santa's office
Elf 3 is building toys
2 has left Santa's office
Elf 5 is building toys
7 is harnessed to sleigh
Elf 2 is building toys
8 is harnessed to sleigh
Reindeer 7 is pulling the sleigh
0 is harnessed to sleigh
Reindeer 8 is pulling the sleigh
1 is harnessed to sleigh
Reindeer 0 is pulling the sleigh
2 is harnessed to sleigh
Reindeer 1 is pulling the sleigh
3 is harnessed to sleigh
Reindeer 2 is pulling the sleigh
4 is harnessed to sleigh
Reindeer 3 is pulling the sleigh
5 is harnessed to sleigh
Reindeer 4 is pulling the sleigh
6 is harnessed to sleigh
Santa is delivering toys
Reindeer 5 is pulling the sleigh
Santa is sleeping
Reindeer 6 is pulling the sleigh
0 is unharnessed
1 is unharnessed
Reindeer 0 is on vacation
2 is unharnessed
Reindeer 1 is on vacation
3 is unharnessed
Reindeer 2 is on vacation
4 is unharnessed
Reindeer 3 is on vacation
5 is unharnessed
Reindeer 4 is on vacation
6 is unharnessed
Reindeer 5 is on vacation
7 is unharnessed
Reindeer 6 is on vacation
8 is unharnessed
Reindeer 7 is on vacation
4 is in Santa's office
Reindeer 8 is on vacation
6 is in Santa's office
Elf 4 is asking questions
3 is in Santa's office
Elf 6 is asking questions
Santa is consulting
Santa is sleeping
Elf 3 is asking questions
4 has left Santa's office
6 has left Santa's office
Elf 4 is building toys
3 has left Santa's office
Elf 6 is building toys
7 is harnessed to sleigh
Elf 3 is building toys
8 is harnessed to sleigh
Reindeer 7 is pulling the sleigh
0 is harnessed to sleigh
Reindeer 8 is pulling the sleigh
1 is harnessed to sleigh
Reindeer 0 is pulling the sleigh
2 is harnessed to sleigh
Reindeer 1 is pulling the sleigh
3 is harnessed to sleigh
Reindeer 2 is pulling the sleigh
4 is harnessed to sleigh
Reindeer 3 is pulling the sleigh
5 is harnessed to sleigh
Reindeer 4 is pulling the sleigh
6 is harnessed to sleigh
Santa is delivering toys
Reindeer 5 is pulling the sleigh
Santa is sleeping
Reindeer 6 is pulling the sleigh
0 is unharnessed
1 is unharnessed
Reindeer 0 is on vacation
2 is unharnessed
Reindeer 1 is on vacation
3 is unharnessed
Reindeer 2 is on vacation
4 is unharnessed
Reindeer 3 is on vacation
5 is unharnessed
Reindeer 4 is on vacation
6 is unharnessed
Reindeer 5 is on vacation
7 is unharnessed
Reindeer 6 is on vacation
8 is unharnessed
Reindeer 7 is on vacation
5 is in Santa's office
Reindeer 8 is on vacation
7 is in Santa's office
Elf 5 is asking questions
4 is in Santa's office
Elf 7 is asking questions
Santa is consulting
Santa is sleeping
Elf 4 is asking questions
5 has left Santa's office
7 has left Santa's office
Elf 5 is building toys
4 has left Santa's office
Elf 7 is building toys
7 is harnessed to sleigh
Elf 4 is building toys
8 is harnessed to sleigh
Reindeer 7 is pulling the sleigh
0 is harnessed to sleigh
Reindeer 8 is pulling the sleigh
1 is harnessed to sleigh
Reindeer 0 is pulling the sleigh
2 is harnessed to sleigh
Reindeer 1 is pulling the sleigh
3 is harnessed to sleigh
Reindeer 2 is pulling the sleigh
4 is harnessed to sleigh
Reindeer 3 is pulling the sleigh
5 is harnessed to sleigh
Reindeer 4 is pulling the sleigh
6 is harnessed to sleigh
Santa is delivering toys
Reindeer 5 is pulling the sleigh
Santa is sleeping
Reindeer 6 is pulling the sleigh
0 is unharnessed
1 is unharnessed
Reindeer 0 is on vacation
2 is unharnessed
Reindeer 1 is on vacation
3 is unharnessed
Reindeer 2 is on vacation
4 is unharnessed
Reindeer 3 is on vacation
5 is unharnessed
Reindeer 4 is on vacation
6 is unharnessed
Reindeer 5 is on vacation
7 is unharnessed
Reindeer 6 is on vacation
8 is unharnessed
Reindeer 7 is on vacation