(classPool
(JNukeClass "Dup_2" "Dup_2.java"
  (JNukeVar "I" "i")
  (JNukeVar "J" "l")
  (JNukeMethod "Dup_2.<init>" (JNukeSignature "V" (JNukeVector))
  (JNukeByteCodes
    (JNukeRByteCode 1 "     InvokeSpecial" (JNukeMethod "java/lang/Object.<init>" (JNukeSignature "V" (JNukeVector))) l0) (begin_of_basic_block 0) (end_of_basic_block (next_bb 2))
    (JNukeRByteCode 2 "<r0, r1> = Const" long 42 (line 5)) (begin_of_basic_block 2)
    (JNukeRByteCode 3 "r2 = Get" l0)
    (JNukeVector (JNukeRByteCode 4 "r3 = Get" r2) (JNukeRByteCode 4 "<r1, r2> = Get" r0 r1) (JNukeRByteCode 4 "r0 = Get" r3))
    (JNukeRByteCode 5 "r4 = Const" int 42)
    (JNukeRByteCode 6 "     PutField" "Dup_2" (pair "i" "I") r3 r4 (line 6)) (end_of_basic_block (next_bb 7))
    (JNukeRByteCode 7 "     PutField" "Dup_2" (pair "l" "J") r0 r1 r2) (begin_of_basic_block 7) (end_of_basic_block (next_bb 8))
    (JNukeRByteCode 8 "     Return" void (line 7)) (begin_of_basic_block 8) (end_of_basic_block)
))
)
)
