(classPool
(JNukeClass "DoWhile2" "DoWhile2.java"
  (JNukeVar "I" "i")
  (JNukeMethod "DoWhile2.<init>" (JNukeSignature "V" (JNukeVector))
  (JNukeByteCodes
    (JNukeRByteCode 1 "     InvokeSpecial" (JNukeMethod "java/lang/Object.<init>" (JNukeSignature "V" (JNukeVector))) l0) (begin_of_basic_block 0) (end_of_basic_block (next_bb 2))
    (JNukeRByteCode 2 "     Return" void) (begin_of_basic_block 2) (end_of_basic_block)
))
  (JNukeMethod "DoWhile2.main" (JNukeSignature "V" (JNukeVector "[Ljava/lang/String;"))
  (JNukeByteCodes
    (JNukeRByteCode 0 "r0 = GetStatic" "DoWhile2" (pair "i" "I") (line 5)) (begin_of_basic_block 0) (end_of_basic_block (next_bb 1))
    (JNukeRByteCode 1 "l1 = Get" r0) (begin_of_basic_block 1) (end_of_basic_block (next_bb 2))
    (JNukeRByteCode 2 "     Inc" l1 0x1 (line 7)) (begin_of_basic_block 2)
    (JNukeRByteCode 4 "r1 = Const" int 10)
    (JNukeRByteCode 5 "     Cond" if_icmplt 2 l1 r1) (end_of_basic_block (next_bb 2 6))
    (JNukeRByteCode 6 "     Return" void (line 9)) (begin_of_basic_block 6) (end_of_basic_block)
))
  (JNukeMethod "DoWhile2.<clinit>" (JNukeSignature "V" (JNukeVector))
  (JNukeByteCodes
    (JNukeRByteCode 0 "r0 = Const" int 1 (line 2)) (begin_of_basic_block 0)
    (JNukeRByteCode 1 "     PutStatic" "DoWhile2" (pair "i" "I") r0) (end_of_basic_block (next_bb 2))
    (JNukeRByteCode 2 "     Return" void) (begin_of_basic_block 2) (end_of_basic_block)
))
)
)
