%!PS-Adobe-2.0
%%Creator: dot version 1.8.5 (Wed May 19 09:04:31 CEST 2004)
%%For: (cartho) Cyrille Artho,,,
%%Title: G
%%Pages: (atend)
%%BoundingBox: 35 35 239 305
%%EndComments
save
%%BeginProlog
/DotDict 200 dict def
DotDict begin

/setupLatin1 {
mark
/EncodingVector 256 array def
 EncodingVector 0

ISOLatin1Encoding 0 255 getinterval putinterval

EncodingVector
  dup 306 /AE
  dup 301 /Aacute
  dup 302 /Acircumflex
  dup 304 /Adieresis
  dup 300 /Agrave
  dup 305 /Aring
  dup 303 /Atilde
  dup 307 /Ccedilla
  dup 311 /Eacute
  dup 312 /Ecircumflex
  dup 313 /Edieresis
  dup 310 /Egrave
  dup 315 /Iacute
  dup 316 /Icircumflex
  dup 317 /Idieresis
  dup 314 /Igrave
  dup 334 /Udieresis
  dup 335 /Yacute
  dup 376 /thorn
  dup 337 /germandbls
  dup 341 /aacute
  dup 342 /acircumflex
  dup 344 /adieresis
  dup 346 /ae
  dup 340 /agrave
  dup 345 /aring
  dup 347 /ccedilla
  dup 351 /eacute
  dup 352 /ecircumflex
  dup 353 /edieresis
  dup 350 /egrave
  dup 355 /iacute
  dup 356 /icircumflex
  dup 357 /idieresis
  dup 354 /igrave
  dup 360 /dcroat
  dup 361 /ntilde
  dup 363 /oacute
  dup 364 /ocircumflex
  dup 366 /odieresis
  dup 362 /ograve
  dup 365 /otilde
  dup 370 /oslash
  dup 372 /uacute
  dup 373 /ucircumflex
  dup 374 /udieresis
  dup 371 /ugrave
  dup 375 /yacute
  dup 377 /ydieresis  

% Set up ISO Latin 1 character encoding
/starnetISO {
        dup dup findfont dup length dict begin
        { 1 index /FID ne { def }{ pop pop } ifelse
        } forall
        /Encoding EncodingVector def
        currentdict end definefont
} def
/Times-Roman starnetISO def
/Times-Italic starnetISO def
/Times-Bold starnetISO def
/Times-BoldItalic starnetISO def
/Helvetica starnetISO def
/Helvetica-Oblique starnetISO def
/Helvetica-Bold starnetISO def
/Helvetica-BoldOblique starnetISO def
/Courier starnetISO def
/Courier-Oblique starnetISO def
/Courier-Bold starnetISO def
/Courier-BoldOblique starnetISO def
cleartomark
} bind def

%%BeginResource: procset
/coord-font-family /Times-Roman def
/default-font-family /Times-Roman def
/coordfont coord-font-family findfont 8 scalefont def

/InvScaleFactor 1.0 def
/set_scale {
	dup 1 exch div /InvScaleFactor exch def
	dup scale
} bind def

% styles
/solid { } bind def
/dashed { [9 InvScaleFactor mul dup ] 0 setdash } bind def
/dotted { [1 InvScaleFactor mul 6 InvScaleFactor mul] 0 setdash } bind def
/invis {/fill {newpath} def /stroke {newpath} def /show {pop newpath} def} bind def
/bold { 2 setlinewidth } bind def
/filled { } bind def
/unfilled { } bind def
/rounded { } bind def
/diagonals { } bind def

% hooks for setting color 
/nodecolor { sethsbcolor } bind def
/edgecolor { sethsbcolor } bind def
/graphcolor { sethsbcolor } bind def
/nopcolor {pop pop pop} bind def

/beginpage {	% i j npages
	/npages exch def
	/j exch def
	/i exch def
	/str 10 string def
	npages 1 gt {
		gsave
			coordfont setfont
			0 0 moveto
			(() show i str cvs show (,) show j str cvs show ()) show
		grestore
	} if
} bind def

/set_font {
	findfont exch
	scalefont setfont
} def

% draw aligned label in bounding box aligned to current point
/alignedtext {			% width adj text
	/text exch def
	/adj exch def
	/width exch def
	gsave
		width 0 gt {
			text stringwidth pop adj mul 0 rmoveto
		} if
		[] 0 setdash
		text show
	grestore
} def

/boxprim {				% xcorner ycorner xsize ysize
		4 2 roll
		moveto
		2 copy
		exch 0 rlineto
		0 exch rlineto
		pop neg 0 rlineto
		closepath
} bind def

/ellipse_path {
	/ry exch def
	/rx exch def
	/y exch def
	/x exch def
	matrix currentmatrix
	newpath
	x y translate
	rx ry scale
	0 0 1 0 360 arc
	setmatrix
} bind def

/endpage { showpage } bind def

/layercolorseq
	[	% layer color sequence - darkest to lightest
		[0 0 0]
		[.2 .8 .8]
		[.4 .8 .8]
		[.6 .8 .8]
		[.8 .8 .8]
	]
def

/setlayer {/maxlayer exch def /curlayer exch def
	layercolorseq curlayer get
	aload pop sethsbcolor
	/nodecolor {nopcolor} def
	/edgecolor {nopcolor} def
	/graphcolor {nopcolor} def
} bind def

/onlayer { curlayer ne {invis} if } def

/onlayers {
	/myupper exch def
	/mylower exch def
	curlayer mylower lt
	curlayer myupper gt
	or
	{invis} if
} def

/curlayer 0 def

%%EndResource
%%EndProlog
%%BeginSetup
14 default-font-family set_font
1 setmiterlimit
% /arrowlength 10 def
% /arrowwidth 5 def

% make sure pdfmark is harmless for PS-interpreters other than Distiller
/pdfmark where {pop} {userdict /pdfmark /cleartomark load put} ifelse
% make '<<' and '>>' safe on PS Level 1 devices
/languagelevel where {pop languagelevel}{1} ifelse
2 lt {
    userdict (<<) cvn ([) cvn load put
    userdict (>>) cvn ([) cvn load put
} if

%%EndSetup
%%Page: 1 1
%%PageBoundingBox: 36 36 239 305
%%PageOrientation: Portrait
gsave
35 35 204 270 boxprim clip newpath
36 36 translate
0 0 1 beginpage
0 0 translate 0 rotate
0.000 0.000 0.000 graphcolor
14.00 /Times-Roman set_font

%	algo
gsave 10 dict begin
137 170 27 18 ellipse_path
stroke
gsave 10 dict begin
137 165 moveto 28 -0.5 (algo) alignedtext
end grestore
end grestore

%	java
gsave 10 dict begin
101 98 27 18 ellipse_path
stroke
gsave 10 dict begin
101 93 moveto 29 -0.5 (java) alignedtext
end grestore
end grestore

%	algo -> java
newpath 128 153 moveto
124 144 119 134 114 124 curveto
stroke
0.000 0.000 0.000 edgecolor
newpath 112 125 moveto
110 115 lineto
116 123 lineto
closepath
fill
0.000 0.000 0.000 edgecolor

%	jar
gsave 10 dict begin
101 26 27 18 ellipse_path
stroke
gsave 10 dict begin
101 21 moveto 19 -0.5 (jar) alignedtext
end grestore
end grestore

%	java -> jar
newpath 95 80 moveto
94 72 94 63 94 54 curveto
stroke
0.000 0.000 0.000 edgecolor
newpath 92 54 moveto
95 44 lineto
96 54 lineto
closepath
fill
0.000 0.000 0.000 edgecolor

%	jar -> java
newpath 108 70 moveto
108 61 108 52 107 44 curveto
stroke
0.000 0.000 0.000 edgecolor
newpath 110 70 moveto
107 80 lineto
106 70 lineto
closepath
fill
0.000 0.000 0.000 edgecolor

%	rv
gsave 10 dict begin
65 242 27 18 ellipse_path
stroke
gsave 10 dict begin
65 237 moveto 15 -0.5 (rv) alignedtext
end grestore
end grestore

%	rv -> algo
newpath 80 227 moveto
90 217 103 204 115 192 curveto
stroke
0.000 0.000 0.000 edgecolor
newpath 113 190 moveto
122 185 lineto
117 194 lineto
closepath
fill
0.000 0.000 0.000 edgecolor

%	rv -> java
newpath 51 226 moveto
37 208 18 178 29 152 curveto
40 128 50 119 67 110 curveto
stroke
0.000 0.000 0.000 edgecolor
newpath 66 108 moveto
76 105 lineto
68 112 lineto
closepath
fill
0.000 0.000 0.000 edgecolor

%	vm
gsave 10 dict begin
65 170 27 18 ellipse_path
stroke
gsave 10 dict begin
65 165 moveto 23 -0.5 (vm) alignedtext
end grestore
end grestore

%	rv -> vm
newpath 65 224 moveto
65 216 65 207 65 198 curveto
stroke
0.000 0.000 0.000 edgecolor
newpath 63 198 moveto
65 188 lineto
68 198 lineto
closepath
fill
0.000 0.000 0.000 edgecolor

%	vm -> java
newpath 74 153 moveto
78 144 83 134 88 124 curveto
stroke
0.000 0.000 0.000 edgecolor
newpath 86 123 moveto
92 115 lineto
90 125 lineto
closepath
fill
0.000 0.000 0.000 edgecolor

%	sa
gsave 10 dict begin
164 242 27 18 ellipse_path
stroke
gsave 10 dict begin
164 237 moveto 13 -0.5 (sa) alignedtext
end grestore
end grestore

%	sa -> algo
newpath 157 224 moveto
154 216 151 206 147 197 curveto
stroke
0.000 0.000 0.000 edgecolor
newpath 145 198 moveto
143 188 lineto
149 196 lineto
closepath
fill
0.000 0.000 0.000 edgecolor

%	sa -> java
newpath 171 224 moveto
177 206 183 175 173 152 curveto
162 128 152 119 135 110 curveto
stroke
0.000 0.000 0.000 edgecolor
newpath 134 112 moveto
126 105 lineto
136 108 lineto
closepath
fill
0.000 0.000 0.000 edgecolor
endpage
grestore
%%PageTrailer
%%EndPage: 1
%%Trailer
%%Pages: 1
end
restore
%%EOF
