(classPool
(JNukeClass "FinallyNested2" "FinallyNested2.java"
  (JNukeMethod "FinallyNested2.<init>" (JNukeSignature "V" (JNukeVector))
  (JNukeLocalVars
    (JNukeLocalVarEntry 0 0 3 (JNukeVar "LFinallyNested2;" "this"))
  )
  (JNukeByteCodes
    (JNukeAByteCode 0 "Load" ref 0x0 (line 1))
    (JNukeAByteCode 1 "InvokeSpecial" (JNukeMethod "java/lang/Object.<init>" (JNukeSignature "V" (JNukeVector))))
    (JNukeAByteCode 2 "Return" void)
))
  (JNukeMethod "FinallyNested2.m" (JNukeSignature "V" (JNukeVector "Z"))
  (JNukeLocalVars
    (JNukeLocalVarEntry 0 0 53 (JNukeVar "LFinallyNested2;" "this"))
    (JNukeLocalVarEntry 1 0 53 (JNukeVar "Z" "b"))
    (JNukeLocalVarEntry 2 4 17 (JNukeVar "I" "c"))
    (JNukeLocalVarEntry 2 20 33 (JNukeVar "I" "c"))
    (JNukeLocalVarEntry 2 37 50 (JNukeVar "I" "c"))
  )
  (JNukeEHandlers
    (JNukeEHandlerDesc (JNukeMethod "FinallyNested2.m" (JNukeSignature "V" (JNukeVector "Z"))) "<Any exception>" 0 1 34)
    (JNukeEHandlerDesc (JNukeMethod "FinallyNested2.m" (JNukeSignature "V" (JNukeVector "Z"))) "<Any exception>" 17 17 34)
    (JNukeEHandlerDesc (JNukeMethod "FinallyNested2.m" (JNukeSignature "V" (JNukeVector "Z"))) "<Any exception>" 33 33 34)
    (JNukeEHandlerDesc (JNukeMethod "FinallyNested2.m" (JNukeSignature "V" (JNukeVector "Z"))) "<Any exception>" 4 5 12)
    (JNukeEHandlerDesc (JNukeMethod "FinallyNested2.m" (JNukeSignature "V" (JNukeVector "Z"))) "<Any exception>" 8 8 12)
    (JNukeEHandlerDesc (JNukeMethod "FinallyNested2.m" (JNukeSignature "V" (JNukeVector "Z"))) "<Any exception>" 11 11 12)
    (JNukeEHandlerDesc (JNukeMethod "FinallyNested2.m" (JNukeSignature "V" (JNukeVector "Z"))) "<Any exception>" 20 21 28)
    (JNukeEHandlerDesc (JNukeMethod "FinallyNested2.m" (JNukeSignature "V" (JNukeVector "Z"))) "<Any exception>" 24 24 28)
    (JNukeEHandlerDesc (JNukeMethod "FinallyNested2.m" (JNukeSignature "V" (JNukeVector "Z"))) "<Any exception>" 27 27 28)
    (JNukeEHandlerDesc (JNukeMethod "FinallyNested2.m" (JNukeSignature "V" (JNukeVector "Z"))) "<Any exception>" 37 38 45)
    (JNukeEHandlerDesc (JNukeMethod "FinallyNested2.m" (JNukeSignature "V" (JNukeVector "Z"))) "<Any exception>" 41 41 45)
    (JNukeEHandlerDesc (JNukeMethod "FinallyNested2.m" (JNukeSignature "V" (JNukeVector "Z"))) "<Any exception>" 44 44 45)
  )
  (JNukeByteCodes
    (JNukeAByteCode 0 "Load" int 0x1 (line 5))
    (JNukeAByteCode 1 "Cond" ifeq 18)
      (JNukeAByteCode 2 "Const" int 0 (line 7))
      (JNukeAByteCode 3 "Store" int 0x2)
      (JNukeAByteCode 4 "Load" int 0x1 (line 9))
      (JNukeAByteCode 5 "Cond" ifeq 9)
        (JNukeAByteCode 6 "Const" int 0 (line 11))
        (JNukeAByteCode 7 "Store" int 0x1)
      (JNukeAByteCode 8 "Return" void (line 9))
        (JNukeAByteCode 9 "Const" int 0 (line 11))
        (JNukeAByteCode 10 "Store" int 0x1)
      (JNukeAByteCode 11 "Goto" 17 (line 9))
      (JNukeAByteCode 12 "Store" ref 0x5 (line 11))
        (JNukeAByteCode 13 "Const" int 0)
        (JNukeAByteCode 14 "Store" int 0x1)
      (JNukeAByteCode 15 "Load" ref 0x5)
      (JNukeAByteCode 16 "Athrow")
    (JNukeAByteCode 17 "Return" void (line 5))
      (JNukeAByteCode 18 "Const" int 0 (line 7))
      (JNukeAByteCode 19 "Store" int 0x2)
      (JNukeAByteCode 20 "Load" int 0x1 (line 9))
      (JNukeAByteCode 21 "Cond" ifeq 25)
        (JNukeAByteCode 22 "Const" int 0 (line 11))
        (JNukeAByteCode 23 "Store" int 0x1)
      (JNukeAByteCode 24 "Return" void (line 9))
        (JNukeAByteCode 25 "Const" int 0 (line 11))
        (JNukeAByteCode 26 "Store" int 0x1)
      (JNukeAByteCode 27 "Goto" 33 (line 9))
      (JNukeAByteCode 28 "Store" ref 0x5 (line 11))
        (JNukeAByteCode 29 "Const" int 0)
        (JNukeAByteCode 30 "Store" int 0x1)
      (JNukeAByteCode 31 "Load" ref 0x5)
      (JNukeAByteCode 32 "Athrow")
    (JNukeAByteCode 33 "Goto" 52 (line 5))
    (JNukeAByteCode 34 "Store" ref 0x3 (line 7))
      (JNukeAByteCode 35 "Const" int 0)
      (JNukeAByteCode 36 "Store" int 0x2)
      (JNukeAByteCode 37 "Load" int 0x1 (line 9))
      (JNukeAByteCode 38 "Cond" ifeq 42)
        (JNukeAByteCode 39 "Const" int 0 (line 11))
        (JNukeAByteCode 40 "Store" int 0x1)
      (JNukeAByteCode 41 "Return" void (line 9))
        (JNukeAByteCode 42 "Const" int 0 (line 11))
        (JNukeAByteCode 43 "Store" int 0x1)
      (JNukeAByteCode 44 "Goto" 50 (line 9))
      (JNukeAByteCode 45 "Store" ref 0x5 (line 11))
        (JNukeAByteCode 46 "Const" int 0)
        (JNukeAByteCode 47 "Store" int 0x1)
      (JNukeAByteCode 48 "Load" ref 0x5)
      (JNukeAByteCode 49 "Athrow")
    (JNukeAByteCode 50 "Load" ref 0x3 (line 7))
    (JNukeAByteCode 51 "Athrow")
    (JNukeAByteCode 52 "Return" void (line 14))
))
)
)
