#FIG 3.2
Landscape
Center
Metric
A4      
100.00
Single
-2
1200 2
6 1440 1530 1800 2115
4 0 0 50 0 16 12 1.5708 4 135 585 1575 2115 current\001
4 0 0 50 0 16 12 1.5708 4 135 465 1800 2115 value\001
-6
6 1440 2250 1800 2745
4 0 0 50 0 16 12 1.5708 4 135 390 1575 2745 stale\001
4 0 0 50 0 16 12 1.5708 4 135 465 1800 2745 value\001
-6
6 5310 2430 6885 3285
6 5400 2565 6840 3195
4 0 0 50 0 16 12 0.0000 4 135 1020 5400 2700 local data is\001
4 0 0 50 0 16 12 0.0000 4 135 1305 5400 2925 used in another\001
4 0 0 50 0 16 12 0.0000 4 180 1410 5400 3150 shared operation\001
-6
2 2 0 1 0 7 60 0 -1 0.000 0 0 -1 0 0 5
	 5310 2430 6885 2430 6885 3285 5310 3285 5310 2430
-6
6 5310 1575 6705 2160
6 5445 1665 6660 2070
4 0 0 50 0 16 12 0.0000 4 135 1185 5445 1800 shared data is\001
4 0 0 50 0 16 12 0.0000 4 180 1020 5445 2025 used locally\001
-6
2 2 0 1 0 7 60 0 -1 0.000 0 0 -1 0 0 5
	 5310 1575 6705 1575 6705 2160 5310 2160 5310 1575
-6
2 1 0 2 0 7 50 0 -1 0.000 0 0 -1 0 0 2
	 1980 1530 2160 1530
2 1 0 2 0 7 50 0 -1 0.000 0 0 -1 0 0 2
	 2070 1530 2070 2115
2 1 2 2 0 7 50 0 -1 4.500 0 0 -1 1 0 2
	0 0 2.00 180.00 240.00
	 2070 2115 2070 2925
2 1 0 2 0 7 50 0 -1 0.000 0 0 -1 0 0 2
	 1980 2115 2160 2115
2 5 0 1 0 -1 50 0 -1 0.000 0 0 -1 0 0 5
	0 ../java/non-atomic.eps
	 2385 961 5089 961 5089 3285 2385 3285 2385 961
3 0 0 1 0 7 50 0 -1 0.000 0 1 0 3
	1 1 1.00 90.00 120.00
	 2610 1845 2160 1980 2385 2295
	 0.000 1.000 0.000
3 0 0 1 0 7 50 0 -1 0.000 0 1 0 3
	1 1 1.00 90.00 120.00
	 2385 2295 2160 2475 2610 2745
	 0.000 1.000 0.000
