(JNukeThread (num 0) (alive) (ready_to_run) (assigned))
(JNukeMethodEvent NA2Main.main (methodstart) (vmState "NA2Main.main ([Ljava/lang/String;)V" (pc 0) (thread 0)))
(JNukeRByteCode 0 "r1 = New" "NARunner" (line 3))
(JNukeRByteCode 1 "r2 = Get" r1 (line 3))
(JNukeMethodEvent NARunner.<init> (methodstart) (vmState "NARunner.<init> ()V" (pc 0) (thread 0)))
(JNukeRByteCode 2 "     InvokeSpecial" (JNukeMethod "NARunner.<init>" (JNukeSignature "V" (JNukeVector))) r2 (line 3))
(JNukeRByteCode 0 "r1 = Get" r0 (line 1))
(JNukeRByteCode 1 "     InvokeSpecial" (JNukeMethod "java/lang/Thread.<init>" (JNukeSignature "V" (JNukeVector))) r1 (line 1))
(JNukeThread (num 1) (assigned))
(JNukeMethodEvent NARunner.<init> (methodend) (vmState "NARunner.<init> ()V" (line 1) (pc 2) (thread 0)))
(JNukeRByteCode 2 "     Return" void (line 1))
(JNukeMethodEvent NARunner.run (methodstart) (vmState "NA2Main.main ([Ljava/lang/String;)V" (line 3) (pc 3) (thread 1)))
(JNukeRByteCode 3 "     InvokeVirtual" (JNukeMethod "NARunner.start" (JNukeSignature "V" (JNukeVector))) r1 (line 3))
(JNukeMethodEvent NA2Main.main (methodend) (vmState "NA2Main.main ([Ljava/lang/String;)V" (line 4) (pc 4) (thread 0)))
(JNukeRByteCode 4 "     Return" void (line 4))
(JNukeRByteCode 0 "r1 = New" "NonAtomic" (line 3))
(JNukeRByteCode 1 "r2 = Get" r1 (line 3))
(JNukeMethodEvent NonAtomic.<init> (methodstart) (vmState "NonAtomic.<init> ()V" (pc 0) (thread 1)))
(JNukeRByteCode 2 "     InvokeSpecial" (JNukeMethod "NonAtomic.<init>" (JNukeSignature "V" (JNukeVector))) r2 (line 3))
(JNukeRByteCode 0 "r1 = Get" r0 (line 1))
(JNukeRByteCode 1 "     InvokeSpecial" (JNukeMethod "java/lang/Object.<init>" (JNukeSignature "V" (JNukeVector))) r1 (line 1))
(JNukeMethodEvent NonAtomic.<init> (methodend) (vmState "NonAtomic.<init> ()V" (line 1) (pc 2) (thread 1)))
(JNukeRByteCode 2 "     Return" void (line 1))
(JNukeMethodEvent NonAtomic.inc (methodstart) (vmState "NonAtomic.inc ()V" (pc 0) (thread 1)))
(JNukeRByteCode 3 "     InvokeVirtual" (JNukeMethod "NonAtomic.inc" (JNukeSignature "V" (JNukeVector))) r1 (line 3))
(JNukeRByteCode 0 "r5 = Get" r0 (line 10))
(JNukeRByteCode 1 "r6 = Get" r5 (line 10))
(JNukeRByteCode 2 "r2 = Get" r6 (line 10))
(JNukeLockAccess (JNukeLockInfo "NonAtomic") (vmState "NonAtomic.inc ()V" (line 10) (pc 3) (thread 1)))
(JNukeRByteCode 3 "     MonitorEnter" r5 (line 10))
(JNukeRByteCode 4 "r5 = Get" r0 (line 11))
(JNukeFieldAccess (JNukeField "NonAtomic.i") (lockSet 1 (JNukeLockInfo "NonAtomic")) (vmState "NonAtomic.inc ()V" (line 11) (pc 5) (thread 1)))
(JNukeRByteCode 5 "r5 = GetField" "NonAtomic" (pair "i" "I") r5 (line 11))
(JNukeRByteCode 6 "r1 = Get" r5 (line 11))
(JNukeRByteCode 7 "r5 = Get" r2 (line 12))
(JNukeLockAccess (JNukeLockInfo "NonAtomic") (vmState "NonAtomic.inc ()V" (line 12) (pc 9) (thread 1)))
(JNukeRByteCode 8 "     MonitorExit" r5 (line 12))
(JNukeRByteCode 9 "     Goto" 15 (line 12))
(JNukeRByteCode 15 "     Inc" l1 0x1 (line 13))
(JNukeRByteCode 16 "r5 = Get" r0 (line 14))
(JNukeRByteCode 17 "r6 = Get" r5 (line 14))
(JNukeRByteCode 18 "r3 = Get" r6 (line 14))
(JNukeLockAccess (JNukeLockInfo "NonAtomic") (vmState "NonAtomic.inc ()V" (line 14) (pc 19) (thread 1)))
(JNukeRByteCode 19 "     MonitorEnter" r5 (line 14))
(JNukeRByteCode 20 "r5 = Get" r0 (line 15))
(JNukeRByteCode 21 "r6 = Get" r1 (line 15))
(JNukeFieldAccess (JNukeField "NonAtomic.i") (lockSet 1 (JNukeLockInfo "NonAtomic")) (vmState "NonAtomic.inc ()V" (line 15) (pc 22) (thread 1)))
(JNukeRByteCode 22 "     PutField" "NonAtomic" (pair "i" "I") r5 r6 (line 15))
(JNukeRByteCode 23 "r5 = Get" r3 (line 16))
(JNukeLockAccess (JNukeLockInfo "NonAtomic") (vmState "NonAtomic.inc ()V" (line 16) (pc 25) (thread 1)))
(JNukeRByteCode 24 "     MonitorExit" r5 (line 16))
(JNukeRByteCode 25 "     Goto" 31 (line 16))
(JNukeMethodEvent NonAtomic.inc (methodend) (vmState "NonAtomic.inc ()V" (line 17) (pc 31) (thread 1)))
(JNukeRByteCode 31 "     Return" void (line 17))
(JNukeMethodEvent NARunner.run (methodend) (vmState "NARunner.run ()V" (line 4) (pc 4) (thread 1)))
(JNukeRByteCode 4 "     Return" void (line 4))
