%!PS-Adobe-2.0 EPSF-2.0
%%Title: deadlock1.dia
%%Creator: Dia v0.90
%%CreationDate: Wed Feb 19 14:32:55 2003
%%For: pascal
%%Magnification: 1.0000
%%Orientation: Portrait
%%BoundingBox: 0 0 619 605
%%Pages: 1
%%EndComments
%%BeginProlog
/cp {closepath} bind def
/c {curveto} bind def
/f {fill} bind def
/a {arc} bind def
/ef {eofill} bind def
/ex {exch} bind def
/gr {grestore} bind def
/gs {gsave} bind def
/sa {save} bind def
/rs {restore} bind def
/l {lineto} bind def
/m {moveto} bind def
/rm {rmoveto} bind def
/n {newpath} bind def
/s {stroke} bind def
/sh {show} bind def
/slc {setlinecap} bind def
/slj {setlinejoin} bind def
/slw {setlinewidth} bind def
/srgb {setrgbcolor} bind def
/rot {rotate} bind def
/sc {scale} bind def
/sd {setdash} bind def
/ff {findfont} bind def
/sf {setfont} bind def
/scf {scalefont} bind def
/sw {stringwidth pop} bind def
/tr {translate} bind def

/ellipsedict 8 dict def
ellipsedict /mtrx matrix put
/ellipse
{ ellipsedict begin
   /endangle exch def
   /startangle exch def
   /yrad exch def
   /xrad exch def
   /y exch def
   /x exch def   /savematrix mtrx currentmatrix def
   x y tr xrad yrad sc
   0 0 1 startangle endangle arc
   savematrix setmatrix
   end
} def

/mergeprocs {
dup length
3 -1 roll
dup
length
dup
5 1 roll
3 -1 roll
add
array cvx
dup
3 -1 roll
0 exch
putinterval
dup
4 2 roll
putinterval
} bind def
%%EndProlog

%%BeginSetup
%%EndSetup
28.346000 -28.346000 scale
-2.500000 -23.310000 translate

1.000000 1.000000 1.000000 srgb
n 2.550000 2.050000 m 2.550000 3.950000 l 6.756400 3.950000 l 6.756400 2.050000 l f
0.100000 slw
[] 0 sd
[] 0 sd
0 slj
0.000000 0.000000 0.000000 srgb
n 2.550000 2.050000 m 2.550000 3.950000 l 6.756400 3.950000 l 6.756400 2.050000 l cp s
 [ /xi /xi /xi /xi /xi /xi /xi /xi /xi /xi /xi /xi /xi /xi /xi /xi
 /xi /xi /xi /xi /xi /xi /xi /xi /xi /xi /xi /xi /xi /xi /xi /xi
 /T /zero /comma /space /one /braceleft /two /three /xi /xi /braceright /four /five /six /seven /eight
 /parenleft /parenright /xi /xi /xi /xi /xi /xi /xi /xi /xi /xi /xi /xi /xi /xi
 /xi /xi /xi /xi /xi /xi /xi /xi /xi /xi /xi /xi /xi /xi /xi /xi
 /xi /xi /xi /xi /xi /xi /xi /xi /xi /xi /xi /xi /xi /xi /xi /xi
 /xi /xi /xi /xi /xi /xi /xi /xi /xi /xi /xi /xi /xi /xi /xi /xi
 /xi /xi /xi /xi /xi /xi /xi /xi /xi /xi /xi /xi /xi /xi /xi /xi
 /xi /xi /xi /xi /xi /xi /xi /xi /xi /xi /xi /xi /xi /xi /xi /xi
 /xi /xi /xi /xi /xi /xi /xi /xi /xi /xi /xi /xi /xi /xi /xi /xi
 /xi /xi /xi /xi /xi /xi /xi /xi /xi /xi /xi /xi /xi /xi /xi /xi
 /xi /xi /xi /xi /xi /xi /xi /xi /xi /xi /xi /xi /xi /xi /xi /xi
 /xi /xi /xi /xi /xi /xi /xi /xi /xi /xi /xi /xi /xi /xi /xi /xi
 /xi /xi /xi /xi /xi /xi /xi /xi /xi /xi /xi /xi /xi /xi /xi /xi
 /xi /xi /xi /xi /xi /xi /xi /xi /xi /xi /xi /xi /xi /xi /xi /xi
 /xi /xi /xi /xi /xi /xi /xi /xi /xi /xi /xi /xi /xi /xi /xi /xi
] /e0 exch def
/Courier_e0 undefinefont
/Courier_e0
  /Courier findfont
  dup length dict begin
  {1 index /FID ne {def} {pop pop} ifelse} forall
  /Encoding e0 def
  currentdict end
definefont pop
/Courier_e0 ff 0.800000 scf sf
( !"# $) sw
2 div 4.653200 ex sub 3.196491 m ( !"# $)
 gs 1 -1 sc sh gr
0.100000 slw
[] 0 sd
[0.400000] 0 sd
0 slc
n 4.653200 3.950000 m 4.653200 6.850000 l s
0.100000 slw
[] 0 sd
0 slj
0 slc
n 4.403200 6.050000 m 4.653200 6.850000 l 4.903200 6.050000 l s
4.653200 5.400000 m /Courier_e0 ff 0.800000 scf sf
(%$"&"'*)
 gs 1 -1 sc sh gr
1.000000 1.000000 1.000000 srgb
n 2.550000 2.050000 m 2.550000 3.950000 l 6.756400 3.950000 l 6.756400 2.050000 l f
0.100000 slw
[] 0 sd
[] 0 sd
0 slj
0.000000 0.000000 0.000000 srgb
n 2.550000 2.050000 m 2.550000 3.950000 l 6.756400 3.950000 l 6.756400 2.050000 l cp s
/Courier_e0 ff 0.800000 scf sf
( !"# $) sw
2 div 4.653200 ex sub 3.196491 m ( !"# $)
 gs 1 -1 sc sh gr
0.100000 slw
[] 0 sd
[0.400000] 0 sd
0 slc
n 4.653200 8.750000 m 4.653200 11.650000 l s
0.100000 slw
[] 0 sd
0 slj
0 slc
n 4.403200 10.850000 m 4.653200 11.650000 l 4.903200 10.850000 l s
4.653200 10.200000 m /Courier_e0 ff 0.800000 scf sf
(%+*)
 gs 1 -1 sc sh gr
1.000000 1.000000 1.000000 srgb
n 2.550000 6.850000 m 2.550000 8.750000 l 6.756400 8.750000 l 6.756400 6.850000 l f
0.100000 slw
[] 0 sd
[] 0 sd
0 slj
0.000000 0.000000 0.000000 srgb
n 2.550000 6.850000 m 2.550000 8.750000 l 6.756400 8.750000 l 6.756400 6.850000 l cp s
/Courier_e0 ff 0.800000 scf sf
( !"# $) sw
2 div 4.653200 ex sub 7.996491 m ( !"# $)
 gs 1 -1 sc sh gr
0.100000 slw
[] 0 sd
[0.400000] 0 sd
0 slc
n 4.653200 13.550000 m 4.653200 16.550000 l s
0.100000 slw
[] 0 sd
0 slj
0 slc
n 4.403200 15.750000 m 4.653200 16.550000 l 4.903200 15.750000 l s
4.653200 15.050000 m /Courier_e0 ff 0.800000 scf sf
(%,"-".*)
 gs 1 -1 sc sh gr
1.000000 1.000000 1.000000 srgb
n 3.623600 11.650000 m 3.623600 13.550000 l 5.682800 13.550000 l 5.682800 11.650000 l f
0.100000 slw
[] 0 sd
[] 0 sd
0 slj
0.000000 0.000000 0.000000 srgb
n 3.623600 11.650000 m 3.623600 13.550000 l 5.682800 13.550000 l 5.682800 11.650000 l cp s
/Courier_e0 ff 0.800000 scf sf
( $) sw
2 div 4.653200 ex sub 12.796491 m ( $)
 gs 1 -1 sc sh gr
0.100000 slw
[] 0 sd
[0.400000] 0 sd
0 slc
n 4.653200 18.450000 m 4.653200 21.350000 l s
0.100000 slw
[] 0 sd
0 slj
0 slc
n 4.403200 20.550000 m 4.653200 21.350000 l 4.903200 20.550000 l s
4.653200 19.900000 m /Courier_e0 ff 0.800000 scf sf
(%/*)
 gs 1 -1 sc sh gr
1.000000 1.000000 1.000000 srgb
n 3.623600 16.550000 m 3.623600 18.450000 l 5.682800 18.450000 l 5.682800 16.550000 l f
0.100000 slw
[] 0 sd
[] 0 sd
0 slj
0.000000 0.000000 0.000000 srgb
n 3.623600 16.550000 m 3.623600 18.450000 l 5.682800 18.450000 l 5.682800 16.550000 l cp s
/Courier_e0 ff 0.800000 scf sf
( $) sw
2 div 4.653200 ex sub 17.696491 m ( $)
 gs 1 -1 sc sh gr
1.000000 1.000000 1.000000 srgb
n 3.821600 21.350000 m 3.821600 23.250000 l 5.484800 23.250000 l 5.484800 21.350000 l f
0.100000 slw
[] 0 sd
[] 0 sd
0 slj
0.000000 0.000000 0.000000 srgb
n 3.821600 21.350000 m 3.821600 23.250000 l 5.484800 23.250000 l 5.484800 21.350000 l cp s
/Courier_e0 ff 0.800000 scf sf
(01) sw
2 div 4.653200 ex sub 22.496491 m (01)
 gs 1 -1 sc sh gr
0.100000 slw
[] 0 sd
[0.400000] 0 sd
0 slc
n 17.053200 3.960000 m 17.053200 6.860000 l s
0.100000 slw
[] 0 sd
0 slj
0 slc
n 16.803200 6.060000 m 17.053200 6.860000 l 17.303200 6.060000 l s
17.053200 5.410000 m /Courier_e0 ff 0.800000 scf sf
(%,"-".*)
 gs 1 -1 sc sh gr
1.000000 1.000000 1.000000 srgb
n 16.023600 2.060000 m 16.023600 3.960000 l 18.082800 3.960000 l 18.082800 2.060000 l f
0.100000 slw
[] 0 sd
[] 0 sd
0 slj
0.000000 0.000000 0.000000 srgb
n 16.023600 2.060000 m 16.023600 3.960000 l 18.082800 3.960000 l 18.082800 2.060000 l cp s
/Courier_e0 ff 0.800000 scf sf
( $) sw
2 div 17.053200 ex sub 3.206491 m ( $)
 gs 1 -1 sc sh gr
0.100000 slw
[] 0 sd
[0.400000] 0 sd
0 slc
n 17.053200 8.760000 m 17.053200 11.660000 l s
0.100000 slw
[] 0 sd
0 slj
0 slc
n 16.803200 10.860000 m 17.053200 11.660000 l 17.303200 10.860000 l s
17.053200 10.210000 m /Courier_e0 ff 0.800000 scf sf
(%/*)
 gs 1 -1 sc sh gr
1.000000 1.000000 1.000000 srgb
n 14.963200 6.860000 m 14.963200 8.760000 l 19.143200 8.760000 l 19.143200 6.860000 l f
0.100000 slw
[] 0 sd
[] 0 sd
0 slj
0.000000 0.000000 0.000000 srgb
n 14.963200 6.860000 m 14.963200 8.760000 l 19.143200 8.760000 l 19.143200 6.860000 l cp s
/Courier_e0 ff 0.800000 scf sf
( $"# !) sw
2 div 17.053200 ex sub 8.006491 m ( $"# !)
 gs 1 -1 sc sh gr
0.100000 slw
[] 0 sd
[0.400000] 0 sd
0 slc
n 17.053200 13.560000 m 17.053200 16.560000 l s
0.100000 slw
[] 0 sd
0 slj
0 slc
n 16.803200 15.760000 m 17.053200 16.560000 l 17.303200 15.760000 l s
17.053200 15.060000 m /Courier_e0 ff 0.800000 scf sf
(%$"&"'*)
 gs 1 -1 sc sh gr
1.000000 1.000000 1.000000 srgb
n 16.036800 11.660000 m 16.036800 13.560000 l 18.069600 13.560000 l 18.069600 11.660000 l f
0.100000 slw
[] 0 sd
[] 0 sd
0 slj
0.000000 0.000000 0.000000 srgb
n 16.036800 11.660000 m 16.036800 13.560000 l 18.069600 13.560000 l 18.069600 11.660000 l cp s
/Courier_e0 ff 0.800000 scf sf
( !) sw
2 div 17.053200 ex sub 12.806491 m ( !)
 gs 1 -1 sc sh gr
0.100000 slw
[] 0 sd
[0.400000] 0 sd
0 slc
n 17.053200 18.460000 m 17.053200 21.360000 l s
0.100000 slw
[] 0 sd
0 slj
0 slc
n 16.803200 20.560000 m 17.053200 21.360000 l 17.303200 20.560000 l s
17.053200 19.910000 m /Courier_e0 ff 0.800000 scf sf
(%+*)
 gs 1 -1 sc sh gr
1.000000 1.000000 1.000000 srgb
n 16.036800 16.560000 m 16.036800 18.460000 l 18.069600 18.460000 l 18.069600 16.560000 l f
0.100000 slw
[] 0 sd
[] 0 sd
0 slj
0.000000 0.000000 0.000000 srgb
n 16.036800 16.560000 m 16.036800 18.460000 l 18.069600 18.460000 l 18.069600 16.560000 l cp s
/Courier_e0 ff 0.800000 scf sf
( !) sw
2 div 17.053200 ex sub 17.706491 m ( !)
 gs 1 -1 sc sh gr
1.000000 1.000000 1.000000 srgb
n 16.221600 21.360000 m 16.221600 23.260000 l 17.884800 23.260000 l 17.884800 21.360000 l f
0.100000 slw
[] 0 sd
[] 0 sd
0 slj
0.000000 0.000000 0.000000 srgb
n 16.221600 21.360000 m 16.221600 23.260000 l 17.884800 23.260000 l 17.884800 21.360000 l cp s
/Courier_e0 ff 0.800000 scf sf
(01) sw
2 div 17.053200 ex sub 22.506491 m (01)
 gs 1 -1 sc sh gr
0.100000 slw
[] 0 sd
[] 0 sd
0 slc
n 6.756400 3.000000 m 16.023600 3.010000 l s
0.100000 slw
[] 0 sd
[0.400000] 0 sd
0 slc
n 10.579600 8.760000 m 10.557106 11.860000 l s
0.100000 slw
[] 0 sd
0 slj
0 slc
n 10.312917 11.058207 m 10.557106 11.860000 l 10.812904 11.061835 l s
10.568353 10.310000 m /Courier_e0 ff 0.800000 scf sf
(%,*)
 gs 1 -1 sc sh gr
1.000000 1.000000 1.000000 srgb
n 9.550000 6.860000 m 9.550000 8.760000 l 11.609200 8.760000 l 11.609200 6.860000 l f
0.100000 slw
[] 0 sd
[] 0 sd
0 slj
0.000000 0.000000 0.000000 srgb
n 9.550000 6.860000 m 9.550000 8.760000 l 11.609200 8.760000 l 11.609200 6.860000 l cp s
/Courier_e0 ff 0.800000 scf sf
( $) sw
2 div 10.579600 ex sub 8.006491 m ( $)
 gs 1 -1 sc sh gr
0.756863 0.756863 0.756863 srgb
n 10.557106 11.860000 m 11.764212 13.067106 l 10.557106 14.274212 l 9.350000 13.067106 l f
0.100000 slw
[] 0 sd
[] 0 sd
0 slj
0.000000 0.000000 0.000000 srgb
n 10.557106 11.860000 m 11.764212 13.067106 l 10.557106 14.274212 l 9.350000 13.067106 l cp s
0.100000 slw
[] 0 sd
[] 0 sd
0 slc
n 6.756400 7.800000 m 9.550000 7.810000 l s
0.100000 slw
[] 0 sd
[0.400000] 0 sd
0 slc
n 23.079600 8.760000 m 23.057106 11.860000 l s
0.100000 slw
[] 0 sd
0 slj
0 slc
n 22.812917 11.058207 m 23.057106 11.860000 l 23.312904 11.061835 l s
23.068353 10.310000 m /Courier_e0 ff 0.800000 scf sf
(%$*)
 gs 1 -1 sc sh gr
1.000000 1.000000 1.000000 srgb
n 22.063200 6.860000 m 22.063200 8.760000 l 24.096000 8.760000 l 24.096000 6.860000 l f
0.100000 slw
[] 0 sd
[] 0 sd
0 slj
0.000000 0.000000 0.000000 srgb
n 22.063200 6.860000 m 22.063200 8.760000 l 24.096000 8.760000 l 24.096000 6.860000 l cp s
/Courier_e0 ff 0.800000 scf sf
( !) sw
2 div 23.079600 ex sub 8.006491 m ( !)
 gs 1 -1 sc sh gr
0.756863 0.756863 0.756863 srgb
n 23.057106 11.860000 m 24.264212 13.067106 l 23.057106 14.274212 l 21.850000 13.067106 l f
0.100000 slw
[] 0 sd
[] 0 sd
0 slj
0.000000 0.000000 0.000000 srgb
n 23.057106 11.860000 m 24.264212 13.067106 l 23.057106 14.274212 l 21.850000 13.067106 l cp s
0.100000 slw
[] 0 sd
[] 0 sd
0 slc
n 19.143200 7.810000 m 22.063200 7.810000 l s
showpage
