%!PS-Adobe-2.0 EPSF-2.0
%%Title: /home/pascal/cvsroot/jnuke/doc/optimizer/classes.dia
%%Creator: Dia v0.88.1
%%CreationDate: Fri Jun 21 17:02:41 2002
%%For: a user
%%Magnification: 1.0000
%%Orientation: Portrait
%%BoundingBox: 0 0 952 1069
%%Pages: 1
%%BeginSetup
%%EndSetup
%%EndComments
%%BeginProlog
[ /.notdef /.notdef /.notdef /.notdef /.notdef /.notdef /.notdef /.notdef /.notdef /.notdef
/.notdef /.notdef /.notdef /.notdef /.notdef /.notdef /.notdef /.notdef /.notdef /.notdef
/.notdef /.notdef /.notdef /.notdef /.notdef /.notdef /.notdef /.notdef /.notdef /.notdef
/.notdef /.notdef /space /exclam /quotedbl /numbersign /dollar /percent /ampersand /quoteright
/parenleft /parenright /asterisk /plus /comma /hyphen /period /slash /zero /one
/two /three /four /five /six /seven /eight /nine /colon /semicolon
/less /equal /greater /question /at /A /B /C /D /E
/F /G /H /I /J /K /L /M /N /O
/P /Q /R /S /T /U /V /W /X /Y
/Z /bracketleft /backslash /bracketright /asciicircum /underscore /quoteleft /a /b /c
/d /e /f /g /h /i /j /k /l /m
/n /o /p /q /r /s /t /u /v /w
/x /y /z /braceleft /bar /braceright /asciitilde /.notdef /.notdef /.notdef
/.notdef /.notdef /.notdef /.notdef /.notdef /.notdef /.notdef /.notdef /.notdef /.notdef
/.notdef /.notdef /.notdef /.notdef /.notdef /.notdef /.notdef /.notdef /.notdef /.notdef
/.notdef /.notdef /.notdef /.notdef /.notdef /.notdef /.notdef /.notdef /.notdef /.notdef
/space /exclamdown /cent /sterling /currency /yen /brokenbar /section /dieresis /copyright
/ordfeminine /guillemotleft /logicalnot /hyphen /registered /macron /degree /plusminus /twosuperior /threesuperior
/acute /mu /paragraph /periodcentered /cedilla /onesuperior /ordmasculine /guillemotright /onequarter /onehalf
/threequarters /questiondown /Agrave /Aacute /Acircumflex /Atilde /Adieresis /Aring /AE /Ccedilla
/Egrave /Eacute /Ecircumflex /Edieresis /Igrave /Iacute /Icircumflex /Idieresis /Eth /Ntilde
/Ograve /Oacute /Ocircumflex /Otilde /Odieresis /multiply /Oslash /Ugrave /Uacute /Ucircumflex
/Udieresis /Yacute /Thorn /germandbls /agrave /aacute /acircumflex /atilde /adieresis /aring
/ae /ccedilla /egrave /eacute /ecircumflex /edieresis /igrave /iacute /icircumflex /idieresis
/eth /ntilde /ograve /oacute /ocircumflex /otilde /odieresis /divide /oslash /ugrave
/uacute /ucircumflex /udieresis /yacute /thorn /ydieresis] /isolatin1encoding exch def
/Times-Roman-latin1
    /Times-Roman findfont
    dup length dict begin
	{1 index /FID ne {def} {pop pop} ifelse} forall
	/Encoding isolatin1encoding def
    currentdict end
definefont pop
/Times-Italic-latin1
    /Times-Italic findfont
    dup length dict begin
	{1 index /FID ne {def} {pop pop} ifelse} forall
	/Encoding isolatin1encoding def
    currentdict end
definefont pop
/Times-Bold-latin1
    /Times-Bold findfont
    dup length dict begin
	{1 index /FID ne {def} {pop pop} ifelse} forall
	/Encoding isolatin1encoding def
    currentdict end
definefont pop
/Times-BoldItalic-latin1
    /Times-BoldItalic findfont
    dup length dict begin
	{1 index /FID ne {def} {pop pop} ifelse} forall
	/Encoding isolatin1encoding def
    currentdict end
definefont pop
/AvantGarde-Book-latin1
    /AvantGarde-Book findfont
    dup length dict begin
	{1 index /FID ne {def} {pop pop} ifelse} forall
	/Encoding isolatin1encoding def
    currentdict end
definefont pop
/AvantGarde-BookOblique-latin1
    /AvantGarde-BookOblique findfont
    dup length dict begin
	{1 index /FID ne {def} {pop pop} ifelse} forall
	/Encoding isolatin1encoding def
    currentdict end
definefont pop
/AvantGarde-Demi-latin1
    /AvantGarde-Demi findfont
    dup length dict begin
	{1 index /FID ne {def} {pop pop} ifelse} forall
	/Encoding isolatin1encoding def
    currentdict end
definefont pop
/AvantGarde-DemiOblique-latin1
    /AvantGarde-DemiOblique findfont
    dup length dict begin
	{1 index /FID ne {def} {pop pop} ifelse} forall
	/Encoding isolatin1encoding def
    currentdict end
definefont pop
/Bookman-Light-latin1
    /Bookman-Light findfont
    dup length dict begin
	{1 index /FID ne {def} {pop pop} ifelse} forall
	/Encoding isolatin1encoding def
    currentdict end
definefont pop
/Bookman-LightItalic-latin1
    /Bookman-LightItalic findfont
    dup length dict begin
	{1 index /FID ne {def} {pop pop} ifelse} forall
	/Encoding isolatin1encoding def
    currentdict end
definefont pop
/Bookman-Demi-latin1
    /Bookman-Demi findfont
    dup length dict begin
	{1 index /FID ne {def} {pop pop} ifelse} forall
	/Encoding isolatin1encoding def
    currentdict end
definefont pop
/Bookman-DemiItalic-latin1
    /Bookman-DemiItalic findfont
    dup length dict begin
	{1 index /FID ne {def} {pop pop} ifelse} forall
	/Encoding isolatin1encoding def
    currentdict end
definefont pop
/Courier-latin1
    /Courier findfont
    dup length dict begin
	{1 index /FID ne {def} {pop pop} ifelse} forall
	/Encoding isolatin1encoding def
    currentdict end
definefont pop
/Courier-Oblique-latin1
    /Courier-Oblique findfont
    dup length dict begin
	{1 index /FID ne {def} {pop pop} ifelse} forall
	/Encoding isolatin1encoding def
    currentdict end
definefont pop
/Courier-Bold-latin1
    /Courier-Bold findfont
    dup length dict begin
	{1 index /FID ne {def} {pop pop} ifelse} forall
	/Encoding isolatin1encoding def
    currentdict end
definefont pop
/Courier-BoldOblique-latin1
    /Courier-BoldOblique findfont
    dup length dict begin
	{1 index /FID ne {def} {pop pop} ifelse} forall
	/Encoding isolatin1encoding def
    currentdict end
definefont pop
/Helvetica-latin1
    /Helvetica findfont
    dup length dict begin
	{1 index /FID ne {def} {pop pop} ifelse} forall
	/Encoding isolatin1encoding def
    currentdict end
definefont pop
/Helvetica-Oblique-latin1
    /Helvetica-Oblique findfont
    dup length dict begin
	{1 index /FID ne {def} {pop pop} ifelse} forall
	/Encoding isolatin1encoding def
    currentdict end
definefont pop
/Helvetica-Bold-latin1
    /Helvetica-Bold findfont
    dup length dict begin
	{1 index /FID ne {def} {pop pop} ifelse} forall
	/Encoding isolatin1encoding def
    currentdict end
definefont pop
/Helvetica-BoldOblique-latin1
    /Helvetica-BoldOblique findfont
    dup length dict begin
	{1 index /FID ne {def} {pop pop} ifelse} forall
	/Encoding isolatin1encoding def
    currentdict end
definefont pop
/Helvetica-Narrow-latin1
    /Helvetica-Narrow findfont
    dup length dict begin
	{1 index /FID ne {def} {pop pop} ifelse} forall
	/Encoding isolatin1encoding def
    currentdict end
definefont pop
/Helvetica-Narrow-Oblique-latin1
    /Helvetica-Narrow-Oblique findfont
    dup length dict begin
	{1 index /FID ne {def} {pop pop} ifelse} forall
	/Encoding isolatin1encoding def
    currentdict end
definefont pop
/Helvetica-Narrow-Bold-latin1
    /Helvetica-Narrow-Bold findfont
    dup length dict begin
	{1 index /FID ne {def} {pop pop} ifelse} forall
	/Encoding isolatin1encoding def
    currentdict end
definefont pop
/Helvetica-Narrow-BoldOblique-latin1
    /Helvetica-Narrow-BoldOblique findfont
    dup length dict begin
	{1 index /FID ne {def} {pop pop} ifelse} forall
	/Encoding isolatin1encoding def
    currentdict end
definefont pop
/NewCenturySchoolbook-Roman-latin1
    /NewCenturySchoolbook-Roman findfont
    dup length dict begin
	{1 index /FID ne {def} {pop pop} ifelse} forall
	/Encoding isolatin1encoding def
    currentdict end
definefont pop
/NewCenturySchoolbook-Italic-latin1
    /NewCenturySchoolbook-Italic findfont
    dup length dict begin
	{1 index /FID ne {def} {pop pop} ifelse} forall
	/Encoding isolatin1encoding def
    currentdict end
definefont pop
/NewCenturySchoolbook-Bold-latin1
    /NewCenturySchoolbook-Bold findfont
    dup length dict begin
	{1 index /FID ne {def} {pop pop} ifelse} forall
	/Encoding isolatin1encoding def
    currentdict end
definefont pop
/NewCenturySchoolbook-BoldItalic-latin1
    /NewCenturySchoolbook-BoldItalic findfont
    dup length dict begin
	{1 index /FID ne {def} {pop pop} ifelse} forall
	/Encoding isolatin1encoding def
    currentdict end
definefont pop
/Palatino-Roman-latin1
    /Palatino-Roman findfont
    dup length dict begin
	{1 index /FID ne {def} {pop pop} ifelse} forall
	/Encoding isolatin1encoding def
    currentdict end
definefont pop
/Palatino-Italic-latin1
    /Palatino-Italic findfont
    dup length dict begin
	{1 index /FID ne {def} {pop pop} ifelse} forall
	/Encoding isolatin1encoding def
    currentdict end
definefont pop
/Palatino-Bold-latin1
    /Palatino-Bold findfont
    dup length dict begin
	{1 index /FID ne {def} {pop pop} ifelse} forall
	/Encoding isolatin1encoding def
    currentdict end
definefont pop
/Palatino-BoldItalic-latin1
    /Palatino-BoldItalic findfont
    dup length dict begin
	{1 index /FID ne {def} {pop pop} ifelse} forall
	/Encoding isolatin1encoding def
    currentdict end
definefont pop
/Symbol-latin1
    /Symbol findfont
definefont pop
/ZapfChancery-MediumItalic-latin1
    /ZapfChancery-MediumItalic findfont
    dup length dict begin
	{1 index /FID ne {def} {pop pop} ifelse} forall
	/Encoding isolatin1encoding def
    currentdict end
definefont pop
/ZapfDingbats-latin1
    /ZapfDingbats findfont
    dup length dict begin
	{1 index /FID ne {def} {pop pop} ifelse} forall
	/Encoding isolatin1encoding def
    currentdict end
definefont pop
/cp {closepath} bind def
/c {curveto} bind def
/f {fill} bind def
/a {arc} bind def
/ef {eofill} bind def
/ex {exch} bind def
/gr {grestore} bind def
/gs {gsave} bind def
/sa {save} bind def
/rs {restore} bind def
/l {lineto} bind def
/m {moveto} bind def
/rm {rmoveto} bind def
/n {newpath} bind def
/s {stroke} bind def
/sh {show} bind def
/slc {setlinecap} bind def
/slj {setlinejoin} bind def
/slw {setlinewidth} bind def
/srgb {setrgbcolor} bind def
/rot {rotate} bind def
/sc {scale} bind def
/sd {setdash} bind def
/ff {findfont} bind def
/sf {setfont} bind def
/scf {scalefont} bind def
/sw {stringwidth pop} bind def
/tr {translate} bind def

/ellipsedict 8 dict def
ellipsedict /mtrx matrix put
/ellipse
{ ellipsedict begin
   /endangle exch def
   /startangle exch def
   /yrad exch def
   /xrad exch def
   /y exch def
   /x exch def   /savematrix mtrx currentmatrix def
   x y tr xrad yrad sc
   0 0 1 startangle endangle arc
   savematrix setmatrix
   end
} def

/mergeprocs {
dup length
3 -1 roll
dup
length
dup
5 1 roll
3 -1 roll
add
array cvx
dup
3 -1 roll
0 exch
putinterval
dup
4 2 roll
putinterval
} bind def
28.346000 -28.346000 scale
-3.350000 -39.800000 translate
%%EndProlog


0.100000 slw
[] 0 sd
1.000000 1.000000 1.000000 srgb
n 3.400000 2.150000 m 3.400000 3.550000 l 13.896000 3.550000 l 13.896000 2.150000 l f
0.000000 0.000000 0.000000 srgb
n 3.400000 2.150000 m 3.400000 3.550000 l 13.896000 3.550000 l 13.896000 2.150000 l cp s
/Helvetica-Bold-latin1 ff 1.000000 scf sf
(JNukeMethod) dup sw 2 div 8.648000 ex sub 3.150000 m gs 1 -1 sc sh gr
1.000000 1.000000 1.000000 srgb
n 3.400000 3.550000 m 3.400000 3.950000 l 13.896000 3.950000 l 13.896000 3.550000 l f
0.000000 0.000000 0.000000 srgb
n 3.400000 3.550000 m 3.400000 3.950000 l 13.896000 3.950000 l 13.896000 3.550000 l cp s
1.000000 1.000000 1.000000 srgb
n 3.400000 3.950000 m 3.400000 4.950000 l 13.896000 4.950000 l 13.896000 3.950000 l f
0.000000 0.000000 0.000000 srgb
n 3.400000 3.950000 m 3.400000 4.950000 l 13.896000 4.950000 l 13.896000 3.950000 l cp s
/Courier-latin1 ff 0.800000 scf sf
(+getCFG\(\): JNukeObj*) 3.550000 4.667143 m gs 1 -1 sc sh gr
0.100000 slw
[] 0 sd
1.000000 1.000000 1.000000 srgb
n 3.450000 9.710350 m 3.450000 11.110350 l 26.066000 11.110350 l 26.066000 9.710350 l f
0.000000 0.000000 0.000000 srgb
n 3.450000 9.710350 m 3.450000 11.110350 l 26.066000 11.110350 l 26.066000 9.710350 l cp s
/Helvetica-Bold-latin1 ff 1.000000 scf sf
(JNukeCFG) dup sw 2 div 14.758000 ex sub 10.710350 m gs 1 -1 sc sh gr
1.000000 1.000000 1.000000 srgb
n 3.450000 11.110350 m 3.450000 11.510350 l 26.066000 11.510350 l 26.066000 11.110350 l f
0.000000 0.000000 0.000000 srgb
n 3.450000 11.110350 m 3.450000 11.510350 l 26.066000 11.510350 l 26.066000 11.110350 l cp s
1.000000 1.000000 1.000000 srgb
n 3.450000 11.510350 m 3.450000 14.910350 l 26.066000 14.910350 l 26.066000 11.510350 l f
0.000000 0.000000 0.000000 srgb
n 3.450000 11.510350 m 3.450000 14.910350 l 26.066000 14.910350 l 26.066000 11.510350 l cp s
/Courier-latin1 ff 0.800000 scf sf
(+getBasicBlocks\(\): JNukeObj *) 3.600000 12.227493 m gs 1 -1 sc sh gr
/Courier-latin1 ff 0.800000 scf sf
(+getMethod\(\): JNukeObj*) 3.600000 13.027493 m gs 1 -1 sc sh gr
/Courier-latin1 ff 0.800000 scf sf
(+isBeginOfBasicBlock\(bytecode:JNukeObj*\): int) 3.600000 13.827493 m gs 1 -1 sc sh gr
/Courier-latin1 ff 0.800000 scf sf
(+isEndOfBasicBlock\(bytecode:JNukeObj*\): int) 3.600000 14.627493 m gs 1 -1 sc sh gr
0.100000 slw
[] 0 sd
1.000000 1.000000 1.000000 srgb
n 14.400000 20.160300 m 14.400000 21.560300 l 32.168000 21.560300 l 32.168000 20.160300 l f
0.000000 0.000000 0.000000 srgb
n 14.400000 20.160300 m 14.400000 21.560300 l 32.168000 21.560300 l 32.168000 20.160300 l cp s
/Helvetica-Bold-latin1 ff 1.000000 scf sf
(JNukeBasicBlock) dup sw 2 div 23.284000 ex sub 21.160300 m gs 1 -1 sc sh gr
1.000000 1.000000 1.000000 srgb
n 14.400000 21.560300 m 14.400000 21.960300 l 32.168000 21.960300 l 32.168000 21.560300 l f
0.000000 0.000000 0.000000 srgb
n 14.400000 21.560300 m 14.400000 21.960300 l 32.168000 21.960300 l 32.168000 21.560300 l cp s
1.000000 1.000000 1.000000 srgb
n 14.400000 21.960300 m 14.400000 29.360300 l 32.168000 29.360300 l 32.168000 21.960300 l f
0.000000 0.000000 0.000000 srgb
n 14.400000 21.960300 m 14.400000 29.360300 l 32.168000 29.360300 l 32.168000 21.960300 l cp s
/Courier-latin1 ff 0.800000 scf sf
(+addSuccessor\(JNukeObj*:bb\): void) 14.550000 22.677443 m gs 1 -1 sc sh gr
/Courier-latin1 ff 0.800000 scf sf
(+getSuccessors\(\): JNukeObj*) 14.550000 23.477443 m gs 1 -1 sc sh gr
/Courier-latin1 ff 0.800000 scf sf
(+deleteByteCode\(bc:JNukeObj*\): void) 14.550000 24.277443 m gs 1 -1 sc sh gr
/Courier-latin1 ff 0.800000 scf sf
(+getByteCode\(offset:int\): JNukeObj*) 14.550000 25.077443 m gs 1 -1 sc sh gr
/Courier-latin1 ff 0.800000 scf sf
(+getFirstByteCode\(\): JNukeObj*) 14.550000 25.877443 m gs 1 -1 sc sh gr
/Courier-latin1 ff 0.800000 scf sf
(+getLastByteCode\(\): JNukeObj*) 14.550000 26.677443 m gs 1 -1 sc sh gr
/Courier-latin1 ff 0.800000 scf sf
(+insertByteCode\(bc:JNukeObj*\): void) 14.550000 27.477443 m gs 1 -1 sc sh gr
/Courier-latin1 ff 0.800000 scf sf
(+offset\(\): int) 14.550000 28.277443 m gs 1 -1 sc sh gr
/Courier-latin1 ff 0.800000 scf sf
(+setOffset\(offset:int\): void) 14.550000 29.077443 m gs 1 -1 sc sh gr
0.100000 slw
[] 0 sd
0 slj
0 slc
n 14.758000 9.710350 m 14.758000 6.660350 l 8.648000 6.660350 l 8.648000 4.950000 l s
[] 0 sd
0 slj
0 slc
n 8.648000 4.950000 m 8.888000 5.650000 l 8.648000 6.350000 l 8.408000 5.650000 l f
/Courier-latin1 ff 0.800000 scf sf
(cfg) dup sw 2 div 11.703000 ex sub 6.477493 m gs 1 -1 sc sh gr
n 12.630200 6.477493 m 12.630200 6.077493 l 13.030200 6.277493 l f
(1) 14.758000 10.327493 m gs 1 -1 sc sh gr
(0..1) 8.648000 5.567143 m gs 1 -1 sc sh gr
0.100000 slw
[] 0 sd
0 slj
0 slc
n 23.284000 20.160300 m 23.284000 18.806500 l 14.758000 18.806500 l 14.758000 14.910350 l s
[] 0 sd
0 slj
0 slc
n 14.758000 14.910350 m 14.998000 15.610350 l 14.758000 16.310350 l 14.518000 15.610350 l f
/Courier-latin1 ff 0.800000 scf sf
(basicBlocks) dup sw 2 div 19.021000 ex sub 18.623643 m gs 1 -1 sc sh gr
n 21.887400 18.623643 m 21.887400 18.223643 l 22.287400 18.423643 l f
(0..n) 23.284000 20.777443 m gs 1 -1 sc sh gr
(1) 14.758000 15.527493 m gs 1 -1 sc sh gr
0.100000 slw
[] 0 sd
0 slj
0 slc
n 23.284000 29.360300 m 23.284000 33.850000 l 32.168000 33.850000 l 32.168000 29.360300 l s
[] 0 sd
0 slj
0 slc
1.000000 1.000000 1.000000 srgb
n 23.284000 29.360300 m 23.524000 30.060300 l 23.284000 30.760300 l 23.044000 30.060300 l f
0.100000 slw
[] 0 sd
0 slj
0 slc
0.000000 0.000000 0.000000 srgb
n 23.284000 29.360300 m 23.524000 30.060300 l 23.284000 30.760300 l 23.044000 30.060300 l cp s
/Courier-latin1 ff 0.800000 scf sf
(successors) dup sw 2 div 27.726000 ex sub 33.667143 m gs 1 -1 sc sh gr
n 30.350000 33.667143 m 30.350000 33.267143 l 30.750000 33.467143 l f
(1) 23.284000 29.977443 m gs 1 -1 sc sh gr
(0..n) 32.168000 29.977443 m gs 1 -1 sc sh gr
0.100000 slw
[] 0 sd
1.000000 1.000000 1.000000 srgb
n 3.600000 36.950000 m 3.600000 38.350000 l 36.881600 38.350000 l 36.881600 36.950000 l f
0.000000 0.000000 0.000000 srgb
n 3.600000 36.950000 m 3.600000 38.350000 l 36.881600 38.350000 l 36.881600 36.950000 l cp s
/Helvetica-Bold-latin1 ff 1.000000 scf sf
(JNukeOptRBCT) dup sw 2 div 20.240800 ex sub 37.950000 m gs 1 -1 sc sh gr
1.000000 1.000000 1.000000 srgb
n 3.600000 38.350000 m 3.600000 38.750000 l 36.881600 38.750000 l 36.881600 38.350000 l f
0.000000 0.000000 0.000000 srgb
n 3.600000 38.350000 m 3.600000 38.750000 l 36.881600 38.750000 l 36.881600 38.350000 l cp s
1.000000 1.000000 1.000000 srgb
n 3.600000 38.750000 m 3.600000 39.750000 l 36.881600 39.750000 l 36.881600 38.750000 l f
0.000000 0.000000 0.000000 srgb
n 3.600000 38.750000 m 3.600000 39.750000 l 36.881600 39.750000 l 36.881600 38.750000 l cp s
/Courier-latin1 ff 0.800000 scf sf
(+new\(mem:JNukeMem*,strPool:JNukeObj*,typePool:JNukeObj*\): JNukeBCT*) 3.750000 39.467143 m gs 1 -1 sc sh gr
showpage
