#FIG 3.2
Landscape
Center
Metric
A4      
100.00
Single
-2
1200 2
5 1 0 1 0 7 50 0 -1 0.000 0 1 1 0 2176.875 3960.000 5985 5175 6165 3690 5985 2745
	1 1 1.00 60.00 120.00
6 1980 1980 2295 2700
2 1 0 1 0 7 50 -1 -1 0.000 0 0 -1 1 0 2
	1 1 1.00 60.00 120.00
	 2115 1980 2115 2475
4 0 0 50 -1 4 12 0.0000 0 135 315 1980 2700 File\001
-6
6 4365 1980 4680 2700
2 1 0 1 0 7 50 -1 -1 0.000 0 0 -1 1 0 2
	1 1 1.00 60.00 120.00
	 4455 1980 4455 2475
4 0 0 50 -1 4 12 0.0000 0 135 315 4365 2700 File\001
-6
6 6435 1665 7290 2700
6 6750 1980 7065 2700
2 1 0 1 0 7 50 -1 -1 0.000 0 0 -1 1 0 2
	1 1 1.00 60.00 120.00
	 6885 1980 6885 2475
4 0 0 50 -1 4 12 0.0000 0 135 315 6750 2700 File\001
-6
2 2 0 1 0 7 50 -1 -1 0.000 0 0 -1 0 0 5
	 6435 1665 7290 1665 7290 1980 6435 1980 6435 1665
4 0 0 50 -1 4 12 0.0000 0 135 210 6525 1890 70\001
4 0 0 50 -1 4 12 0.0000 0 135 390 6885 1890 EOF\001
-6
6 1710 3510 7245 4545
6 1935 3825 2250 4545
2 1 0 1 0 7 50 -1 -1 0.000 0 0 -1 1 0 2
	1 1 1.00 60.00 120.00
	 2070 3825 2070 4320
4 0 0 50 -1 4 12 0.0000 0 135 315 1935 4545 File\001
-6
6 4320 3825 4635 4545
2 1 0 1 0 7 50 -1 -1 0.000 0 0 -1 1 0 2
	1 1 1.00 60.00 120.00
	 4410 3825 4410 4320
4 0 0 50 -1 4 12 0.0000 0 135 315 4320 4545 File\001
-6
6 6390 3510 7245 4545
6 6705 3825 7020 4545
2 1 0 1 0 7 50 -1 -1 0.000 0 0 -1 1 0 2
	1 1 1.00 60.00 120.00
	 6840 3825 6840 4320
4 0 0 50 -1 4 12 0.0000 0 135 315 6705 4545 File\001
-6
2 2 0 1 0 7 50 -1 -1 0.000 0 0 -1 0 0 5
	 6390 3510 7245 3510 7245 3825 6390 3825 6390 3510
4 0 0 50 -1 4 12 0.0000 0 135 210 6480 3735 70\001
4 0 0 50 -1 4 12 0.0000 0 135 390 6840 3735 EOF\001
-6
2 2 0 1 0 7 50 -1 -1 0.000 0 0 -1 0 0 5
	 1710 3510 2430 3510 2430 3825 1710 3825 1710 3510
2 1 0 1 0 7 50 -1 -1 0.000 0 0 -1 1 0 2
	1 1 1.00 60.00 120.00
	 2430 3690 2835 3690
2 2 0 1 0 7 50 -1 -1 0.000 0 0 -1 0 0 5
	 2835 3510 3600 3510 3600 3825 2835 3825 2835 3510
2 1 0 1 0 7 50 -1 -1 0.000 0 0 -1 1 0 2
	1 1 1.00 60.00 120.00
	 3600 3690 4005 3690
2 2 0 1 0 7 50 -1 -1 0.000 0 0 -1 0 0 5
	 4005 3510 4770 3510 4770 3825 4005 3825 4005 3510
2 1 0 1 0 7 50 -1 -1 0.000 0 0 -1 1 0 2
	1 1 1.00 60.00 120.00
	 4770 3690 5175 3690
2 2 0 1 0 7 50 -1 -1 0.000 0 0 -1 0 0 5
	 5175 3510 5985 3510 5985 3825 5175 3825 5175 3510
2 1 0 1 0 7 50 -1 -1 0.000 0 0 -1 1 0 2
	1 1 1.00 60.00 120.00
	 5985 3690 6390 3690
4 0 0 50 -1 4 12 0.0000 0 135 105 1800 3735 0\001
4 0 0 50 -1 4 12 0.0000 0 135 105 2205 3735 9\001
4 0 0 50 -1 4 12 0.0000 0 135 210 2925 3735 10\001
4 0 0 50 -1 4 12 0.0000 0 135 210 3330 3735 29\001
4 0 0 50 -1 4 12 0.0000 0 135 210 4095 3735 30\001
4 0 0 50 -1 4 12 0.0000 0 135 210 4500 3735 49\001
4 0 0 50 -1 4 12 0.0000 0 135 210 5265 3735 50\001
4 0 0 50 -1 4 12 0.0000 0 135 210 5715 3735 69\001
-6
6 1935 5490 2250 6210
2 1 0 1 0 7 50 -1 -1 0.000 0 0 -1 1 0 2
	1 1 1.00 60.00 120.00
	 2070 5490 2070 5985
4 0 0 50 -1 4 12 0.0000 0 135 315 1935 6210 File\001
-6
6 4275 5490 4590 6210
2 1 0 1 0 7 50 -1 -1 0.000 0 0 -1 1 0 2
	1 1 1.00 60.00 120.00
	 4410 5490 4410 5985
4 0 0 50 -1 4 12 0.0000 0 135 315 4275 6210 File\001
-6
2 2 0 1 0 7 50 -1 -1 0.000 0 0 -1 0 0 5
	 1755 1665 2475 1665 2475 1980 1755 1980 1755 1665
2 1 0 1 0 7 50 -1 -1 0.000 0 0 -1 1 0 2
	1 1 1.00 60.00 120.00
	 2475 1845 2880 1845
2 1 0 1 0 7 50 -1 -1 0.000 0 0 -1 1 0 2
	1 1 1.00 60.00 120.00
	 3645 1845 4050 1845
2 2 0 1 0 7 50 -1 -1 0.000 0 0 -1 0 0 5
	 4050 1665 4815 1665 4815 1980 4050 1980 4050 1665
2 1 0 1 0 7 50 -1 -1 0.000 0 0 -1 1 0 2
	1 1 1.00 60.00 120.00
	 4815 1845 5220 1845
2 2 0 1 0 7 50 -1 -1 0.000 0 0 -1 0 0 5
	 5220 1665 6030 1665 6030 1980 5220 1980 5220 1665
2 2 0 1 0 0 50 -1 10 0.000 0 0 -1 0 0 5
	 5220 2475 6030 2475 6030 2745 5220 2745 5220 2475
2 1 0 1 0 7 50 -1 -1 0.000 0 0 -1 1 0 2
	1 1 1.00 60.00 120.00
	 6030 1845 6435 1845
2 1 0 1 0 7 50 -1 -1 0.000 0 0 -1 1 0 2
	1 1 1.00 60.00 120.00
	 3240 3510 3240 2745
2 2 0 1 0 0 50 -1 10 0.000 0 0 -1 0 0 5
	 2880 2475 3645 2475 3645 2745 2880 2745 2880 2475
2 2 0 1 0 7 50 -1 -1 0.000 0 0 -1 0 0 5
	 2880 1665 3645 1665 3645 1980 2880 1980 2880 1665
2 1 0 1 0 7 50 -1 -1 0.000 0 0 -1 1 0 2
	1 1 1.00 60.00 120.00
	 3240 1980 3240 2475
2 1 0 1 0 7 50 -1 -1 0.000 0 0 -1 1 0 2
	1 1 1.00 60.00 120.00
	 5580 3510 5580 2745
2 1 0 1 0 7 50 -1 -1 0.000 0 0 -1 1 0 2
	1 1 1.00 60.00 120.00
	 5580 1980 5580 2475
2 2 0 1 0 7 50 -1 -1 0.000 0 0 -1 0 0 5
	 1710 5175 2430 5175 2430 5490 1710 5490 1710 5175
2 1 0 1 0 7 50 -1 -1 0.000 0 0 -1 1 0 2
	1 1 1.00 60.00 120.00
	 2430 5355 2835 5355
2 2 0 1 0 7 50 -1 -1 0.000 0 0 -1 0 0 5
	 2835 5175 3600 5175 3600 5490 2835 5490 2835 5175
2 1 0 1 0 7 50 -1 -1 0.000 0 0 -1 1 0 2
	1 1 1.00 60.00 120.00
	 3600 5355 4005 5355
2 2 0 1 0 7 50 -1 -1 0.000 0 0 -1 0 0 5
	 4005 5175 4770 5175 4770 5490 4005 5490 4005 5175
2 1 0 1 0 7 50 -1 -1 0.000 0 0 -1 1 0 2
	1 1 1.00 60.00 120.00
	 4770 5355 5175 5355
2 1 0 1 0 7 50 -1 -1 0.000 0 0 -1 1 0 2
	1 1 1.00 60.00 120.00
	 5985 5355 6345 5355
2 2 0 1 0 7 50 -1 -1 0.000 0 0 -1 0 0 5
	 6345 5175 7110 5175 7110 5490 6345 5490 6345 5175
2 2 0 1 0 0 50 -1 10 0.000 0 0 -1 0 0 5
	 6345 5940 7110 5940 7110 6210 6345 6210 6345 5940
2 2 0 1 0 0 50 -1 10 0.000 0 0 -1 0 0 5
	 2835 5985 3600 5985 3600 6255 2835 6255 2835 5985
2 1 0 1 0 7 50 -1 -1 0.000 0 0 -1 1 0 2
	1 1 1.00 60.00 120.00
	 7110 5355 7515 5355
2 2 0 1 0 7 50 -1 -1 0.000 0 0 -1 0 0 5
	 5175 5175 5985 5175 5985 5490 5175 5490 5175 5175
2 1 0 1 0 7 50 -1 -1 0.000 0 0 -1 1 0 2
	1 1 1.00 60.00 120.00
	 3240 5490 3240 5985
2 1 0 1 0 7 50 -1 -1 0.000 0 0 -1 1 0 2
	1 1 1.00 60.00 120.00
	 6705 5490 6705 5985
4 0 0 50 -1 4 12 0.0000 0 135 105 1845 1890 0\001
4 0 0 50 -1 4 12 0.0000 0 135 105 2250 1890 9\001
4 0 0 50 -1 4 12 0.0000 0 135 210 2970 1890 10\001
4 0 0 50 -1 4 12 0.0000 0 135 210 3375 1890 29\001
4 0 0 50 -1 4 12 0.0000 0 135 210 4140 1890 30\001
4 0 0 50 -1 4 12 0.0000 0 135 210 4545 1890 49\001
4 0 0 50 -1 4 12 0.0000 0 135 210 5310 1890 50\001
4 0 0 50 -1 4 12 0.0000 0 135 210 5760 1890 69\001
4 0 0 50 -1 4 12 0.0000 0 180 2025 990 3195 set MS2: copy metadata\001
4 0 0 50 -1 4 12 0.0000 0 135 435 990 1890 MS1:\001
4 0 0 50 -1 4 12 0.0000 0 135 435 990 3735 MS2:\001
4 0 0 50 -1 4 12 0.0000 0 135 3270 1035 4905 write access: shared cache information\001
4 0 0 50 -1 4 12 0.0000 0 135 105 1800 5400 0\001
4 0 0 50 -1 4 12 0.0000 0 135 105 2205 5400 9\001
4 0 0 50 -1 4 12 0.0000 0 135 210 2925 5400 10\001
4 0 0 50 -1 4 12 0.0000 0 135 210 3330 5400 44\001
4 0 0 50 -1 4 12 0.0000 0 135 210 4095 5400 45\001
4 0 0 50 -1 4 12 0.0000 0 135 210 4500 5400 49\001
4 0 0 50 -1 4 12 0.0000 0 135 210 6435 5400 55\001
4 0 0 50 -1 4 12 0.0000 0 135 210 6840 5400 79\001
4 0 0 50 -1 4 12 0.0000 0 135 210 5265 5400 50\001
4 0 0 50 -1 4 12 0.0000 0 135 210 5715 5400 54\001
4 0 0 50 0 4 12 0.0000 0 15 255 7605 5400 . . .\001
