(classPool
(JNukeClass "Figure16_7a" "Figure16_7a.java"
  (JNukeMethod "Figure16_7a.<init>" (JNukeSignature "V" (JNukeVector))
  (JNukeByteCodes
    (JNukeAByteCode 0 "Load" ref 0x0 (line 1))
    (JNukeAByteCode 1 "InvokeSpecial" (JNukeMethod "java/lang/Object.<init>" (JNukeSignature "V" (JNukeVector))))
    (JNukeAByteCode 2 "Return" void)
))
  (JNukeMethod "Figure16_7a.m" (JNukeSignature "V" (JNukeVector "Z"))
  (JNukeEHandlers
    (JNukeEHandlerDesc (JNukeMethod "Figure16_7a.m" (JNukeSignature "V" (JNukeVector "Z"))) "<Any exception>" 0 1 67)
    (JNukeEHandlerDesc (JNukeMethod "Figure16_7a.m" (JNukeSignature "V" (JNukeVector "Z"))) "<Any exception>" 67 67 67)
    (JNukeEHandlerDesc (JNukeMethod "Figure16_7a.m" (JNukeSignature "V" (JNukeVector "Z"))) "<Any exception>" 2 3 21)
    (JNukeEHandlerDesc (JNukeMethod "Figure16_7a.m" (JNukeSignature "V" (JNukeVector "Z"))) "<Any exception>" 36 37 55)
    (JNukeEHandlerDesc (JNukeMethod "Figure16_7a.m" (JNukeSignature "V" (JNukeVector "Z"))) "<Any exception>" 68 69 87)
    (JNukeEHandlerDesc (JNukeMethod "Figure16_7a.m" (JNukeSignature "V" (JNukeVector "Z"))) "<Any exception>" 21 21 21)
    (JNukeEHandlerDesc (JNukeMethod "Figure16_7a.m" (JNukeSignature "V" (JNukeVector "Z"))) "<Any exception>" 55 55 55)
    (JNukeEHandlerDesc (JNukeMethod "Figure16_7a.m" (JNukeSignature "V" (JNukeVector "Z"))) "<Any exception>" 87 87 87)
    (JNukeEHandlerDesc (JNukeMethod "Figure16_7a.m" (JNukeSignature "V" (JNukeVector "Z"))) "java/lang/Throwable" 2 5 31)
    (JNukeEHandlerDesc (JNukeMethod "Figure16_7a.m" (JNukeSignature "V" (JNukeVector "Z"))) "java/lang/Throwable" 9 9 31)
    (JNukeEHandlerDesc (JNukeMethod "Figure16_7a.m" (JNukeSignature "V" (JNukeVector "Z"))) "java/lang/Throwable" 13 15 31)
    (JNukeEHandlerDesc (JNukeMethod "Figure16_7a.m" (JNukeSignature "V" (JNukeVector "Z"))) "java/lang/Throwable" 19 23 31)
    (JNukeEHandlerDesc (JNukeMethod "Figure16_7a.m" (JNukeSignature "V" (JNukeVector "Z"))) "java/lang/Throwable" 27 29 31)
    (JNukeEHandlerDesc (JNukeMethod "Figure16_7a.m" (JNukeSignature "V" (JNukeVector "Z"))) "java/lang/Throwable" 36 39 65)
    (JNukeEHandlerDesc (JNukeMethod "Figure16_7a.m" (JNukeSignature "V" (JNukeVector "Z"))) "java/lang/Throwable" 43 43 65)
    (JNukeEHandlerDesc (JNukeMethod "Figure16_7a.m" (JNukeSignature "V" (JNukeVector "Z"))) "java/lang/Throwable" 47 49 65)
    (JNukeEHandlerDesc (JNukeMethod "Figure16_7a.m" (JNukeSignature "V" (JNukeVector "Z"))) "java/lang/Throwable" 53 57 65)
    (JNukeEHandlerDesc (JNukeMethod "Figure16_7a.m" (JNukeSignature "V" (JNukeVector "Z"))) "java/lang/Throwable" 61 63 65)
    (JNukeEHandlerDesc (JNukeMethod "Figure16_7a.m" (JNukeSignature "V" (JNukeVector "Z"))) "java/lang/Throwable" 68 71 97)
    (JNukeEHandlerDesc (JNukeMethod "Figure16_7a.m" (JNukeSignature "V" (JNukeVector "Z"))) "java/lang/Throwable" 75 75 97)
    (JNukeEHandlerDesc (JNukeMethod "Figure16_7a.m" (JNukeSignature "V" (JNukeVector "Z"))) "java/lang/Throwable" 79 81 97)
    (JNukeEHandlerDesc (JNukeMethod "Figure16_7a.m" (JNukeSignature "V" (JNukeVector "Z"))) "java/lang/Throwable" 85 89 97)
    (JNukeEHandlerDesc (JNukeMethod "Figure16_7a.m" (JNukeSignature "V" (JNukeVector "Z"))) "java/lang/Throwable" 93 95 97)
    (JNukeEHandlerDesc (JNukeMethod "Figure16_7a.m" (JNukeSignature "V" (JNukeVector "Z"))) "<Any exception>" 0 5 104)
    (JNukeEHandlerDesc (JNukeMethod "Figure16_7a.m" (JNukeSignature "V" (JNukeVector "Z"))) "<Any exception>" 36 39 104)
    (JNukeEHandlerDesc (JNukeMethod "Figure16_7a.m" (JNukeSignature "V" (JNukeVector "Z"))) "<Any exception>" 14 15 104)
    (JNukeEHandlerDesc (JNukeMethod "Figure16_7a.m" (JNukeSignature "V" (JNukeVector "Z"))) "<Any exception>" 20 23 104)
    (JNukeEHandlerDesc (JNukeMethod "Figure16_7a.m" (JNukeSignature "V" (JNukeVector "Z"))) "<Any exception>" 28 31 104)
    (JNukeEHandlerDesc (JNukeMethod "Figure16_7a.m" (JNukeSignature "V" (JNukeVector "Z"))) "<Any exception>" 48 49 104)
    (JNukeEHandlerDesc (JNukeMethod "Figure16_7a.m" (JNukeSignature "V" (JNukeVector "Z"))) "<Any exception>" 54 57 104)
    (JNukeEHandlerDesc (JNukeMethod "Figure16_7a.m" (JNukeSignature "V" (JNukeVector "Z"))) "<Any exception>" 62 71 104)
    (JNukeEHandlerDesc (JNukeMethod "Figure16_7a.m" (JNukeSignature "V" (JNukeVector "Z"))) "<Any exception>" 80 81 104)
    (JNukeEHandlerDesc (JNukeMethod "Figure16_7a.m" (JNukeSignature "V" (JNukeVector "Z"))) "<Any exception>" 86 89 104)
    (JNukeEHandlerDesc (JNukeMethod "Figure16_7a.m" (JNukeSignature "V" (JNukeVector "Z"))) "<Any exception>" 94 99 104)
    (JNukeEHandlerDesc (JNukeMethod "Figure16_7a.m" (JNukeSignature "V" (JNukeVector "Z"))) "<Any exception>" 104 104 104)
  )
  (JNukeByteCodes
    (JNukeAByteCode 0 "Load" int 0x0 (line 4))
    (JNukeAByteCode 1 "Cond" ifeq 36)
      (JNukeAByteCode 2 "Load" int 0x0 (line 7))
      (JNukeAByteCode 3 "Cond" ifeq 14)
        (JNukeAByteCode 4 "Load" int 0x0 (line 8))
        (JNukeAByteCode 5 "Cond" ifeq 10)
          (JNukeAByteCode 6 "Load" int 0x0 (line 12))
          (JNukeAByteCode 7 "Cond" ifeq 9)
          (JNukeAByteCode 8 "Return" void)
        (JNukeAByteCode 9 "Return" void (line 8))
          (JNukeAByteCode 10 "Load" int 0x0 (line 12))
          (JNukeAByteCode 11 "Cond" ifeq 13)
          (JNukeAByteCode 12 "Return" void)
      (JNukeAByteCode 13 "Return" void (line 8))
        (JNukeAByteCode 14 "Load" int 0x0)
        (JNukeAByteCode 15 "Cond" ifeq 20)
          (JNukeAByteCode 16 "Load" int 0x0 (line 12))
          (JNukeAByteCode 17 "Cond" ifeq 19)
          (JNukeAByteCode 18 "Return" void)
        (JNukeAByteCode 19 "Return" void (line 8))
      (JNukeAByteCode 20 "Goto" 30)
      (JNukeAByteCode 21 "Store" ref 0x3 (line 8))
        (JNukeAByteCode 22 "Load" int 0x0)
        (JNukeAByteCode 23 "Cond" ifeq 28)
          (JNukeAByteCode 24 "Load" int 0x0 (line 12))
          (JNukeAByteCode 25 "Cond" ifeq 27)
          (JNukeAByteCode 26 "Return" void)
        (JNukeAByteCode 27 "Return" void (line 8))
      (JNukeAByteCode 28 "Load" ref 0x3)
      (JNukeAByteCode 29 "Athrow")
      (JNukeAByteCode 30 "Goto" 32 (line 9))
      (JNukeAByteCode 31 "Store" ref 0x3 (line 10))
          (JNukeAByteCode 32 "Load" int 0x0 (line 12))
          (JNukeAByteCode 33 "Cond" ifeq 35)
          (JNukeAByteCode 34 "Return" void)
    (JNukeAByteCode 35 "Return" void (line 10))
      (JNukeAByteCode 36 "Load" int 0x0 (line 7))
      (JNukeAByteCode 37 "Cond" ifeq 48)
        (JNukeAByteCode 38 "Load" int 0x0 (line 8))
        (JNukeAByteCode 39 "Cond" ifeq 44)
          (JNukeAByteCode 40 "Load" int 0x0 (line 12))
          (JNukeAByteCode 41 "Cond" ifeq 43)
          (JNukeAByteCode 42 "Return" void)
        (JNukeAByteCode 43 "Return" void (line 8))
          (JNukeAByteCode 44 "Load" int 0x0 (line 12))
          (JNukeAByteCode 45 "Cond" ifeq 47)
          (JNukeAByteCode 46 "Return" void)
      (JNukeAByteCode 47 "Return" void (line 8))
        (JNukeAByteCode 48 "Load" int 0x0)
        (JNukeAByteCode 49 "Cond" ifeq 54)
          (JNukeAByteCode 50 "Load" int 0x0 (line 12))
          (JNukeAByteCode 51 "Cond" ifeq 53)
          (JNukeAByteCode 52 "Return" void)
        (JNukeAByteCode 53 "Return" void (line 8))
      (JNukeAByteCode 54 "Goto" 64)
      (JNukeAByteCode 55 "Store" ref 0x3 (line 8))
        (JNukeAByteCode 56 "Load" int 0x0)
        (JNukeAByteCode 57 "Cond" ifeq 62)
          (JNukeAByteCode 58 "Load" int 0x0 (line 12))
          (JNukeAByteCode 59 "Cond" ifeq 61)
          (JNukeAByteCode 60 "Return" void)
        (JNukeAByteCode 61 "Return" void (line 8))
      (JNukeAByteCode 62 "Load" ref 0x3)
      (JNukeAByteCode 63 "Athrow")
      (JNukeAByteCode 64 "Goto" 66 (line 9))
      (JNukeAByteCode 65 "Store" ref 0x3 (line 10))
    (JNukeAByteCode 66 "Goto" 100 (line 7))
    (JNukeAByteCode 67 "Store" ref 0x1 (line 6))
      (JNukeAByteCode 68 "Load" int 0x0 (line 7))
      (JNukeAByteCode 69 "Cond" ifeq 80)
        (JNukeAByteCode 70 "Load" int 0x0 (line 8))
        (JNukeAByteCode 71 "Cond" ifeq 76)
          (JNukeAByteCode 72 "Load" int 0x0 (line 12))
          (JNukeAByteCode 73 "Cond" ifeq 75)
          (JNukeAByteCode 74 "Return" void)
        (JNukeAByteCode 75 "Return" void (line 8))
          (JNukeAByteCode 76 "Load" int 0x0 (line 12))
          (JNukeAByteCode 77 "Cond" ifeq 79)
          (JNukeAByteCode 78 "Return" void)
      (JNukeAByteCode 79 "Return" void (line 8))
        (JNukeAByteCode 80 "Load" int 0x0)
        (JNukeAByteCode 81 "Cond" ifeq 86)
          (JNukeAByteCode 82 "Load" int 0x0 (line 12))
          (JNukeAByteCode 83 "Cond" ifeq 85)
          (JNukeAByteCode 84 "Return" void)
        (JNukeAByteCode 85 "Return" void (line 8))
      (JNukeAByteCode 86 "Goto" 96)
      (JNukeAByteCode 87 "Store" ref 0x3 (line 8))
        (JNukeAByteCode 88 "Load" int 0x0)
        (JNukeAByteCode 89 "Cond" ifeq 94)
          (JNukeAByteCode 90 "Load" int 0x0 (line 12))
          (JNukeAByteCode 91 "Cond" ifeq 93)
          (JNukeAByteCode 92 "Return" void)
        (JNukeAByteCode 93 "Return" void (line 8))
      (JNukeAByteCode 94 "Load" ref 0x3)
      (JNukeAByteCode 95 "Athrow")
      (JNukeAByteCode 96 "Goto" 98 (line 9))
      (JNukeAByteCode 97 "Store" ref 0x3 (line 10))
    (JNukeAByteCode 98 "Load" ref 0x1 (line 7))
    (JNukeAByteCode 99 "Athrow")
          (JNukeAByteCode 100 "Load" int 0x0 (line 12))
          (JNukeAByteCode 101 "Cond" ifeq 103)
          (JNukeAByteCode 102 "Return" void)
    (JNukeAByteCode 103 "Goto" 110 (line 7))
    (JNukeAByteCode 104 "Store" ref 0x5)
          (JNukeAByteCode 105 "Load" int 0x0 (line 12))
          (JNukeAByteCode 106 "Cond" ifeq 108)
          (JNukeAByteCode 107 "Return" void)
    (JNukeAByteCode 108 "Load" ref 0x5 (line 7))
    (JNukeAByteCode 109 "Athrow")
    (JNukeAByteCode 110 "Return" void (line 13))
))
)
)
