#FIG 3.2
Landscape
Center
Inches
Letter  
100.00
Single
-2
1200 2
1 1 0 1 0 7 50 0 45 0.000 1 0.0000 7350 3675 225 225 7350 3675 7575 3900
1 1 0 1 0 7 50 0 45 0.000 1 0.0000 7350 4425 225 225 7350 4425 7575 4650
1 1 0 1 0 7 50 0 45 0.000 1 0.0000 6300 3675 225 225 6300 3675 6525 3900
1 1 0 1 0 7 50 0 45 0.000 1 0.0000 5475 3675 225 225 5475 3675 5700 3900
1 1 0 1 0 7 50 0 45 0.000 1 0.0000 5925 4425 225 225 5925 4425 6150 4650
2 1 0 1 0 7 50 0 -1 0.000 0 0 -1 1 0 2
	1 1 1.00 60.00 120.00
	 8625 4425 7575 4425
2 1 0 1 0 7 50 0 -1 0.000 0 0 -1 1 0 2
	1 1 1.00 60.00 120.00
	 8550 3675 7575 3675
2 2 0 1 0 7 50 0 -1 0.000 0 0 -1 0 0 5
	 5100 3300 7875 3300 7875 4800 5100 4800 5100 3300
2 1 0 1 0 7 50 0 -1 0.000 0 0 -1 1 0 4
	1 1 1.00 60.00 120.00
	 5925 4650 5925 5025 8925 5025 8925 4725
2 2 0 1 0 7 50 0 45 0.000 0 0 -1 0 0 5
	 8625 4125 9225 4125 9225 4725 8625 4725 8625 4125
2 2 0 1 0 7 50 0 45 0.000 0 0 -1 0 0 5
	 8625 3375 9225 3375 9225 3975 8625 3975 8625 3375
2 2 0 1 0 7 50 0 -1 0.000 0 0 -1 0 0 5
	 8550 3300 9300 3300 9300 4800 8550 4800 8550 3300
2 1 0 1 0 7 50 0 -1 0.000 0 0 -1 1 0 4
	1 1 1.00 60.00 120.00
	 6300 3450 6300 3075 8925 3075 8925 3375
2 1 0 1 0 7 50 0 -1 0.000 0 0 -1 1 0 4
	1 1 1.00 60.00 120.00
	 5475 3450 5475 3000 9075 3000 9075 3375
2 1 1 1 0 7 50 0 -1 4.000 0 0 -1 0 0 2
	 6825 2625 6825 5325
2 1 0 1 0 7 50 0 -1 0.000 0 0 -1 0 0 2
	 5250 4575 5250 5025
4 0 0 50 0 0 12 0.0000 4 180 1245 5100 2850 object instances\001
4 0 0 50 0 0 12 0.0000 4 135 930 9450 3525 method area\001
4 0 0 50 0 0 12 0.0000 4 180 1335 4425 5250 garbage collected\001
4 0 0 50 0 0 12 0.0000 4 180 360 4575 3525 heap\001
4 0 0 50 0 0 12 0.0000 4 135 1185 6975 2850 class instances\001
