(classPool
(JNukeClass "Wide" "Wide.java"
  (JNukeMethod "Wide.<init>" (JNukeSignature "V" (JNukeVector))
  (JNukeByteCodes
    (JNukeRByteCode 0 "r0 = Get" l0 (line 1))
    (JNukeRByteCode 1 "     InvokeSpecial" (JNukeMethod "java/lang/Object.<init>" (JNukeSignature "V" (JNukeVector))) r0)
    (JNukeRByteCode 2 "     Return" void)
))
  (JNukeMethod "Wide.m" (JNukeSignature "V" (JNukeVector))
  (JNukeByteCodes
    (JNukeRByteCode 0 "r0 = Const" int 0 (line 3))
    (JNukeRByteCode 1 "l1 = Get" r0)
    (JNukeRByteCode 2 "r0 = Const" int 1 (line 4))
    (JNukeRByteCode 3 "l2 = Get" r0)
    (JNukeRByteCode 4 "r0 = Const" int 4 (line 5))
    (JNukeRByteCode 5 "l3 = Get" r0)
    (JNukeRByteCode 6 "r0 = Const" int 9 (line 6))
    (JNukeRByteCode 7 "l4 = Get" r0)
    (JNukeRByteCode 8 "r0 = Const" int 16 (line 7))
    (JNukeRByteCode 9 "l5 = Get" r0)
    (JNukeRByteCode 10 "r0 = Const" int 25 (line 8))
    (JNukeRByteCode 11 "l6 = Get" r0)
    (JNukeRByteCode 12 "r0 = Const" int 36 (line 9))
    (JNukeRByteCode 13 "l7 = Get" r0)
    (JNukeRByteCode 14 "r0 = Const" int 49 (line 10))
    (JNukeRByteCode 15 "l8 = Get" r0)
    (JNukeRByteCode 16 "r0 = Const" int 64 (line 11))
    (JNukeRByteCode 17 "l9 = Get" r0)
    (JNukeRByteCode 18 "r0 = Const" int 81 (line 12))
    (JNukeRByteCode 19 "l10 = Get" r0)
    (JNukeRByteCode 20 "r0 = Const" int 100 (line 13))
    (JNukeRByteCode 21 "l11 = Get" r0)
    (JNukeRByteCode 22 "r0 = Const" int 121 (line 14))
    (JNukeRByteCode 23 "l12 = Get" r0)
    (JNukeRByteCode 24 "r0 = Const" int 144 (line 15))
    (JNukeRByteCode 25 "l13 = Get" r0)
    (JNukeRByteCode 26 "r0 = Const" int 169 (line 16))
    (JNukeRByteCode 27 "l14 = Get" r0)
    (JNukeRByteCode 28 "r0 = Const" int 196 (line 17))
    (JNukeRByteCode 29 "l15 = Get" r0)
    (JNukeRByteCode 30 "r0 = Const" int 225 (line 18))
    (JNukeRByteCode 31 "l16 = Get" r0)
    (JNukeRByteCode 32 "r0 = Const" int 256 (line 19))
    (JNukeRByteCode 33 "l17 = Get" r0)
    (JNukeRByteCode 34 "r0 = Const" int 289 (line 20))
    (JNukeRByteCode 35 "l18 = Get" r0)
    (JNukeRByteCode 36 "r0 = Const" int 324 (line 21))
    (JNukeRByteCode 37 "l19 = Get" r0)
    (JNukeRByteCode 38 "r0 = Const" int 361 (line 22))
    (JNukeRByteCode 39 "l20 = Get" r0)
    (JNukeRByteCode 40 "r0 = Const" int 400 (line 23))
    (JNukeRByteCode 41 "l21 = Get" r0)
    (JNukeRByteCode 42 "r0 = Const" int 441 (line 24))
    (JNukeRByteCode 43 "l22 = Get" r0)
    (JNukeRByteCode 44 "r0 = Const" int 484 (line 25))
    (JNukeRByteCode 45 "l23 = Get" r0)
    (JNukeRByteCode 46 "r0 = Const" int 529 (line 26))
    (JNukeRByteCode 47 "l24 = Get" r0)
    (JNukeRByteCode 48 "r0 = Const" int 576 (line 27))
    (JNukeRByteCode 49 "l25 = Get" r0)
    (JNukeRByteCode 50 "r0 = Const" int 625 (line 28))
    (JNukeRByteCode 51 "l26 = Get" r0)
    (JNukeRByteCode 52 "r0 = Const" int 676 (line 29))
    (JNukeRByteCode 53 "l27 = Get" r0)
    (JNukeRByteCode 54 "r0 = Const" int 729 (line 30))
    (JNukeRByteCode 55 "l28 = Get" r0)
    (JNukeRByteCode 56 "r0 = Const" int 784 (line 31))
    (JNukeRByteCode 57 "l29 = Get" r0)
    (JNukeRByteCode 58 "r0 = Const" int 841 (line 32))
    (JNukeRByteCode 59 "l30 = Get" r0)
    (JNukeRByteCode 60 "r0 = Const" int 900 (line 33))
    (JNukeRByteCode 61 "l31 = Get" r0)
    (JNukeRByteCode 62 "r0 = Const" int 961 (line 34))
    (JNukeRByteCode 63 "l32 = Get" r0)
    (JNukeRByteCode 64 "r0 = Const" int 1024 (line 35))
    (JNukeRByteCode 65 "l33 = Get" r0)
    (JNukeRByteCode 66 "r0 = Const" int 1089 (line 36))
    (JNukeRByteCode 67 "l34 = Get" r0)
    (JNukeRByteCode 68 "r0 = Const" int 1156 (line 37))
    (JNukeRByteCode 69 "l35 = Get" r0)
    (JNukeRByteCode 70 "r0 = Const" int 1225 (line 38))
    (JNukeRByteCode 71 "l36 = Get" r0)
    (JNukeRByteCode 72 "r0 = Const" int 1296 (line 39))
    (JNukeRByteCode 73 "l37 = Get" r0)
    (JNukeRByteCode 74 "r0 = Const" int 1369 (line 40))
    (JNukeRByteCode 75 "l38 = Get" r0)
    (JNukeRByteCode 76 "r0 = Const" int 1444 (line 41))
    (JNukeRByteCode 77 "l39 = Get" r0)
    (JNukeRByteCode 78 "r0 = Const" int 1521 (line 42))
    (JNukeRByteCode 79 "l40 = Get" r0)
    (JNukeRByteCode 80 "r0 = Const" int 1600 (line 43))
    (JNukeRByteCode 81 "l41 = Get" r0)
    (JNukeRByteCode 82 "r0 = Const" int 1681 (line 44))
    (JNukeRByteCode 83 "l42 = Get" r0)
    (JNukeRByteCode 84 "r0 = Const" int 1764 (line 45))
    (JNukeRByteCode 85 "l43 = Get" r0)
    (JNukeRByteCode 86 "r0 = Const" int 1849 (line 46))
    (JNukeRByteCode 87 "l44 = Get" r0)
    (JNukeRByteCode 88 "r0 = Const" int 1936 (line 47))
    (JNukeRByteCode 89 "l45 = Get" r0)
    (JNukeRByteCode 90 "r0 = Const" int 2025 (line 48))
    (JNukeRByteCode 91 "l46 = Get" r0)
    (JNukeRByteCode 92 "r0 = Const" int 2116 (line 49))
    (JNukeRByteCode 93 "l47 = Get" r0)
    (JNukeRByteCode 94 "r0 = Const" int 2209 (line 50))
    (JNukeRByteCode 95 "l48 = Get" r0)
    (JNukeRByteCode 96 "r0 = Const" int 2304 (line 51))
    (JNukeRByteCode 97 "l49 = Get" r0)
    (JNukeRByteCode 98 "r0 = Const" int 2401 (line 52))
    (JNukeRByteCode 99 "l50 = Get" r0)
    (JNukeRByteCode 100 "r0 = Const" int 2500 (line 53))
    (JNukeRByteCode 101 "l51 = Get" r0)
    (JNukeRByteCode 102 "r0 = Const" int 2601 (line 54))
    (JNukeRByteCode 103 "l52 = Get" r0)
    (JNukeRByteCode 104 "r0 = Const" int 2704 (line 55))
    (JNukeRByteCode 105 "l53 = Get" r0)
    (JNukeRByteCode 106 "r0 = Const" int 2809 (line 56))
    (JNukeRByteCode 107 "l54 = Get" r0)
    (JNukeRByteCode 108 "r0 = Const" int 2916 (line 57))
    (JNukeRByteCode 109 "l55 = Get" r0)
    (JNukeRByteCode 110 "r0 = Const" int 3025 (line 58))
    (JNukeRByteCode 111 "l56 = Get" r0)
    (JNukeRByteCode 112 "r0 = Const" int 3136 (line 59))
    (JNukeRByteCode 113 "l57 = Get" r0)
    (JNukeRByteCode 114 "r0 = Const" int 3249 (line 60))
    (JNukeRByteCode 115 "l58 = Get" r0)
    (JNukeRByteCode 116 "r0 = Const" int 3364 (line 61))
    (JNukeRByteCode 117 "l59 = Get" r0)
    (JNukeRByteCode 118 "r0 = Const" int 3481 (line 62))
    (JNukeRByteCode 119 "l60 = Get" r0)
    (JNukeRByteCode 120 "r0 = Const" int 3600 (line 63))
    (JNukeRByteCode 121 "l61 = Get" r0)
    (JNukeRByteCode 122 "r0 = Const" int 3721 (line 64))
    (JNukeRByteCode 123 "l62 = Get" r0)
    (JNukeRByteCode 124 "r0 = Const" int 3844 (line 65))
    (JNukeRByteCode 125 "l63 = Get" r0)
    (JNukeRByteCode 126 "r0 = Const" int 3969 (line 66))
    (JNukeRByteCode 127 "l64 = Get" r0)
    (JNukeRByteCode 128 "r0 = Const" int 4096 (line 67))
    (JNukeRByteCode 129 "l65 = Get" r0)
    (JNukeRByteCode 130 "r0 = Const" int 4225 (line 68))
    (JNukeRByteCode 131 "l66 = Get" r0)
    (JNukeRByteCode 132 "r0 = Const" int 4356 (line 69))
    (JNukeRByteCode 133 "l67 = Get" r0)
    (JNukeRByteCode 134 "r0 = Const" int 4489 (line 70))
    (JNukeRByteCode 135 "l68 = Get" r0)
    (JNukeRByteCode 136 "r0 = Const" int 4624 (line 71))
    (JNukeRByteCode 137 "l69 = Get" r0)
    (JNukeRByteCode 138 "r0 = Const" int 4761 (line 72))
    (JNukeRByteCode 139 "l70 = Get" r0)
    (JNukeRByteCode 140 "r0 = Const" int 4900 (line 73))
    (JNukeRByteCode 141 "l71 = Get" r0)
    (JNukeRByteCode 142 "r0 = Const" int 5041 (line 74))
    (JNukeRByteCode 143 "l72 = Get" r0)
    (JNukeRByteCode 144 "r0 = Const" int 5184 (line 75))
    (JNukeRByteCode 145 "l73 = Get" r0)
    (JNukeRByteCode 146 "r0 = Const" int 5329 (line 76))
    (JNukeRByteCode 147 "l74 = Get" r0)
    (JNukeRByteCode 148 "r0 = Const" int 5476 (line 77))
    (JNukeRByteCode 149 "l75 = Get" r0)
    (JNukeRByteCode 150 "r0 = Const" int 5625 (line 78))
    (JNukeRByteCode 151 "l76 = Get" r0)
    (JNukeRByteCode 152 "r0 = Const" int 5776 (line 79))
    (JNukeRByteCode 153 "l77 = Get" r0)
    (JNukeRByteCode 154 "r0 = Const" int 5929 (line 80))
    (JNukeRByteCode 155 "l78 = Get" r0)
    (JNukeRByteCode 156 "r0 = Const" int 6084 (line 81))
    (JNukeRByteCode 157 "l79 = Get" r0)
    (JNukeRByteCode 158 "r0 = Const" int 6241 (line 82))
    (JNukeRByteCode 159 "l80 = Get" r0)
    (JNukeRByteCode 160 "r0 = Const" int 6400 (line 83))
    (JNukeRByteCode 161 "l81 = Get" r0)
    (JNukeRByteCode 162 "r0 = Const" int 6561 (line 84))
    (JNukeRByteCode 163 "l82 = Get" r0)
    (JNukeRByteCode 164 "r0 = Const" int 6724 (line 85))
    (JNukeRByteCode 165 "l83 = Get" r0)
    (JNukeRByteCode 166 "r0 = Const" int 6889 (line 86))
    (JNukeRByteCode 167 "l84 = Get" r0)
    (JNukeRByteCode 168 "r0 = Const" int 7056 (line 87))
    (JNukeRByteCode 169 "l85 = Get" r0)
    (JNukeRByteCode 170 "r0 = Const" int 7225 (line 88))
    (JNukeRByteCode 171 "l86 = Get" r0)
    (JNukeRByteCode 172 "r0 = Const" int 7396 (line 89))
    (JNukeRByteCode 173 "l87 = Get" r0)
    (JNukeRByteCode 174 "r0 = Const" int 7569 (line 90))
    (JNukeRByteCode 175 "l88 = Get" r0)
    (JNukeRByteCode 176 "r0 = Const" int 7744 (line 91))
    (JNukeRByteCode 177 "l89 = Get" r0)
    (JNukeRByteCode 178 "r0 = Const" int 7921 (line 92))
    (JNukeRByteCode 179 "l90 = Get" r0)
    (JNukeRByteCode 180 "r0 = Const" int 8100 (line 93))
    (JNukeRByteCode 181 "l91 = Get" r0)
    (JNukeRByteCode 182 "r0 = Const" int 8281 (line 94))
    (JNukeRByteCode 183 "l92 = Get" r0)
    (JNukeRByteCode 184 "r0 = Const" int 8464 (line 95))
    (JNukeRByteCode 185 "l93 = Get" r0)
    (JNukeRByteCode 186 "r0 = Const" int 8649 (line 96))
    (JNukeRByteCode 187 "l94 = Get" r0)
    (JNukeRByteCode 188 "r0 = Const" int 8836 (line 97))
    (JNukeRByteCode 189 "l95 = Get" r0)
    (JNukeRByteCode 190 "r0 = Const" int 9025 (line 98))
    (JNukeRByteCode 191 "l96 = Get" r0)
    (JNukeRByteCode 192 "r0 = Const" int 9216 (line 99))
    (JNukeRByteCode 193 "l97 = Get" r0)
    (JNukeRByteCode 194 "r0 = Const" int 9409 (line 100))
    (JNukeRByteCode 195 "l98 = Get" r0)
    (JNukeRByteCode 196 "r0 = Const" int 9604 (line 101))
    (JNukeRByteCode 197 "l99 = Get" r0)
    (JNukeRByteCode 198 "r0 = Const" int 9801 (line 102))
    (JNukeRByteCode 199 "l100 = Get" r0)
    (JNukeRByteCode 200 "r0 = Const" int 10000 (line 103))
    (JNukeRByteCode 201 "l101 = Get" r0)
    (JNukeRByteCode 202 "r0 = Const" int 10201 (line 104))
    (JNukeRByteCode 203 "l102 = Get" r0)
    (JNukeRByteCode 204 "r0 = Const" int 10404 (line 105))
    (JNukeRByteCode 205 "l103 = Get" r0)
    (JNukeRByteCode 206 "r0 = Const" int 10609 (line 106))
    (JNukeRByteCode 207 "l104 = Get" r0)
    (JNukeRByteCode 208 "r0 = Const" int 10816 (line 107))
    (JNukeRByteCode 209 "l105 = Get" r0)
    (JNukeRByteCode 210 "r0 = Const" int 11025 (line 108))
    (JNukeRByteCode 211 "l106 = Get" r0)
    (JNukeRByteCode 212 "r0 = Const" int 11236 (line 109))
    (JNukeRByteCode 213 "l107 = Get" r0)
    (JNukeRByteCode 214 "r0 = Const" int 11449 (line 110))
    (JNukeRByteCode 215 "l108 = Get" r0)
    (JNukeRByteCode 216 "r0 = Const" int 11664 (line 111))
    (JNukeRByteCode 217 "l109 = Get" r0)
    (JNukeRByteCode 218 "r0 = Const" int 11881 (line 112))
    (JNukeRByteCode 219 "l110 = Get" r0)
    (JNukeRByteCode 220 "r0 = Const" int 12100 (line 113))
    (JNukeRByteCode 221 "l111 = Get" r0)
    (JNukeRByteCode 222 "r0 = Const" int 12321 (line 114))
    (JNukeRByteCode 223 "l112 = Get" r0)
    (JNukeRByteCode 224 "r0 = Const" int 12544 (line 115))
    (JNukeRByteCode 225 "l113 = Get" r0)
    (JNukeRByteCode 226 "r0 = Const" int 12769 (line 116))
    (JNukeRByteCode 227 "l114 = Get" r0)
    (JNukeRByteCode 228 "r0 = Const" int 12996 (line 117))
    (JNukeRByteCode 229 "l115 = Get" r0)
    (JNukeRByteCode 230 "r0 = Const" int 13225 (line 118))
    (JNukeRByteCode 231 "l116 = Get" r0)
    (JNukeRByteCode 232 "r0 = Const" int 13456 (line 119))
    (JNukeRByteCode 233 "l117 = Get" r0)
    (JNukeRByteCode 234 "r0 = Const" int 13689 (line 120))
    (JNukeRByteCode 235 "l118 = Get" r0)
    (JNukeRByteCode 236 "r0 = Const" int 13924 (line 121))
    (JNukeRByteCode 237 "l119 = Get" r0)
    (JNukeRByteCode 238 "r0 = Const" int 14161 (line 122))
    (JNukeRByteCode 239 "l120 = Get" r0)
    (JNukeRByteCode 240 "r0 = Const" int 14400 (line 123))
    (JNukeRByteCode 241 "l121 = Get" r0)
    (JNukeRByteCode 242 "r0 = Const" int 14641 (line 124))
    (JNukeRByteCode 243 "l122 = Get" r0)
    (JNukeRByteCode 244 "r0 = Const" int 14884 (line 125))
    (JNukeRByteCode 245 "l123 = Get" r0)
    (JNukeRByteCode 246 "r0 = Const" int 15129 (line 126))
    (JNukeRByteCode 247 "l124 = Get" r0)
    (JNukeRByteCode 248 "r0 = Const" int 15376 (line 127))
    (JNukeRByteCode 249 "l125 = Get" r0)
    (JNukeRByteCode 250 "r0 = Const" int 15625 (line 128))
    (JNukeRByteCode 251 "l126 = Get" r0)
    (JNukeRByteCode 252 "r0 = Const" int 15876 (line 129))
    (JNukeRByteCode 253 "l127 = Get" r0)
    (JNukeRByteCode 254 "r0 = Const" int 16129 (line 130))
    (JNukeRByteCode 255 "l128 = Get" r0)
    (JNukeRByteCode 256 "r0 = Const" int 16384 (line 131))
    (JNukeRByteCode 257 "l129 = Get" r0)
    (JNukeRByteCode 258 "r0 = Const" int 16641 (line 132))
    (JNukeRByteCode 259 "l130 = Get" r0)
    (JNukeRByteCode 260 "r0 = Const" int 16900 (line 133))
    (JNukeRByteCode 261 "l131 = Get" r0)
    (JNukeRByteCode 262 "r0 = Const" int 17161 (line 134))
    (JNukeRByteCode 263 "l132 = Get" r0)
    (JNukeRByteCode 264 "r0 = Const" int 17424 (line 135))
    (JNukeRByteCode 265 "l133 = Get" r0)
    (JNukeRByteCode 266 "r0 = Const" int 17689 (line 136))
    (JNukeRByteCode 267 "l134 = Get" r0)
    (JNukeRByteCode 268 "r0 = Const" int 17956 (line 137))
    (JNukeRByteCode 269 "l135 = Get" r0)
    (JNukeRByteCode 270 "r0 = Const" int 18225 (line 138))
    (JNukeRByteCode 271 "l136 = Get" r0)
    (JNukeRByteCode 272 "r0 = Const" int 18496 (line 139))
    (JNukeRByteCode 273 "l137 = Get" r0)
    (JNukeRByteCode 274 "r0 = Const" int 18769 (line 140))
    (JNukeRByteCode 275 "l138 = Get" r0)
    (JNukeRByteCode 276 "r0 = Const" int 19044 (line 141))
    (JNukeRByteCode 277 "l139 = Get" r0)
    (JNukeRByteCode 278 "r0 = Const" int 19321 (line 142))
    (JNukeRByteCode 279 "l140 = Get" r0)
    (JNukeRByteCode 280 "r0 = Const" int 19600 (line 143))
    (JNukeRByteCode 281 "l141 = Get" r0)
    (JNukeRByteCode 282 "r0 = Const" int 19881 (line 144))
    (JNukeRByteCode 283 "l142 = Get" r0)
    (JNukeRByteCode 284 "r0 = Const" int 20164 (line 145))
    (JNukeRByteCode 285 "l143 = Get" r0)
    (JNukeRByteCode 286 "r0 = Const" int 20449 (line 146))
    (JNukeRByteCode 287 "l144 = Get" r0)
    (JNukeRByteCode 288 "r0 = Const" int 20736 (line 147))
    (JNukeRByteCode 289 "l145 = Get" r0)
    (JNukeRByteCode 290 "r0 = Const" int 21025 (line 148))
    (JNukeRByteCode 291 "l146 = Get" r0)
    (JNukeRByteCode 292 "r0 = Const" int 21316 (line 149))
    (JNukeRByteCode 293 "l147 = Get" r0)
    (JNukeRByteCode 294 "r0 = Const" int 21609 (line 150))
    (JNukeRByteCode 295 "l148 = Get" r0)
    (JNukeRByteCode 296 "r0 = Const" int 21904 (line 151))
    (JNukeRByteCode 297 "l149 = Get" r0)
    (JNukeRByteCode 298 "r0 = Const" int 22201 (line 152))
    (JNukeRByteCode 299 "l150 = Get" r0)
    (JNukeRByteCode 300 "r0 = Const" int 22500 (line 153))
    (JNukeRByteCode 301 "l151 = Get" r0)
    (JNukeRByteCode 302 "r0 = Const" int 22801 (line 154))
    (JNukeRByteCode 303 "l152 = Get" r0)
    (JNukeRByteCode 304 "r0 = Const" int 23104 (line 155))
    (JNukeRByteCode 305 "l153 = Get" r0)
    (JNukeRByteCode 306 "r0 = Const" int 23409 (line 156))
    (JNukeRByteCode 307 "l154 = Get" r0)
    (JNukeRByteCode 308 "r0 = Const" int 23716 (line 157))
    (JNukeRByteCode 309 "l155 = Get" r0)
    (JNukeRByteCode 310 "r0 = Const" int 24025 (line 158))
    (JNukeRByteCode 311 "l156 = Get" r0)
    (JNukeRByteCode 312 "r0 = Const" int 24336 (line 159))
    (JNukeRByteCode 313 "l157 = Get" r0)
    (JNukeRByteCode 314 "r0 = Const" int 24649 (line 160))
    (JNukeRByteCode 315 "l158 = Get" r0)
    (JNukeRByteCode 316 "r0 = Const" int 24964 (line 161))
    (JNukeRByteCode 317 "l159 = Get" r0)
    (JNukeRByteCode 318 "r0 = Const" int 25281 (line 162))
    (JNukeRByteCode 319 "l160 = Get" r0)
    (JNukeRByteCode 320 "r0 = Const" int 25600 (line 163))
    (JNukeRByteCode 321 "l161 = Get" r0)
    (JNukeRByteCode 322 "r0 = Const" int 25921 (line 164))
    (JNukeRByteCode 323 "l162 = Get" r0)
    (JNukeRByteCode 324 "r0 = Const" int 26244 (line 165))
    (JNukeRByteCode 325 "l163 = Get" r0)
    (JNukeRByteCode 326 "r0 = Const" int 26569 (line 166))
    (JNukeRByteCode 327 "l164 = Get" r0)
    (JNukeRByteCode 328 "r0 = Const" int 26896 (line 167))
    (JNukeRByteCode 329 "l165 = Get" r0)
    (JNukeRByteCode 330 "r0 = Const" int 27225 (line 168))
    (JNukeRByteCode 331 "l166 = Get" r0)
    (JNukeRByteCode 332 "r0 = Const" int 27556 (line 169))
    (JNukeRByteCode 333 "l167 = Get" r0)
    (JNukeRByteCode 334 "r0 = Const" int 27889 (line 170))
    (JNukeRByteCode 335 "l168 = Get" r0)
    (JNukeRByteCode 336 "r0 = Const" int 28224 (line 171))
    (JNukeRByteCode 337 "l169 = Get" r0)
    (JNukeRByteCode 338 "r0 = Const" int 28561 (line 172))
    (JNukeRByteCode 339 "l170 = Get" r0)
    (JNukeRByteCode 340 "r0 = Const" int 28900 (line 173))
    (JNukeRByteCode 341 "l171 = Get" r0)
    (JNukeRByteCode 342 "r0 = Const" int 29241 (line 174))
    (JNukeRByteCode 343 "l172 = Get" r0)
    (JNukeRByteCode 344 "r0 = Const" int 29584 (line 175))
    (JNukeRByteCode 345 "l173 = Get" r0)
    (JNukeRByteCode 346 "r0 = Const" int 29929 (line 176))
    (JNukeRByteCode 347 "l174 = Get" r0)
    (JNukeRByteCode 348 "r0 = Const" int 30276 (line 177))
    (JNukeRByteCode 349 "l175 = Get" r0)
    (JNukeRByteCode 350 "r0 = Const" int 30625 (line 178))
    (JNukeRByteCode 351 "l176 = Get" r0)
    (JNukeRByteCode 352 "r0 = Const" int 30976 (line 179))
    (JNukeRByteCode 353 "l177 = Get" r0)
    (JNukeRByteCode 354 "r0 = Const" int 31329 (line 180))
    (JNukeRByteCode 355 "l178 = Get" r0)
    (JNukeRByteCode 356 "r0 = Const" int 31684 (line 181))
    (JNukeRByteCode 357 "l179 = Get" r0)
    (JNukeRByteCode 358 "r0 = Const" int 32041 (line 182))
    (JNukeRByteCode 359 "l180 = Get" r0)
    (JNukeRByteCode 360 "r0 = Const" int 32400 (line 183))
    (JNukeRByteCode 361 "l181 = Get" r0)
    (JNukeRByteCode 362 "r0 = Const" int 32761 (line 184))
    (JNukeRByteCode 363 "l182 = Get" r0)
    (JNukeRByteCode 364 "r0 = Const" int 33124 (line 185))
    (JNukeRByteCode 365 "l183 = Get" r0)
    (JNukeRByteCode 366 "r0 = Const" int 33489 (line 186))
    (JNukeRByteCode 367 "l184 = Get" r0)
    (JNukeRByteCode 368 "r0 = Const" int 33856 (line 187))
    (JNukeRByteCode 369 "l185 = Get" r0)
    (JNukeRByteCode 370 "r0 = Const" int 34225 (line 188))
    (JNukeRByteCode 371 "l186 = Get" r0)
    (JNukeRByteCode 372 "r0 = Const" int 34596 (line 189))
    (JNukeRByteCode 373 "l187 = Get" r0)
    (JNukeRByteCode 374 "r0 = Const" int 34969 (line 190))
    (JNukeRByteCode 375 "l188 = Get" r0)
    (JNukeRByteCode 376 "r0 = Const" int 35344 (line 191))
    (JNukeRByteCode 377 "l189 = Get" r0)
    (JNukeRByteCode 378 "r0 = Const" int 35721 (line 192))
    (JNukeRByteCode 379 "l190 = Get" r0)
    (JNukeRByteCode 380 "r0 = Const" int 36100 (line 193))
    (JNukeRByteCode 381 "l191 = Get" r0)
    (JNukeRByteCode 382 "r0 = Const" int 36481 (line 194))
    (JNukeRByteCode 383 "l192 = Get" r0)
    (JNukeRByteCode 384 "r0 = Const" int 36864 (line 195))
    (JNukeRByteCode 385 "l193 = Get" r0)
    (JNukeRByteCode 386 "r0 = Const" int 37249 (line 196))
    (JNukeRByteCode 387 "l194 = Get" r0)
    (JNukeRByteCode 388 "r0 = Const" int 37636 (line 197))
    (JNukeRByteCode 389 "l195 = Get" r0)
    (JNukeRByteCode 390 "r0 = Const" int 38025 (line 198))
    (JNukeRByteCode 391 "l196 = Get" r0)
    (JNukeRByteCode 392 "r0 = Const" int 38416 (line 199))
    (JNukeRByteCode 393 "l197 = Get" r0)
    (JNukeRByteCode 394 "r0 = Const" int 38809 (line 200))
    (JNukeRByteCode 395 "l198 = Get" r0)
    (JNukeRByteCode 396 "r0 = Const" int 39204 (line 201))
    (JNukeRByteCode 397 "l199 = Get" r0)
    (JNukeRByteCode 398 "r0 = Const" int 39601 (line 202))
    (JNukeRByteCode 399 "l200 = Get" r0)
    (JNukeRByteCode 400 "r0 = Const" int 40000 (line 203))
    (JNukeRByteCode 401 "l201 = Get" r0)
    (JNukeRByteCode 402 "r0 = Const" int 40401 (line 204))
    (JNukeRByteCode 403 "l202 = Get" r0)
    (JNukeRByteCode 404 "r0 = Const" int 40804 (line 205))
    (JNukeRByteCode 405 "l203 = Get" r0)
    (JNukeRByteCode 406 "r0 = Const" int 41209 (line 206))
    (JNukeRByteCode 407 "l204 = Get" r0)
    (JNukeRByteCode 408 "r0 = Const" int 41616 (line 207))
    (JNukeRByteCode 409 "l205 = Get" r0)
    (JNukeRByteCode 410 "r0 = Const" int 42025 (line 208))
    (JNukeRByteCode 411 "l206 = Get" r0)
    (JNukeRByteCode 412 "r0 = Const" int 42436 (line 209))
    (JNukeRByteCode 413 "l207 = Get" r0)
    (JNukeRByteCode 414 "r0 = Const" int 42849 (line 210))
    (JNukeRByteCode 415 "l208 = Get" r0)
    (JNukeRByteCode 416 "r0 = Const" int 43264 (line 211))
    (JNukeRByteCode 417 "l209 = Get" r0)
    (JNukeRByteCode 418 "r0 = Const" int 43681 (line 212))
    (JNukeRByteCode 419 "l210 = Get" r0)
    (JNukeRByteCode 420 "r0 = Const" int 44100 (line 213))
    (JNukeRByteCode 421 "l211 = Get" r0)
    (JNukeRByteCode 422 "r0 = Const" int 44521 (line 214))
    (JNukeRByteCode 423 "l212 = Get" r0)
    (JNukeRByteCode 424 "r0 = Const" int 44944 (line 215))
    (JNukeRByteCode 425 "l213 = Get" r0)
    (JNukeRByteCode 426 "r0 = Const" int 45369 (line 216))
    (JNukeRByteCode 427 "l214 = Get" r0)
    (JNukeRByteCode 428 "r0 = Const" int 45796 (line 217))
    (JNukeRByteCode 429 "l215 = Get" r0)
    (JNukeRByteCode 430 "r0 = Const" int 46225 (line 218))
    (JNukeRByteCode 431 "l216 = Get" r0)
    (JNukeRByteCode 432 "r0 = Const" int 46656 (line 219))
    (JNukeRByteCode 433 "l217 = Get" r0)
    (JNukeRByteCode 434 "r0 = Const" int 47089 (line 220))
    (JNukeRByteCode 435 "l218 = Get" r0)
    (JNukeRByteCode 436 "r0 = Const" int 47524 (line 221))
    (JNukeRByteCode 437 "l219 = Get" r0)
    (JNukeRByteCode 438 "r0 = Const" int 47961 (line 222))
    (JNukeRByteCode 439 "l220 = Get" r0)
    (JNukeRByteCode 440 "r0 = Const" int 48400 (line 223))
    (JNukeRByteCode 441 "l221 = Get" r0)
    (JNukeRByteCode 442 "r0 = Const" int 48841 (line 224))
    (JNukeRByteCode 443 "l222 = Get" r0)
    (JNukeRByteCode 444 "r0 = Const" int 49284 (line 225))
    (JNukeRByteCode 445 "l223 = Get" r0)
    (JNukeRByteCode 446 "r0 = Const" int 49729 (line 226))
    (JNukeRByteCode 447 "l224 = Get" r0)
    (JNukeRByteCode 448 "r0 = Const" int 50176 (line 227))
    (JNukeRByteCode 449 "l225 = Get" r0)
    (JNukeRByteCode 450 "r0 = Const" int 50625 (line 228))
    (JNukeRByteCode 451 "l226 = Get" r0)
    (JNukeRByteCode 452 "r0 = Const" int 51076 (line 229))
    (JNukeRByteCode 453 "l227 = Get" r0)
    (JNukeRByteCode 454 "r0 = Const" int 51529 (line 230))
    (JNukeRByteCode 455 "l228 = Get" r0)
    (JNukeRByteCode 456 "r0 = Const" int 51984 (line 231))
    (JNukeRByteCode 457 "l229 = Get" r0)
    (JNukeRByteCode 458 "r0 = Const" int 52441 (line 232))
    (JNukeRByteCode 459 "l230 = Get" r0)
    (JNukeRByteCode 460 "r0 = Const" int 52900 (line 233))
    (JNukeRByteCode 461 "l231 = Get" r0)
    (JNukeRByteCode 462 "r0 = Const" int 53361 (line 234))
    (JNukeRByteCode 463 "l232 = Get" r0)
    (JNukeRByteCode 464 "r0 = Const" int 53824 (line 235))
    (JNukeRByteCode 465 "l233 = Get" r0)
    (JNukeRByteCode 466 "r0 = Const" int 54289 (line 236))
    (JNukeRByteCode 467 "l234 = Get" r0)
    (JNukeRByteCode 468 "r0 = Const" int 54756 (line 237))
    (JNukeRByteCode 469 "l235 = Get" r0)
    (JNukeRByteCode 470 "r0 = Const" int 55225 (line 238))
    (JNukeRByteCode 471 "l236 = Get" r0)
    (JNukeRByteCode 472 "r0 = Const" int 55696 (line 239))
    (JNukeRByteCode 473 "l237 = Get" r0)
    (JNukeRByteCode 474 "r0 = Const" int 56169 (line 240))
    (JNukeRByteCode 475 "l238 = Get" r0)
    (JNukeRByteCode 476 "r0 = Const" int 56644 (line 241))
    (JNukeRByteCode 477 "l239 = Get" r0)
    (JNukeRByteCode 478 "r0 = Const" int 57121 (line 242))
    (JNukeRByteCode 479 "l240 = Get" r0)
    (JNukeRByteCode 480 "r0 = Const" int 57600 (line 243))
    (JNukeRByteCode 481 "l241 = Get" r0)
    (JNukeRByteCode 482 "r0 = Const" int 58081 (line 244))
    (JNukeRByteCode 483 "l242 = Get" r0)
    (JNukeRByteCode 484 "r0 = Const" int 58564 (line 245))
    (JNukeRByteCode 485 "l243 = Get" r0)
    (JNukeRByteCode 486 "r0 = Const" int 59049 (line 246))
    (JNukeRByteCode 487 "l244 = Get" r0)
    (JNukeRByteCode 488 "r0 = Const" int 59536 (line 247))
    (JNukeRByteCode 489 "l245 = Get" r0)
    (JNukeRByteCode 490 "r0 = Const" int 60025 (line 248))
    (JNukeRByteCode 491 "l246 = Get" r0)
    (JNukeRByteCode 492 "r0 = Const" int 60516 (line 249))
    (JNukeRByteCode 493 "l247 = Get" r0)
    (JNukeRByteCode 494 "r0 = Const" int 61009 (line 250))
    (JNukeRByteCode 495 "l248 = Get" r0)
    (JNukeRByteCode 496 "r0 = Const" int 61504 (line 251))
    (JNukeRByteCode 497 "l249 = Get" r0)
    (JNukeRByteCode 498 "r0 = Const" int 62001 (line 252))
    (JNukeRByteCode 499 "l250 = Get" r0)
    (JNukeRByteCode 500 "r0 = Const" int 62500 (line 253))
    (JNukeRByteCode 501 "l251 = Get" r0)
    (JNukeRByteCode 502 "r0 = Const" int 63001 (line 254))
    (JNukeRByteCode 503 "l252 = Get" r0)
    (JNukeRByteCode 504 "r0 = Const" int 63504 (line 255))
    (JNukeRByteCode 505 "l253 = Get" r0)
    (JNukeRByteCode 506 "r0 = Const" int 64009 (line 256))
    (JNukeRByteCode 507 "l254 = Get" r0)
    (JNukeRByteCode 508 "r0 = Const" int 64516 (line 257))
    (JNukeRByteCode 509 "l255 = Get" r0)
    (JNukeRByteCode 510 "r0 = Const" int 65025 (line 258))
    (JNukeRByteCode 511 "l256 = Get" r0)
    (JNukeRByteCode 512 "r0 = Const" int 65536 (line 259))
    (JNukeRByteCode 513 "l257 = Get" r0)
    (JNukeRByteCode 514 "r0 = Const" int 66049 (line 260))
    (JNukeRByteCode 515 "l258 = Get" r0)
    (JNukeRByteCode 516 "r0 = Const" int 66564 (line 261))
    (JNukeRByteCode 517 "l259 = Get" r0)
    (JNukeRByteCode 518 "r0 = Const" int 67081 (line 262))
    (JNukeRByteCode 519 "l260 = Get" r0)
    (JNukeRByteCode 520 "<r0, r1> = Const" double -42 (line 263))
    (JNukeRByteCode 521 "<l261, l262> = Get" r0 r1)
    (JNukeRByteCode 522 "r0 = Const" float 42 (line 264))
    (JNukeRByteCode 523 "l263 = Get" r0)
    (JNukeRByteCode 524 "<r0, r1> = Const" long 3111696 (line 265))
    (JNukeRByteCode 525 "<l264, l265> = Get" r0 r1)
    (JNukeRByteCode 526 "r0 = Const" ref 0x0 (line 266))
    (JNukeRByteCode 527 "l266 = Get" r0)
    (JNukeRByteCode 528 "r0 = GetStatic" "java/lang/System" (pair "out" "Ljava/io/PrintStream;") (line 267))
    (JNukeRByteCode 529 "r1 = Get" l260)
    (JNukeRByteCode 530 "     InvokeVirtual" (JNukeMethod "java/io/PrintStream.println" (JNukeSignature "V" (JNukeVector "I"))) r0 r1)
    (JNukeRByteCode 531 "r0 = GetStatic" "java/lang/System" (pair "out" "Ljava/io/PrintStream;") (line 268))
    (JNukeRByteCode 532 "<r1, r2> = Get" l261 l262)
    (JNukeRByteCode 533 "     InvokeVirtual" (JNukeMethod "java/io/PrintStream.println" (JNukeSignature "V" (JNukeVector "D"))) r0 r1 r2)
    (JNukeRByteCode 534 "r0 = GetStatic" "java/lang/System" (pair "out" "Ljava/io/PrintStream;") (line 269))
    (JNukeRByteCode 535 "r1 = Get" l263)
    (JNukeRByteCode 536 "     InvokeVirtual" (JNukeMethod "java/io/PrintStream.println" (JNukeSignature "V" (JNukeVector "F"))) r0 r1)
    (JNukeRByteCode 537 "r0 = GetStatic" "java/lang/System" (pair "out" "Ljava/io/PrintStream;") (line 270))
    (JNukeRByteCode 538 "<r1, r2> = Get" l264 l265)
    (JNukeRByteCode 539 "     InvokeVirtual" (JNukeMethod "java/io/PrintStream.println" (JNukeSignature "V" (JNukeVector "J"))) r0 r1 r2)
    (JNukeRByteCode 540 "r0 = GetStatic" "java/lang/System" (pair "out" "Ljava/io/PrintStream;") (line 271))
    (JNukeRByteCode 541 "r1 = Get" l266)
    (JNukeRByteCode 542 "     InvokeVirtual" (JNukeMethod "java/io/PrintStream.println" (JNukeSignature "V" (JNukeVector "Ljava/lang/Object;"))) r0 r1)
    (JNukeRByteCode 543 "     Return" void (line 272))
))
)
)
