%!PS-Adobe-2.0 EPSF-2.0
%%BoundingBox: 2 1 416 11
%%EndComments
/F {findfont 10 scalefont setfont} bind def
/B {/Courier-Bold F moveto show} bind def
/C {/Courier F moveto show} bind def
/f {findfont 8 scalefont setfont} bind def
/b {/Courier-Bold f moveto show} bind def
/c {/Courier f moveto show} bind def
%%Page: 1 1
(h) 2 2 C
(t) 8 2 C
(t) 14 2 C
(p) 20 2 C
(:) 26 2 C
(/) 32 2 C
(/) 38 2 C
(j) 44 2 C
(a) 50 2 C
(v) 56 2 C
(a) 62 2 C
(.) 68 2 C
(s) 74 2 C
(u) 80 2 C
(n) 86 2 C
(.) 92 2 C
(c) 98 2 C
(o) 104 2 C
(m) 110 2 C
(/) 116 2 C
(d) 122 2 C
(e) 128 2 C
(v) 134 2 C
(e) 140 2 C
(l) 146 2 C
(o) 152 2 C
(p) 158 2 C
(e) 164 2 C
(r) 170 2 C
(/) 176 2 C
(t) 182 2 C
(e) 188 2 C
(c) 194 2 C
(h) 200 2 C
(n) 206 2 C
(i) 212 2 C
(c) 218 2 C
(a) 224 2 C
(l) 230 2 C
(A) 236 2 C
(r) 242 2 C
(t) 248 2 C
(i) 254 2 C
(c) 260 2 C
(l) 266 2 C
(e) 272 2 C
(s) 278 2 C
(/) 284 2 C
(N) 290 2 C
(e) 296 2 C
(t) 302 2 C
(w) 308 2 C
(o) 314 2 C
(r) 320 2 C
(k) 326 2 C
(i) 332 2 C
(n) 338 2 C
(g) 344 2 C
(/) 350 2 C
(W) 356 2 C
(e) 362 2 C
(b) 368 2 C
(s) 374 2 C
(e) 380 2 C
(r) 386 2 C
(v) 392 2 C
(e) 398 2 C
(r) 404 2 C
(/) 410 2 C
