(classPool
(JNukeClass "TCFNested" "TCFNested.java"
  (JNukeMethod "TCFNested.<init>" (JNukeSignature "V" (JNukeVector))
  (JNukeByteCodes
    (JNukeAByteCode 0 "Load" ref 0x0 (line 1))
    (JNukeAByteCode 1 "InvokeSpecial" (JNukeMethod "java/lang/Object.<init>" (JNukeSignature "V" (JNukeVector))))
    (JNukeAByteCode 2 "Return" void)
))
  (JNukeMethod "TCFNested.m" (JNukeSignature "V" (JNukeVector "Z"))
  (JNukeEHandlers
    (JNukeEHandlerDesc (JNukeMethod "TCFNested.m" (JNukeSignature "V" (JNukeVector "Z"))) "java/lang/Exception" 0 1 42)
    (JNukeEHandlerDesc (JNukeMethod "TCFNested.m" (JNukeSignature "V" (JNukeVector "Z"))) "java/lang/Exception" 21 21 42)
    (JNukeEHandlerDesc (JNukeMethod "TCFNested.m" (JNukeSignature "V" (JNukeVector "Z"))) "<Any exception>" 0 1 65)
    (JNukeEHandlerDesc (JNukeMethod "TCFNested.m" (JNukeSignature "V" (JNukeVector "Z"))) "<Any exception>" 21 21 65)
    (JNukeEHandlerDesc (JNukeMethod "TCFNested.m" (JNukeSignature "V" (JNukeVector "Z"))) "<Any exception>" 41 44 65)
    (JNukeEHandlerDesc (JNukeMethod "TCFNested.m" (JNukeSignature "V" (JNukeVector "Z"))) "<Any exception>" 64 64 65)
    (JNukeEHandlerDesc (JNukeMethod "TCFNested.m" (JNukeSignature "V" (JNukeVector "Z"))) "java/lang/Exception" 2 3 10)
    (JNukeEHandlerDesc (JNukeMethod "TCFNested.m" (JNukeSignature "V" (JNukeVector "Z"))) "java/lang/Exception" 6 6 10)
    (JNukeEHandlerDesc (JNukeMethod "TCFNested.m" (JNukeSignature "V" (JNukeVector "Z"))) "java/lang/Exception" 22 23 30)
    (JNukeEHandlerDesc (JNukeMethod "TCFNested.m" (JNukeSignature "V" (JNukeVector "Z"))) "java/lang/Exception" 26 26 30)
    (JNukeEHandlerDesc (JNukeMethod "TCFNested.m" (JNukeSignature "V" (JNukeVector "Z"))) "java/lang/Exception" 45 46 53)
    (JNukeEHandlerDesc (JNukeMethod "TCFNested.m" (JNukeSignature "V" (JNukeVector "Z"))) "java/lang/Exception" 49 49 53)
    (JNukeEHandlerDesc (JNukeMethod "TCFNested.m" (JNukeSignature "V" (JNukeVector "Z"))) "java/lang/Exception" 66 67 74)
    (JNukeEHandlerDesc (JNukeMethod "TCFNested.m" (JNukeSignature "V" (JNukeVector "Z"))) "java/lang/Exception" 70 70 74)
    (JNukeEHandlerDesc (JNukeMethod "TCFNested.m" (JNukeSignature "V" (JNukeVector "Z"))) "<Any exception>" 2 3 16)
    (JNukeEHandlerDesc (JNukeMethod "TCFNested.m" (JNukeSignature "V" (JNukeVector "Z"))) "<Any exception>" 6 6 16)
    (JNukeEHandlerDesc (JNukeMethod "TCFNested.m" (JNukeSignature "V" (JNukeVector "Z"))) "<Any exception>" 9 12 16)
    (JNukeEHandlerDesc (JNukeMethod "TCFNested.m" (JNukeSignature "V" (JNukeVector "Z"))) "<Any exception>" 15 15 16)
    (JNukeEHandlerDesc (JNukeMethod "TCFNested.m" (JNukeSignature "V" (JNukeVector "Z"))) "<Any exception>" 22 23 36)
    (JNukeEHandlerDesc (JNukeMethod "TCFNested.m" (JNukeSignature "V" (JNukeVector "Z"))) "<Any exception>" 26 26 36)
    (JNukeEHandlerDesc (JNukeMethod "TCFNested.m" (JNukeSignature "V" (JNukeVector "Z"))) "<Any exception>" 29 32 36)
    (JNukeEHandlerDesc (JNukeMethod "TCFNested.m" (JNukeSignature "V" (JNukeVector "Z"))) "<Any exception>" 35 35 36)
    (JNukeEHandlerDesc (JNukeMethod "TCFNested.m" (JNukeSignature "V" (JNukeVector "Z"))) "<Any exception>" 45 46 59)
    (JNukeEHandlerDesc (JNukeMethod "TCFNested.m" (JNukeSignature "V" (JNukeVector "Z"))) "<Any exception>" 49 49 59)
    (JNukeEHandlerDesc (JNukeMethod "TCFNested.m" (JNukeSignature "V" (JNukeVector "Z"))) "<Any exception>" 52 55 59)
    (JNukeEHandlerDesc (JNukeMethod "TCFNested.m" (JNukeSignature "V" (JNukeVector "Z"))) "<Any exception>" 58 58 59)
    (JNukeEHandlerDesc (JNukeMethod "TCFNested.m" (JNukeSignature "V" (JNukeVector "Z"))) "<Any exception>" 66 67 80)
    (JNukeEHandlerDesc (JNukeMethod "TCFNested.m" (JNukeSignature "V" (JNukeVector "Z"))) "<Any exception>" 70 70 80)
    (JNukeEHandlerDesc (JNukeMethod "TCFNested.m" (JNukeSignature "V" (JNukeVector "Z"))) "<Any exception>" 73 76 80)
    (JNukeEHandlerDesc (JNukeMethod "TCFNested.m" (JNukeSignature "V" (JNukeVector "Z"))) "<Any exception>" 79 79 80)
  )
  (JNukeByteCodes
    (JNukeAByteCode 0 "Load" int 0x1 (line 4))
    (JNukeAByteCode 1 "Cond" ifeq 22)
      (JNukeAByteCode 2 "Load" int 0x1 (line 9))
      (JNukeAByteCode 3 "Cond" ifeq 7)
        (JNukeAByteCode 4 "Const" int 0 (line 13))
        (JNukeAByteCode 5 "Store" int 0x1)
      (JNukeAByteCode 6 "Return" void (line 9))
        (JNukeAByteCode 7 "Const" int 0 (line 13))
        (JNukeAByteCode 8 "Store" int 0x1)
      (JNukeAByteCode 9 "Goto" 21 (line 9))
      (JNukeAByteCode 10 "Store" ref 0x5 (line 11))
      (JNukeAByteCode 11 "Const" int 1)
      (JNukeAByteCode 12 "Store" int 0x1)
        (JNukeAByteCode 13 "Const" int 0 (line 13))
        (JNukeAByteCode 14 "Store" int 0x1)
      (JNukeAByteCode 15 "Goto" 21 (line 11))
      (JNukeAByteCode 16 "Store" ref 0x6 (line 13))
        (JNukeAByteCode 17 "Const" int 0)
        (JNukeAByteCode 18 "Store" int 0x1)
      (JNukeAByteCode 19 "Load" ref 0x6)
      (JNukeAByteCode 20 "Athrow")
    (JNukeAByteCode 21 "Return" void (line 4))
      (JNukeAByteCode 22 "Load" int 0x1 (line 9))
      (JNukeAByteCode 23 "Cond" ifeq 27)
        (JNukeAByteCode 24 "Const" int 0 (line 13))
        (JNukeAByteCode 25 "Store" int 0x1)
      (JNukeAByteCode 26 "Return" void (line 9))
        (JNukeAByteCode 27 "Const" int 0 (line 13))
        (JNukeAByteCode 28 "Store" int 0x1)
      (JNukeAByteCode 29 "Goto" 41 (line 9))
      (JNukeAByteCode 30 "Store" ref 0x5 (line 11))
      (JNukeAByteCode 31 "Const" int 1)
      (JNukeAByteCode 32 "Store" int 0x1)
        (JNukeAByteCode 33 "Const" int 0 (line 13))
        (JNukeAByteCode 34 "Store" int 0x1)
      (JNukeAByteCode 35 "Goto" 41 (line 11))
      (JNukeAByteCode 36 "Store" ref 0x6 (line 13))
        (JNukeAByteCode 37 "Const" int 0)
        (JNukeAByteCode 38 "Store" int 0x1)
      (JNukeAByteCode 39 "Load" ref 0x6)
      (JNukeAByteCode 40 "Athrow")
    (JNukeAByteCode 41 "Goto" 87 (line 4))
    (JNukeAByteCode 42 "Store" ref 0x2 (line 6))
    (JNukeAByteCode 43 "Const" int 1)
    (JNukeAByteCode 44 "Store" int 0x1)
      (JNukeAByteCode 45 "Load" int 0x1 (line 9))
      (JNukeAByteCode 46 "Cond" ifeq 50)
        (JNukeAByteCode 47 "Const" int 0 (line 13))
        (JNukeAByteCode 48 "Store" int 0x1)
      (JNukeAByteCode 49 "Return" void (line 9))
        (JNukeAByteCode 50 "Const" int 0 (line 13))
        (JNukeAByteCode 51 "Store" int 0x1)
      (JNukeAByteCode 52 "Goto" 64 (line 9))
      (JNukeAByteCode 53 "Store" ref 0x5 (line 11))
      (JNukeAByteCode 54 "Const" int 1)
      (JNukeAByteCode 55 "Store" int 0x1)
        (JNukeAByteCode 56 "Const" int 0 (line 13))
        (JNukeAByteCode 57 "Store" int 0x1)
      (JNukeAByteCode 58 "Goto" 64 (line 11))
      (JNukeAByteCode 59 "Store" ref 0x6 (line 13))
        (JNukeAByteCode 60 "Const" int 0)
        (JNukeAByteCode 61 "Store" int 0x1)
      (JNukeAByteCode 62 "Load" ref 0x6)
      (JNukeAByteCode 63 "Athrow")
    (JNukeAByteCode 64 "Goto" 87 (line 6))
    (JNukeAByteCode 65 "Store" ref 0x3 (line 8))
      (JNukeAByteCode 66 "Load" int 0x1 (line 9))
      (JNukeAByteCode 67 "Cond" ifeq 71)
        (JNukeAByteCode 68 "Const" int 0 (line 13))
        (JNukeAByteCode 69 "Store" int 0x1)
      (JNukeAByteCode 70 "Return" void (line 9))
        (JNukeAByteCode 71 "Const" int 0 (line 13))
        (JNukeAByteCode 72 "Store" int 0x1)
      (JNukeAByteCode 73 "Goto" 85 (line 9))
      (JNukeAByteCode 74 "Store" ref 0x5 (line 11))
      (JNukeAByteCode 75 "Const" int 1)
      (JNukeAByteCode 76 "Store" int 0x1)
        (JNukeAByteCode 77 "Const" int 0 (line 13))
        (JNukeAByteCode 78 "Store" int 0x1)
      (JNukeAByteCode 79 "Goto" 85 (line 11))
      (JNukeAByteCode 80 "Store" ref 0x6 (line 13))
        (JNukeAByteCode 81 "Const" int 0)
        (JNukeAByteCode 82 "Store" int 0x1)
      (JNukeAByteCode 83 "Load" ref 0x6)
      (JNukeAByteCode 84 "Athrow")
    (JNukeAByteCode 85 "Load" ref 0x3 (line 8))
    (JNukeAByteCode 86 "Athrow")
    (JNukeAByteCode 87 "Return" void (line 16))
))
)
)
