(classPool
(JNukeClass "Test9Main" "Test9Main.java"
  (JNukeMethod "Test9Main.<init>" (JNukeSignature "V" (JNukeVector))
  (JNukeByteCodes
    (JNukeRByteCode 0 "r0 = Get" l0 (line 4))
    (JNukeRByteCode 1 "     InvokeSpecial" (JNukeMethod "java/lang/Object.<init>" (JNukeSignature "V" (JNukeVector))) r0)
    (JNukeRByteCode 2 "     Return" void)
))
  (JNukeMethod "Test9Main.a" (JNukeSignature "V" (JNukeVector))
  (JNukeByteCodes
    (JNukeRByteCode 0 "r0 = GetStatic" "java/lang/System" (pair "out" "Ljava/io/PrintStream;") (line 6))
    (JNukeRByteCode 1 "     InvokeVirtual" (JNukeMethod "java/io/PrintStream.println" (JNukeSignature "V" (JNukeVector))) r0)
    (JNukeRByteCode 2 "     Return" void (line 7))
))
  (JNukeMethod "Test9Main.main" (JNukeSignature "V" (JNukeVector "[Ljava/lang/String;"))
  (JNukeByteCodes
    (JNukeRByteCode 0 "r0 = GetStatic" "java/lang/System" (pair "out" "Ljava/io/PrintStream;") (line 10))
    (JNukeRByteCode 1 "r1 = Const" string "Hello, world!")
    (JNukeRByteCode 2 "     InvokeVirtual" (JNukeMethod "java/io/PrintStream.println" (JNukeSignature "V" (JNukeVector "Ljava/lang/String;"))) r0 r1)
    (JNukeRByteCode 3 "r0 = New" "Test9Main" (line 11))
    (JNukeRByteCode 4 "r1 = Get" r0)
    (JNukeRByteCode 5 "     InvokeSpecial" (JNukeMethod "Test9Main.<init>" (JNukeSignature "V" (JNukeVector))) r1)
    (JNukeRByteCode 6 "     InvokeVirtual" (JNukeMethod "Test9Main.a" (JNukeSignature "V" (JNukeVector))) r0)
    (JNukeRByteCode 7 "r0 = GetStatic" "java/lang/System" (pair "out" "Ljava/io/PrintStream;") (line 12))
    (JNukeRByteCode 8 "r1 = Const" string "Goodbye, cruel world.")
    (JNukeRByteCode 9 "     InvokeVirtual" (JNukeMethod "java/io/PrintStream.println" (JNukeSignature "V" (JNukeVector "Ljava/lang/String;"))) r0 r1)
    (JNukeRByteCode 10 "     Return" void (line 13))
))
)
)
