#FIG 3.2
Landscape
Center
Inches
Letter  
100.00
Single
-2
1200 2
2 1 0 2 1 7 50 0 -1 0.000 0 0 -1 1 0 2
	0 0 1.00 60.00 120.00
	 1200 1050 1200 1350
2 1 0 2 1 7 50 0 -1 0.000 0 0 -1 1 0 2
	0 0 1.00 60.00 120.00
	 1800 1500 2400 1500
2 1 0 2 1 7 50 0 -1 0.000 0 0 -1 1 0 2
	0 0 1.00 60.00 120.00
	 2925 1650 2925 1950
2 1 0 2 18 7 50 0 -1 0.000 0 0 -1 1 0 2
	0 0 1.00 60.00 120.00
	 3150 2025 3825 2025
2 1 2 1 0 7 50 0 -1 3.000 0 0 -1 0 0 2
	 3525 1050 3525 2400
4 0 0 50 0 0 12 0.0000 4 180 870 900 1575 replay.sync\001
4 0 0 50 0 0 12 0.0000 4 135 735 2550 1575 t .unblock\001
4 0 0 50 0 0 12 0.0000 4 135 555 2550 2100 t .block\001
#  
4 0 0 50 0 0 10 0.0000 4 105 105 2550 1650  2\001
4 0 0 50 0 2 12 0.0000 4 135 705 900 825 Thread t\001
4 0 0 50 0 0 10 0.0000 4 105 105 2550 2175  1\001
4 0 0 50 0 2 10 0.0000 4 105 75 1575 900 1\001
4 0 0 50 0 2 12 0.0000 4 180 750 2550 825 Replayer\001
4 0 0 50 0 0 12 0.0000 4 15 135 3975 2100 ...\001
4 0 0 50 0 2 12 0.0000 4 135 705 3900 825 Thread t\001
4 0 0 50 0 2 10 0.0000 4 105 75 4575 900 2\001
