#FIG 3.2
Landscape
Center
Inches
Letter  
100.00
Single
-2
1200 2
0 32 #6d6d6d
0 33 #c0c0c0
5 1 0 3 4 0 50 -1 -1 0.000 0 1 1 0 4612.500 4293.750 2325 6750 4575 7650 6900 6750
	1 1 3.00 270.00 360.00
6 1275 2625 3750 3225
4 0 0 45 -1 18 20 0.0000 4 210 2430 1275 2850 Which non-atomic\001
4 0 0 45 -1 18 20 0.0000 4 210 2340 1275 3195 actions are safe?\001
-6
6 4200 2025 6000 3900
1 1 0 3 0 7 50 -1 -1 0.000 1 0.5236 5006 2988 900 300 5006 2988 5935 2798
1 3 0 3 0 0 50 -1 20 0.000 1 0.5236 5006 2988 168 168 5006 2988 5146 3080
1 1 0 3 0 7 50 -1 -1 0.000 1 4.7124 5006 2988 900 300 5006 2988 4705 3888
1 1 0 3 0 7 50 -1 -1 0.000 1 2.6180 5006 2988 900 300 5006 2988 4377 2278
1 3 0 3 0 0 50 -1 20 0.000 1 0.0000 5550 2475 75 75 5550 2475 5550 2550
1 3 0 3 0 0 50 -1 20 0.000 1 0.0000 4575 3075 75 75 4575 3075 4575 3150
1 3 0 3 0 0 50 -1 20 0.000 1 0.0000 5175 3750 75 75 5175 3750 5175 3825
-6
6 1425 4275 3675 6525
6 2175 5400 2775 6000
1 3 0 2 0 33 40 -1 20 0.000 1 0.0000 2475 5700 237 237 2475 5700 2700 5775
1 3 0 2 0 33 30 -1 20 0.000 1 0.0000 2475 5700 106 106 2475 5700 2581 5700
2 1 0 1 0 -1 25 -1 20 0.000 0 0 -1 0 0 3
	 2440 5693 2472 5610 2508 5693
2 1 0 2 0 -1 30 -1 20 0.000 0 0 -1 0 0 2
	 2475 5550 2475 5475
2 1 0 2 0 -1 30 -1 20 0.000 0 0 -1 0 0 2
	 2325 5700 2250 5700
2 1 0 2 0 -1 30 -1 20 0.000 0 0 -1 0 0 2
	 2475 5850 2475 5925
2 1 0 2 0 -1 30 -1 20 0.000 0 0 -1 0 0 2
	 2625 5700 2700 5700
-6
2 4 0 2 0 32 30 -1 -1 0.000 0 0 7 0 0 5
	 2850 6300 2850 5100 1650 5100 1650 6300 2850 6300
2 2 0 3 0 32 50 0 20 0.000 0 0 -1 0 0 5
	 1500 4950 3000 4950 3000 6450 1500 6450 1500 4950
2 1 0 3 0 32 50 0 20 0.000 0 0 -1 0 0 5
	 1500 4950 2250 4350 3600 4350 3000 4950 1500 4950
2 1 0 3 0 32 50 0 20 0.000 0 0 -1 0 0 5
	 3000 4950 3000 6450 3600 5700 3600 4350 3000 4950
-6
6 6075 4275 8325 6525
6 6825 5400 7425 6000
1 3 0 2 0 33 40 -1 20 0.000 1 0.0000 7125 5700 237 237 7125 5700 7350 5775
1 3 0 2 0 33 30 -1 20 0.000 1 0.0000 7125 5700 106 106 7125 5700 7231 5700
2 1 0 1 0 -1 25 -1 20 0.000 0 0 -1 0 0 3
	 7090 5693 7122 5610 7158 5693
2 1 0 2 0 -1 30 -1 20 0.000 0 0 -1 0 0 2
	 7125 5550 7125 5475
2 1 0 2 0 -1 30 -1 20 0.000 0 0 -1 0 0 2
	 6975 5700 6900 5700
2 1 0 2 0 -1 30 -1 20 0.000 0 0 -1 0 0 2
	 7125 5850 7125 5925
2 1 0 2 0 -1 30 -1 20 0.000 0 0 -1 0 0 2
	 7275 5700 7350 5700
-6
2 4 0 2 0 32 30 -1 -1 0.000 0 0 7 0 0 5
	 7500 6300 7500 5100 6300 5100 6300 6300 7500 6300
2 2 0 3 0 32 50 0 20 0.000 0 0 -1 0 0 5
	 6150 4950 7650 4950 7650 6450 6150 6450 6150 4950
2 1 0 3 0 32 50 0 20 0.000 0 0 -1 0 0 5
	 6150 4950 6900 4350 8250 4350 7650 4950 6150 4950
2 1 0 3 0 32 50 0 20 0.000 0 0 -1 0 0 5
	 7650 4950 7650 6450 8250 5700 8250 4350 7650 4950
-6
2 2 0 1 7 7 999 -1 -1 0.000 0 0 -1 0 0 5
	 1125 1800 7950 1800 7950 7500 1125 7500 1125 1800
2 1 0 8 4 7 45 -1 -1 0.000 0 0 -1 0 0 2
	 4050 3975 6075 2025
2 1 0 8 4 7 45 -1 -1 0.000 0 0 -1 0 0 2
	 4050 1950 6075 3975
4 0 4 50 -1 18 30 0.0000 4 345 270 4500 7425 ?\001
