#FIG 3.2
Landscape
Center
Metric
A4      
100.00
Single
-2
1200 2
6 4905 5580 6795 7470
1 4 0 3 0 7 50 0 -1 0.000 1 0.0000 5851 6521 900 900 4951 6521 6751 6521
2 1 0 5 0 7 50 0 -1 0.000 0 0 -1 0 0 2
	 5850 6525 5850 5985
2 1 0 1 4 4 100 0 20 0.000 0 0 -1 0 0 5
	 5400 5760 5850 6525 5850 5625 5625 5670 5400 5760
2 1 0 3 0 4 50 0 20 0.000 0 0 -1 0 0 2
	 5850 6525 5490 5895
2 1 0 3 0 4 50 0 20 0.000 0 0 -1 0 0 2
	 5850 5670 5850 5850
2 1 0 3 0 4 50 0 20 0.000 0 0 -1 0 0 2
	 6525 6525 6660 6525
2 1 0 3 0 4 50 0 20 0.000 0 0 -1 0 0 4
	 5850 7200 5850 7245 5850 7290 5850 7335
2 1 0 3 0 4 50 0 20 0.000 0 0 -1 0 0 2
	 5040 6525 5175 6525
2 1 0 3 0 4 50 0 20 0.000 0 0 -1 0 0 2
	 6210 5940 6273 5814
2 1 0 3 0 4 50 0 20 0.000 0 0 -1 0 0 2
	 6413 6188 6525 6120
2 1 0 3 0 4 50 0 20 0.000 0 0 -1 0 0 2
	 5463 7209 5526 7083
2 1 0 3 0 4 50 0 20 0.000 0 0 -1 0 0 2
	 5206 6921 5318 6853
2 1 0 3 0 4 50 0 20 0.000 0 0 -1 0 0 2
	 5175 6120 5265 6165
2 1 0 3 0 4 50 0 20 0.000 0 0 -1 0 0 2
	 6444 6867 6534 6912
2 1 0 3 0 4 50 0 20 0.000 0 0 -1 0 0 2
	 6210 7200 6165 7110
2 1 0 3 0 4 50 0 20 0.000 0 0 -1 0 0 1
	 5445 5850
-6
