(classPool
(JNukeClass "Finally" "Finally.java"
  (JNukeMethod "Finally.<init>" (JNukeSignature "V" (JNukeVector))
  (JNukeByteCodes
    (JNukeAByteCode 0 "Load" ref 0x0 (line 1))
    (JNukeAByteCode 1 "InvokeSpecial" (JNukeMethod "java/lang/Object.<init>" (JNukeSignature "V" (JNukeVector))))
    (JNukeAByteCode 2 "Return" void)
))
  (JNukeMethod "Finally.m" (JNukeSignature "I" (JNukeVector "I"))
  (JNukeEHandlers
    (JNukeEHandlerDesc (JNukeMethod "Finally.m" (JNukeSignature "I" (JNukeVector "I"))) "<Any exception>" 0 0 3)
    (JNukeEHandlerDesc (JNukeMethod "Finally.m" (JNukeSignature "I" (JNukeVector "I"))) "<Any exception>" 2 2 3)
  )
  (JNukeByteCodes
    (JNukeAByteCode 0 "Inc" l1 0x1 (line 5))
      (JNukeAByteCode 1 "Inc" l1 0xffffffff (line 7))
    (JNukeAByteCode 2 "Goto" 7 (line 5))
    (JNukeAByteCode 3 "Store" ref 0x2 (line 7))
      (JNukeAByteCode 4 "Inc" l1 0xffffffff)
    (JNukeAByteCode 5 "Load" ref 0x2)
    (JNukeAByteCode 6 "Athrow")
    (JNukeAByteCode 7 "Load" int 0x1 (line 9))
    (JNukeAByteCode 8 "Return" int)
))
)
)
