#FIG 3.2
Landscape
Center
Metric
Letter  
100.00
Single
-2
1200 2
0 32 #9c0000
0 33 #8c8c8c
0 34 #8c8c8c
0 35 #424242
0 36 #8c8c8c
0 37 #424242
0 38 #8c8c8c
0 39 #424242
0 40 #8c8c8c
0 41 #424242
0 42 #8c8c8c
0 43 #424242
0 44 #ffa00a
0 45 #cdcdcd
6 3555 4050 5445 4680
4 1 0 50 0 16 20 0.0000 4 270 1875 4499 4274 Static Analysis\001
4 1 0 50 0 16 20 0.0000 4 270 1185 4499 4604 algorithm\001
-6
6 2880 540 6120 1260
2 2 0 2 0 7 150 0 -1 0.000 0 0 -1 0 0 5
	 2925 585 6075 585 6075 1215 2925 1215 2925 585
4 1 0 50 0 16 20 0.0000 4 270 1215 4500 990 Bytecode\001
-6
6 3420 2205 5580 2835
4 1 0 50 0 16 20 0.0000 4 210 1620 4487 2442 Control Flow\001
4 1 0 50 0 16 20 0.0000 4 270 2100 4487 2772 Iterator (generic)\001
-6
2 1 0 2 0 7 50 0 -1 0.000 0 0 -1 1 0 2
	1 1 2.00 120.00 240.00
	 4500 3150 4500 3825
2 1 0 2 0 7 50 0 -1 0.000 0 0 -1 1 0 2
	1 1 2.00 120.00 240.00
	 4500 1215 4500 1890
2 2 0 2 0 7 150 0 -1 0.000 0 0 -1 0 0 5
	 2928 3150 6075 3150 6075 1890 2928 1890 2928 3150
2 2 0 2 0 7 150 0 -1 0.000 0 0 -1 0 0 5
	 2928 3825 6075 3825 6075 4857 2928 4857 2928 3825
