%!PS-Adobe-2.0 EPSF-2.0
%%Title: exitblock-flow.dia
%%Creator: Dia v0.90
%%CreationDate: Tue Mar 11 08:26:28 2003
%%For: pascal
%%Magnification: 1.0000
%%Orientation: Portrait
%%BoundingBox: 0 0 1139 1629
%%Pages: 1
%%EndComments
%%BeginProlog
/cp {closepath} bind def
/c {curveto} bind def
/f {fill} bind def
/a {arc} bind def
/ef {eofill} bind def
/ex {exch} bind def
/gr {grestore} bind def
/gs {gsave} bind def
/sa {save} bind def
/rs {restore} bind def
/l {lineto} bind def
/m {moveto} bind def
/rm {rmoveto} bind def
/n {newpath} bind def
/s {stroke} bind def
/sh {show} bind def
/slc {setlinecap} bind def
/slj {setlinejoin} bind def
/slw {setlinewidth} bind def
/srgb {setrgbcolor} bind def
/rot {rotate} bind def
/sc {scale} bind def
/sd {setdash} bind def
/ff {findfont} bind def
/sf {setfont} bind def
/scf {scalefont} bind def
/sw {stringwidth pop} bind def
/tr {translate} bind def

/ellipsedict 8 dict def
ellipsedict /mtrx matrix put
/ellipse
{ ellipsedict begin
   /endangle exch def
   /startangle exch def
   /yrad exch def
   /xrad exch def
   /y exch def
   /x exch def   /savematrix mtrx currentmatrix def
   x y tr xrad yrad sc
   0 0 1 startangle endangle arc
   savematrix setmatrix
   end
} def

/mergeprocs {
dup length
3 -1 roll
dup
length
dup
5 1 roll
3 -1 roll
add
array cvx
dup
3 -1 roll
0 exch
putinterval
dup
4 2 roll
putinterval
} bind def
%%EndProlog

%%BeginSetup
%%EndSetup
28.346000 -28.346000 scale
-2.919630 -54.773000 translate

1.000000 1.000000 1.000000 srgb
n 6.985710 1.800000 m 6.985710 3.700000 l 16.049710 3.700000 l 16.049710 1.800000 l f
0.100000 slw
[] 0 sd
[] 0 sd
0 slj
0.000000 0.000000 0.000000 srgb
n 6.985710 1.800000 m 6.985710 3.700000 l 16.049710 3.700000 l 16.049710 1.800000 l cp s
 [ /xi /xi /xi /xi /xi /xi /xi /xi /xi /xi /xi /xi /xi /xi /xi /xi
 /xi /xi /xi /xi /xi /xi /xi /xi /xi /xi /xi /xi /xi /xi /xi /xi
 /F /e /t /c /h /space /b /y /xi /xi /o /d /E /x /u /l
 /k /i /a /n /r /colon /m /s /f /p /period /O /w /comma /q /j
 /slash /M /N /Y /xi /xi /xi /xi /xi /xi /xi /xi /xi /xi /xi /xi
 /xi /xi /xi /xi /xi /xi /xi /xi /xi /xi /xi /xi /xi /xi /xi /xi
 /xi /xi /xi /xi /xi /xi /xi /xi /xi /xi /xi /xi /xi /xi /xi /xi
 /xi /xi /xi /xi /xi /xi /xi /xi /xi /xi /xi /xi /xi /xi /xi /xi
 /xi /xi /xi /xi /xi /xi /xi /xi /xi /xi /xi /xi /xi /xi /xi /xi
 /xi /xi /xi /xi /xi /xi /xi /xi /xi /xi /xi /xi /xi /xi /xi /xi
 /xi /xi /xi /xi /xi /xi /xi /xi /xi /xi /xi /xi /xi /xi /xi /xi
 /xi /xi /xi /xi /xi /xi /xi /xi /xi /xi /xi /xi /xi /xi /xi /xi
 /xi /xi /xi /xi /xi /xi /xi /xi /xi /xi /xi /xi /xi /xi /xi /xi
 /xi /xi /xi /xi /xi /xi /xi /xi /xi /xi /xi /xi /xi /xi /xi /xi
 /xi /xi /xi /xi /xi /xi /xi /xi /xi /xi /xi /xi /xi /xi /xi /xi
 /xi /xi /xi /xi /xi /xi /xi /xi /xi /xi /xi /xi /xi /xi /xi /xi
] /e0 exch def
/Courier_e0 undefinefont
/Courier_e0
  /Courier findfont
  dup length dict begin
  {1 index /FID ne {def} {pop pop} ifelse} forall
  /Encoding e0 def
  currentdict end
definefont pop
/Courier_e0 ff 0.800000 scf sf
( !"#$%&'"!%#*+!) sw
2 div 11.517710 ex sub 2.946491 m ( !"#$%&'"!%#*+!)
 gs 1 -1 sc sh gr
1.000000 1.000000 1.000000 srgb
n 6.444510 11.162200 m 6.444510 13.062200 l 16.590910 13.062200 l 16.590910 11.162200 l f
0.100000 slw
[] 0 sd
[] 0 sd
0 slj
0.000000 0.000000 0.000000 srgb
n 6.444510 11.162200 m 6.444510 13.062200 l 16.590910 13.062200 l 16.590910 11.162200 l cp s
/Courier_e0 ff 0.800000 scf sf
(,-!#."!%&'"!%#*+!) sw
2 div 11.517710 ex sub 12.308691 m (,-!#."!%&'"!%#*+!)
 gs 1 -1 sc sh gr
1.000000 1.000000 1.000000 srgb
n 11.517710 15.059700 m 16.485420 16.855105 l 11.517710 18.650510 l 6.550000 16.855105 l f
0.100000 slw
[] 0 sd
[] 0 sd
0 slj
0.000000 0.000000 0.000000 srgb
n 11.517710 15.059700 m 16.485420 16.855105 l 11.517710 18.650510 l 6.550000 16.855105 l cp s
/Courier_e0 ff 0.800000 scf sf
(/*#0%!-1") sw
2 div 11.517710 ex sub 17.051596 m (/*#0%!-1")
 gs 1 -1 sc sh gr
1.000000 1.000000 1.000000 srgb
n 19.606900 15.505100 m 19.606900 18.205100 l 30.078900 18.205100 l 30.078900 15.505100 l f
0.100000 slw
[] 0 sd
[] 0 sd
0 slj
0.000000 0.000000 0.000000 srgb
n 19.606900 15.505100 m 19.606900 18.205100 l 30.078900 18.205100 l 30.078900 15.505100 l cp s
/Courier_e0 ff 0.800000 scf sf
(/*#0%!-1"%$23+/!45) sw
2 div 24.842900 ex sub 16.651591 m (/*#0%!-1"%$23+/!45)
 gs 1 -1 sc sh gr
(#4!2"!%61/!7"*3!) sw
2 div 24.842900 ex sub 17.451591 m (#4!2"!%61/!7"*3!)
 gs 1 -1 sc sh gr
1.000000 1.000000 1.000000 srgb
n 11.517730 20.648000 m 17.265830 22.645360 l 11.517730 24.642720 l 5.769630 22.645360 l f
0.100000 slw
[] 0 sd
[] 0 sd
0 slj
0.000000 0.000000 0.000000 srgb
n 11.517730 20.648000 m 17.265830 22.645360 l 11.517730 24.642720 l 5.769630 22.645360 l cp s
/Courier_e0 ff 0.800000 scf sf
("$4!2+%+1!+) sw
2 div 11.517730 ex sub 22.841851 m ("$4!2+%+1!+)
 gs 1 -1 sc sh gr
1.000000 1.000000 1.000000 srgb
n 19.606900 20.510000 m 19.606900 24.810000 l 35.728500 24.810000 l 35.728500 20.510000 l f
0.100000 slw
[] 0 sd
[] 0 sd
0 slj
0.000000 0.000000 0.000000 srgb
n 19.606900 20.510000 m 19.606900 24.810000 l 35.728500 24.810000 l 35.728500 20.510000 l cp s
/Courier_e0 ff 0.800000 scf sf
("$4!2+%"!46132"1*3%$23+/!45) sw
2 div 27.667700 ex sub 21.656491 m ("$4!2+%"!46132"1*3%$23+/!45)
 gs 1 -1 sc sh gr
(4!7#$!+./!%3!-"%"$4!2+%18%) sw
2 div 27.667700 ex sub 22.456491 m (4!7#$!+./!%3!-"%"$4!2+%18%)
 gs 1 -1 sc sh gr
(9*771&/!:%;"$!4<17!=%9!48*46) sw
2 div 27.667700 ex sub 23.256491 m (9*771&/!:%;"$!4<17!=%9!48*46)
 gs 1 -1 sc sh gr
(4*//&2#0:) sw
2 div 27.667700 ex sub 24.056491 m (4*//&2#0:)
 gs 1 -1 sc sh gr
1.000000 1.000000 1.000000 srgb
n 11.517690 26.640194 m 16.786653 28.943330 l 11.517690 31.246466 l 6.248727 28.943330 l f
0.100000 slw
[] 0 sd
[] 0 sd
0 slj
0.000000 0.000000 0.000000 srgb
n 11.517690 26.640194 m 16.786653 28.943330 l 11.517690 31.246466 l 6.248727 28.943330 l cp s
/Courier_e0 ff 0.800000 scf sf
(/*#0%) sw
2 div 11.517690 ex sub 28.739821 m (/*#0%)
 gs 1 -1 sc sh gr
(2#>.14!+) sw
2 div 11.517690 ex sub 29.539821 m (2#>.14!+)
 gs 1 -1 sc sh gr
1.000000 1.000000 1.000000 srgb
n 24.111345 27.330000 m 28.615790 28.924175 l 24.111345 30.518350 l 19.606900 28.924175 l f
0.100000 slw
[] 0 sd
[] 0 sd
0 slj
0.000000 0.000000 0.000000 srgb
n 24.111345 27.330000 m 28.615790 28.924175 l 24.111345 30.518350 l 19.606900 28.924175 l cp s
/Courier_e0 ff 0.800000 scf sf
(821/!+) sw
2 div 24.111345 ex sub 29.120666 m (821/!+)
 gs 1 -1 sc sh gr
1.000000 1.000000 1.000000 srgb
n 31.298800 27.210000 m 31.298800 30.710000 l 40.943600 30.710000 l 40.943600 27.210000 l f
0.100000 slw
[] 0 sd
[] 0 sd
0 slj
0.000000 0.000000 0.000000 srgb
n 31.298800 27.210000 m 31.298800 30.710000 l 40.943600 30.710000 l 40.943600 27.210000 l cp s
/Courier_e0 ff 0.800000 scf sf
(/*#0%2#>.14!6!3"%) sw
2 div 36.121200 ex sub 28.356491 m (/*#0%2#>.14!6!3"%)
 gs 1 -1 sc sh gr
(821/.4!%$23+/!45) sw
2 div 36.121200 ex sub 29.156491 m (821/.4!%$23+/!45)
 gs 1 -1 sc sh gr
(9!48*46%4*//&2#0) sw
2 div 36.121200 ex sub 29.956491 m (9!48*46%4*//&2#0)
 gs 1 -1 sc sh gr
1.000000 1.000000 1.000000 srgb
n 11.517710 33.294000 m 16.155660 35.379335 l 11.517710 37.464670 l 6.879760 35.379335 l f
0.100000 slw
[] 0 sd
[] 0 sd
0 slj
0.000000 0.000000 0.000000 srgb
n 11.517710 33.294000 m 16.155660 35.379335 l 11.517710 37.464670 l 6.879760 35.379335 l cp s
/Courier_e0 ff 0.800000 scf sf
("$4!2+) sw
2 div 11.517710 ex sub 35.175826 m ("$4!2+)
 gs 1 -1 sc sh gr
(7"24") sw
2 div 11.517710 ex sub 35.975826 m (7"24")
 gs 1 -1 sc sh gr
1.000000 1.000000 1.000000 srgb
n 19.606900 34.010000 m 19.606900 36.710000 l 31.689300 36.710000 l 31.689300 34.010000 l f
0.100000 slw
[] 0 sd
[] 0 sd
0 slj
0.000000 0.000000 0.000000 srgb
n 19.606900 34.010000 m 19.606900 36.710000 l 31.689300 36.710000 l 31.689300 34.010000 l cp s
/Courier_e0 ff 0.800000 scf sf
("$4!2+%7"24"%$23+/!45) sw
2 div 25.648100 ex sub 35.156491 m ("$4!2+%7"24"%$23+/!45)
 gs 1 -1 sc sh gr
(#4!2"!%61/!7"*3!) sw
2 div 25.648100 ex sub 35.956491 m (#4!2"!%61/!7"*3!)
 gs 1 -1 sc sh gr
1.000000 1.000000 1.000000 srgb
n 11.517710 39.067700 m 15.736020 41.039365 l 11.517710 43.011030 l 7.299400 41.039365 l f
0.100000 slw
[] 0 sd
[] 0 sd
0 slj
0.000000 0.000000 0.000000 srgb
n 11.517710 39.067700 m 15.736020 41.039365 l 11.517710 43.011030 l 7.299400 41.039365 l cp s
/Courier_e0 ff 0.800000 scf sf
(<21"=) sw
2 div 11.517710 ex sub 40.835856 m (<21"=)
 gs 1 -1 sc sh gr
(?*13) sw
2 div 11.517710 ex sub 41.635856 m (?*13)
 gs 1 -1 sc sh gr
1.000000 1.000000 1.000000 srgb
n 19.884100 38.910000 m 19.884100 43.210000 l 33.022500 43.210000 l 33.022500 38.910000 l f
0.100000 slw
[] 0 sd
[] 0 sd
0 slj
0.000000 0.000000 0.000000 srgb
n 19.884100 38.910000 m 19.884100 43.210000 l 33.022500 43.210000 l 33.022500 38.910000 l cp s
/Courier_e0 ff 0.800000 scf sf
(<21"@?*13%$23+/!45) sw
2 div 26.453300 ex sub 40.056491 m (<21"@?*13%$23+/!45)
 gs 1 -1 sc sh gr
(4!7#$!+./!%3!-"%"$4!2+%) sw
2 div 26.453300 ex sub 40.856491 m (4!7#$!+./!%3!-"%"$4!2+%)
 gs 1 -1 sc sh gr
(18%9*771&/!:%;"$!4<17!=) sw
2 div 26.453300 ex sub 41.656491 m (18%9*771&/!:%;"$!4<17!=)
 gs 1 -1 sc sh gr
(9!48*46%4*//&2#0:) sw
2 div 26.453300 ex sub 42.456491 m (9!48*46%4*//&2#0:)
 gs 1 -1 sc sh gr
1.000000 1.000000 1.000000 srgb
n 11.517710 46.257700 m 15.472801 47.876600 l 11.517710 49.495500 l 7.562619 47.876600 l f
0.100000 slw
[] 0 sd
[] 0 sd
0 slj
0.000000 0.000000 0.000000 srgb
n 11.517710 46.257700 m 15.472801 47.876600 l 11.517710 49.495500 l 7.562619 47.876600 l cp s
/Courier_e0 ff 0.800000 scf sf
(3*"18') sw
2 div 11.517710 ex sub 48.073091 m (3*"18')
 gs 1 -1 sc sh gr
1.000000 1.000000 1.000000 srgb
n 19.896100 45.710000 m 19.896100 50.010000 l 29.488100 50.010000 l 29.488100 45.710000 l f
0.100000 slw
[] 0 sd
[] 0 sd
0 slj
0.000000 0.000000 0.000000 srgb
n 19.896100 45.710000 m 19.896100 50.010000 l 29.488100 50.010000 l 29.488100 45.710000 l cp s
/Courier_e0 ff 0.800000 scf sf
(3*"18'%$23+/!45) sw
2 div 24.692100 ex sub 46.856491 m (3*"18'%$23+/!45)
 gs 1 -1 sc sh gr
(3*"18'%8147") sw
2 div 24.692100 ex sub 47.656491 m (3*"18'%8147")
 gs 1 -1 sc sh gr
("$4!2+=%23+) sw
2 div 24.692100 ex sub 48.456491 m ("$4!2+=%23+)
 gs 1 -1 sc sh gr
(#4!2"!%A1/!7"*3!) sw
2 div 24.692100 ex sub 49.256491 m (#4!2"!%A1/!7"*3!)
 gs 1 -1 sc sh gr
1.000000 1.000000 1.000000 srgb
n 11.517705 5.697520 m 14.738670 7.431075 l 11.517705 9.164630 l 8.296740 7.431075 l f
0.100000 slw
[] 0 sd
[] 0 sd
0 slj
0.000000 0.000000 0.000000 srgb
n 11.517705 5.697520 m 14.738670 7.431075 l 11.517705 9.164630 l 8.296740 7.431075 l cp s
/Courier_e0 ff 0.800000 scf sf
('1!/+) sw
2 div 11.517705 ex sub 7.627566 m ('1!/+)
 gs 1 -1 sc sh gr
0.100000 slw
[] 0 sd
0 slj
0 slc
n 6.985710 2.750000 m 2.969630 2.750000 l 2.969630 7.363020 l 8.296740 7.363020 l 8.296740 7.431080 l s
/Courier_e0 ff 0.800000 scf sf
('!7) sw
2 div 5.633185 ex sub 7.159511 m ('!7)
 gs 1 -1 sc sh gr
0.100000 slw
[] 0 sd
[] 0 sd
0 slj
0 slc
n 11.517700 3.700000 m 11.517700 4.650000 l 11.517700 4.650000 l 11.517700 5.697520 l s
0.100000 slw
[] 0 sd
[] 0 sd
0 slj
0 slc
n 11.517700 9.164630 m 11.517700 10.150000 l 11.517700 10.150000 l 11.517700 11.162200 l s
0 slj
n 11.117700 10.362200 m 11.517700 11.162200 l 11.917700 10.362200 l f
0.100000 slw
[] 0 sd
[] 0 sd
0 slj
0 slc
n 11.517700 13.062200 m 11.517700 14.050000 l 11.517700 14.050000 l 11.517700 15.059700 l s
0 slj
n 11.117700 14.259700 m 11.517700 15.059700 l 11.917700 14.259700 l f
0.100000 slw
[] 0 sd
[] 0 sd
0 slj
0 slc
n 11.517700 18.650500 m 11.517700 19.650000 l 11.517700 19.650000 l 11.517700 20.648000 l s
0 slj
n 11.117700 19.848000 m 11.517700 20.648000 l 11.917700 19.848000 l f
0.100000 slw
[] 0 sd
[] 0 sd
0 slj
0 slc
n 11.517700 24.642700 m 11.517700 25.850000 l 11.517700 25.850000 l 11.517700 26.640200 l s
0 slj
n 11.117700 25.840200 m 11.517700 26.640200 l 11.917700 25.840200 l f
0.100000 slw
[] 0 sd
[] 0 sd
0 slj
0 slc
n 11.517700 31.246500 m 11.517700 32.350000 l 11.517700 32.350000 l 11.517700 33.294000 l s
0.100000 slw
[] 0 sd
[] 0 sd
0 slj
0 slc
n 30.078900 16.855100 m 30.078900 16.913020 l 43.019630 16.913020 l 43.019630 2.750000 l 16.049710 2.750000 l s
0 slj
n 16.849710 2.350000 m 16.049710 2.750000 l 16.849710 3.150000 l f
0.100000 slw
[] 0 sd
[] 0 sd
0 slj
0 slc
n 35.728500 22.660000 m 35.728500 22.713020 l 43.019630 22.713020 l 43.019630 16.713020 l s
0.100000 slw
[] 0 sd
[] 0 sd
0 slj
0 slc
n 24.111300 30.518300 m 24.111300 32.150000 l 11.517700 32.150000 l 11.517700 33.294000 l s
0 slj
n 11.117700 32.494000 m 11.517700 33.294000 l 11.917700 32.494000 l f
0.100000 slw
[] 0 sd
[] 0 sd
0 slj
0 slc
n 43.019630 22.313020 m 43.019630 29.013020 l 40.943600 29.013020 l 40.943600 28.960000 l s
0.100000 slw
[] 0 sd
[] 0 sd
0 slj
0 slc
n 11.517700 37.464700 m 11.517700 38.320000 l 11.517700 38.320000 l 11.517700 39.067700 l s
0 slj
n 11.117700 38.267700 m 11.517700 39.067700 l 11.917700 38.267700 l f
0.100000 slw
[] 0 sd
[] 0 sd
0 slj
0 slc
n 11.517700 43.011000 m 11.517700 44.120000 l 11.517710 44.120000 l 11.517710 46.257700 l s
0 slj
n 11.117710 45.457700 m 11.517710 46.257700 l 11.917710 45.457700 l f
0.100000 slw
[] 0 sd
[] 0 sd
0 slj
0 slc
n 31.689300 35.360000 m 31.689300 35.340998 l 43.019630 35.340998 l 43.019630 28.840998 l s
0.100000 slw
[] 0 sd
[] 0 sd
0 slj
0 slc
n 33.022500 41.060000 m 33.022500 41.073009 l 43.019630 41.073009 l 43.019630 33.773009 l s
0.100000 slw
[] 0 sd
[] 0 sd
0 slj
0 slc
n 11.517710 49.495500 m 11.517710 50.670000 l 2.969630 50.670000 l 2.969630 2.750000 l 6.985710 2.750000 l s
0 slj
n 6.185710 3.150000 m 6.985710 2.750000 l 6.185710 2.350000 l f
0.100000 slw
[] 0 sd
[] 0 sd
0 slc
0 slj
0 slc
0 slj
[] 0 sd
1.000000 1.000000 1.000000 srgb
n 9.844477 -2.636980 m 13.194783 -2.636980 l 13.657364 -2.636980 14.032360 -2.189265 14.032360 -1.636980 c 14.032360 -1.084695 13.657364 -0.636980 13.194783 -0.636980 c 9.844477 -0.636980 l 9.381896 -0.636980 9.006900 -1.084695 9.006900 -1.636980 c 9.006900 -2.189265 9.381896 -2.636980 9.844477 -2.636980 c f
0.000000 0.000000 0.000000 srgb
n 9.844477 -2.636980 m 13.194783 -2.636980 l 13.657364 -2.636980 14.032360 -2.189265 14.032360 -1.636980 c 14.032360 -1.084695 13.657364 -0.636980 13.194783 -0.636980 c 9.844477 -0.636980 l 9.381896 -0.636980 9.006900 -1.084695 9.006900 -1.636980 c 9.006900 -2.189265 9.381896 -2.636980 9.844477 -2.636980 c s
/Courier_e0 ff 0.800000 scf sf
(7"24") sw
2 div 11.519630 ex sub -1.440489 m (7"24")
 gs 1 -1 sc sh gr
0.100000 slw
[] 0 sd
[] 0 sd
0 slc
n 11.519630 -0.636980 m 11.517700 1.800000 l s
0 slj
n 11.118334 0.999683 m 11.517700 1.800000 l 11.918333 1.000317 l f
0.100000 slw
[] 0 sd
[] 0 sd
0 slc
0 slj
0 slc
0 slj
[] 0 sd
1.000000 1.000000 1.000000 srgb
n 9.842557 52.723000 m 13.192863 52.723000 l 13.655444 52.723000 14.030440 53.170715 14.030440 53.723000 c 14.030440 54.275285 13.655444 54.723000 13.192863 54.723000 c 9.842557 54.723000 l 9.379976 54.723000 9.004980 54.275285 9.004980 53.723000 c 9.004980 53.170715 9.379976 52.723000 9.842557 52.723000 c f
0.000000 0.000000 0.000000 srgb
n 9.842557 52.723000 m 13.192863 52.723000 l 13.655444 52.723000 14.030440 53.170715 14.030440 53.723000 c 14.030440 54.275285 13.655444 54.723000 13.192863 54.723000 c 9.842557 54.723000 l 9.379976 54.723000 9.004980 54.275285 9.004980 53.723000 c 9.004980 53.170715 9.379976 52.723000 9.842557 52.723000 c s
/Courier_e0 ff 0.800000 scf sf
(!3+) sw
2 div 11.517710 ex sub 53.919491 m (!3+)
 gs 1 -1 sc sh gr
0.100000 slw
[] 0 sd
[] 0 sd
0 slj
0 slc
n 11.517710 49.495500 m 11.517710 50.563000 l 11.517710 50.563000 l 11.517710 52.723000 l s
0 slj
n 11.117710 51.923000 m 11.517710 52.723000 l 11.917710 51.923000 l f
/Courier_e0 ff 0.800000 scf sf
(B*) sw
2 div 24.919630 ex sub 31.563020 m (B*)
 gs 1 -1 sc sh gr
0.100000 slw
[] 0 sd
[] 0 sd
0 slc
n 16.485420 16.855105 m 19.606900 16.855100 l s
0 slj
n 18.806901 17.255101 m 19.606900 16.855100 l 18.806899 16.455101 l f
/Courier_e0 ff 0.800000 scf sf
(C!7) sw
2 div 17.719630 ex sub 16.538710 m (C!7)
 gs 1 -1 sc sh gr
0.100000 slw
[] 0 sd
[] 0 sd
0 slc
n 17.265830 22.645360 m 19.606900 22.660000 l s
0 slj
n 18.804414 23.054989 m 19.606900 22.660000 l 18.809417 22.255005 l f
/Courier_e0 ff 0.800000 scf sf
(C!7) sw
2 div 18.063840 ex sub 22.355201 m (C!7)
 gs 1 -1 sc sh gr
0.100000 slw
[] 0 sd
[] 0 sd
0 slc
n 16.786653 28.943330 m 19.606900 28.924175 l s
0 slj
n 18.809635 29.329599 m 19.606900 28.924175 l 18.804202 28.529618 l f
/Courier_e0 ff 0.800000 scf sf
(C!7) sw
2 div 17.863840 ex sub 28.655201 m (C!7)
 gs 1 -1 sc sh gr
0.100000 slw
[] 0 sd
[] 0 sd
0 slc
n 28.615790 28.924175 m 31.298800 28.960000 l s
0 slj
n 30.493531 29.349283 m 31.298800 28.960000 l 30.504212 28.549355 l f
/Courier_e0 ff 0.800000 scf sf
(C!7) sw
2 div 29.663840 ex sub 28.655201 m (C!7)
 gs 1 -1 sc sh gr
0.100000 slw
[] 0 sd
[] 0 sd
0 slc
n 16.155660 35.379335 m 19.606900 35.360000 l s
0 slj
n 18.809153 35.764476 m 19.606900 35.360000 l 18.804672 34.964488 l f
/Courier_e0 ff 0.800000 scf sf
(C!7) sw
2 div 17.563840 ex sub 35.055201 m (C!7)
 gs 1 -1 sc sh gr
0.100000 slw
[] 0 sd
[] 0 sd
0 slc
n 15.736020 41.039365 m 19.884100 41.060000 l s
0 slj
n 19.082120 41.456015 m 19.884100 41.060000 l 19.086100 40.656025 l f
/Courier_e0 ff 0.800000 scf sf
(C!7) sw
2 div 17.663840 ex sub 40.789029 m (C!7)
 gs 1 -1 sc sh gr
0.100000 slw
[] 0 sd
[] 0 sd
0 slc
n 15.472801 47.876600 m 19.896100 47.860000 l s
0 slj
n 19.097607 48.262999 m 19.896100 47.860000 l 19.094604 47.463005 l f
/Courier_e0 ff 0.800000 scf sf
(C!7) sw
2 div 17.684451 ex sub 47.568300 m (C!7)
 gs 1 -1 sc sh gr
0.100000 slw
[] 0 sd
[] 0 sd
0 slj
0 slc
n 29.488100 47.860000 m 29.488100 47.943009 l 43.020085 47.943009 l 43.020085 39.239641 l s
showpage
