%!PS-Adobe-2.0 EPSF-2.0
%%Title: registerset.dia
%%Creator: Dia v0.90
%%CreationDate: Tue Mar 11 22:53:23 2003
%%For: pascal
%%Magnification: 1.0000
%%Orientation: Portrait
%%BoundingBox: 0 0 470 447
%%Pages: 1
%%EndComments
%%BeginProlog
/cp {closepath} bind def
/c {curveto} bind def
/f {fill} bind def
/a {arc} bind def
/ef {eofill} bind def
/ex {exch} bind def
/gr {grestore} bind def
/gs {gsave} bind def
/sa {save} bind def
/rs {restore} bind def
/l {lineto} bind def
/m {moveto} bind def
/rm {rmoveto} bind def
/n {newpath} bind def
/s {stroke} bind def
/sh {show} bind def
/slc {setlinecap} bind def
/slj {setlinejoin} bind def
/slw {setlinewidth} bind def
/srgb {setrgbcolor} bind def
/rot {rotate} bind def
/sc {scale} bind def
/sd {setdash} bind def
/ff {findfont} bind def
/sf {setfont} bind def
/scf {scalefont} bind def
/sw {stringwidth pop} bind def
/tr {translate} bind def

/ellipsedict 8 dict def
ellipsedict /mtrx matrix put
/ellipse
{ ellipsedict begin
   /endangle exch def
   /startangle exch def
   /yrad exch def
   /xrad exch def
   /y exch def
   /x exch def   /savematrix mtrx currentmatrix def
   x y tr xrad yrad sc
   0 0 1 startangle endangle arc
   savematrix setmatrix
   end
} def

/mergeprocs {
dup length
3 -1 roll
dup
length
dup
5 1 roll
3 -1 roll
add
array cvx
dup
3 -1 roll
0 exch
putinterval
dup
4 2 roll
putinterval
} bind def
%%EndProlog

%%BeginSetup
%%EndSetup
28.346000 -28.346000 scale
-1.555700 -16.150009 translate

0.000000 0.000000 0.000000 srgb
1.000000 1.000000 1.000000 srgb
n 1.991200 2.000000 m 1.991200 3.900000 l 3.997600 3.900000 l 3.997600 2.000000 l f
0.100000 slw
[] 0 sd
[] 0 sd
0 slj
0.000000 0.000000 0.000000 srgb
n 1.991200 2.000000 m 1.991200 3.900000 l 3.997600 3.900000 l 3.997600 2.000000 l cp s
 [ /xi /xi /xi /xi /xi /xi /xi /xi /xi /xi /xi /xi /xi /xi /xi /xi
 /xi /xi /xi /xi /xi /xi /xi /xi /xi /xi /xi /xi /xi /xi /xi /xi
 /r /zero /one /two /three /four /five /six /xi /xi /seven /space /equal /plus /parenleft /comma
 /parenright /xi /xi /xi /xi /xi /xi /xi /xi /xi /xi /xi /xi /xi /xi /xi
 /xi /xi /xi /xi /xi /xi /xi /xi /xi /xi /xi /xi /xi /xi /xi /xi
 /xi /xi /xi /xi /xi /xi /xi /xi /xi /xi /xi /xi /xi /xi /xi /xi
 /xi /xi /xi /xi /xi /xi /xi /xi /xi /xi /xi /xi /xi /xi /xi /xi
 /xi /xi /xi /xi /xi /xi /xi /xi /xi /xi /xi /xi /xi /xi /xi /xi
 /xi /xi /xi /xi /xi /xi /xi /xi /xi /xi /xi /xi /xi /xi /xi /xi
 /xi /xi /xi /xi /xi /xi /xi /xi /xi /xi /xi /xi /xi /xi /xi /xi
 /xi /xi /xi /xi /xi /xi /xi /xi /xi /xi /xi /xi /xi /xi /xi /xi
 /xi /xi /xi /xi /xi /xi /xi /xi /xi /xi /xi /xi /xi /xi /xi /xi
 /xi /xi /xi /xi /xi /xi /xi /xi /xi /xi /xi /xi /xi /xi /xi /xi
 /xi /xi /xi /xi /xi /xi /xi /xi /xi /xi /xi /xi /xi /xi /xi /xi
 /xi /xi /xi /xi /xi /xi /xi /xi /xi /xi /xi /xi /xi /xi /xi /xi
 /xi /xi /xi /xi /xi /xi /xi /xi /xi /xi /xi /xi /xi /xi /xi /xi
] /e0 exch def
/Courier_e0 undefinefont
/Courier_e0
  /Courier findfont
  dup length dict begin
  {1 index /FID ne {def} {pop pop} ifelse} forall
  /Encoding e0 def
  currentdict end
definefont pop
/Courier_e0 ff 0.800000 scf sf
( !) sw
2 div 2.994400 ex sub 3.146491 m ( !)
 gs 1 -1 sc sh gr
1.000000 1.000000 1.000000 srgb
n 3.991200 2.000000 m 3.991200 3.900000 l 6.024000 3.900000 l 6.024000 2.000000 l f
0.100000 slw
[] 0 sd
[] 0 sd
0 slj
0.000000 0.000000 0.000000 srgb
n 3.991200 2.000000 m 3.991200 3.900000 l 6.024000 3.900000 l 6.024000 2.000000 l cp s
/Courier_e0 ff 0.800000 scf sf
( ") sw
2 div 5.007600 ex sub 3.146491 m ( ")
 gs 1 -1 sc sh gr
0.276052 0.000000 1.000000 srgb
n 5.995600 2.000000 m 5.995600 3.900000 l 7.993200 3.900000 l 7.993200 2.000000 l f
0.100000 slw
[] 0 sd
[] 0 sd
0 slj
0.000000 0.000000 0.000000 srgb
n 5.995600 2.000000 m 5.995600 3.900000 l 7.993200 3.900000 l 7.993200 2.000000 l cp s
/Courier_e0 ff 0.800000 scf sf
( #) sw
2 div 6.994400 ex sub 3.146491 m ( #)
 gs 1 -1 sc sh gr
1.000000 1.000000 1.000000 srgb
n 7.991200 2.000000 m 7.991200 3.900000 l 9.980000 3.900000 l 9.980000 2.000000 l f
0.100000 slw
[] 0 sd
[] 0 sd
0 slj
0.000000 0.000000 0.000000 srgb
n 7.991200 2.000000 m 7.991200 3.900000 l 9.980000 3.900000 l 9.980000 2.000000 l cp s
/Courier_e0 ff 0.800000 scf sf
( $) sw
2 div 8.985600 ex sub 3.146491 m ( $)
 gs 1 -1 sc sh gr
1.000000 1.000000 1.000000 srgb
n 9.991200 2.000000 m 9.991200 3.900000 l 11.997600 3.900000 l 11.997600 2.000000 l f
0.100000 slw
[] 0 sd
[] 0 sd
0 slj
0.000000 0.000000 0.000000 srgb
n 9.991200 2.000000 m 9.991200 3.900000 l 11.997600 3.900000 l 11.997600 2.000000 l cp s
/Courier_e0 ff 0.800000 scf sf
( %) sw
2 div 10.994400 ex sub 3.146491 m ( %)
 gs 1 -1 sc sh gr
0.069909 0.711225 0.893939 srgb
n 11.991200 2.000000 m 11.991200 3.900000 l 13.997600 3.900000 l 13.997600 2.000000 l f
0.100000 slw
[] 0 sd
[] 0 sd
0 slj
0.000000 0.000000 0.000000 srgb
n 11.991200 2.000000 m 11.991200 3.900000 l 13.997600 3.900000 l 13.997600 2.000000 l cp s
/Courier_e0 ff 0.800000 scf sf
( &) sw
2 div 12.994400 ex sub 3.146491 m ( &)
 gs 1 -1 sc sh gr
1.000000 1.000000 1.000000 srgb
n 13.991200 2.000000 m 13.991200 3.900000 l 15.997600 3.900000 l 15.997600 2.000000 l f
0.100000 slw
[] 0 sd
[] 0 sd
0 slj
0.000000 0.000000 0.000000 srgb
n 13.991200 2.000000 m 13.991200 3.900000 l 15.997600 3.900000 l 15.997600 2.000000 l cp s
/Courier_e0 ff 0.800000 scf sf
( ') sw
2 div 14.994400 ex sub 3.146491 m ( ')
 gs 1 -1 sc sh gr
0.070000 0.710000 0.890000 srgb
n 16.000000 2.000000 m 16.000000 3.900000 l 18.006400 3.900000 l 18.006400 2.000000 l f
0.100000 slw
[] 0 sd
[] 0 sd
0 slj
0.000000 0.000000 0.000000 srgb
n 16.000000 2.000000 m 16.000000 3.900000 l 18.006400 3.900000 l 18.006400 2.000000 l cp s
/Courier_e0 ff 0.800000 scf sf
( *) sw
2 div 17.003200 ex sub 3.146491 m ( *)
 gs 1 -1 sc sh gr
/Courier_e0 ff 0.800000 scf sf
( #+,+ &+-+ *) sw
2 div 5.000000 ex sub 1.000000 m ( #+,+ &+-+ *)
 gs 1 -1 sc sh gr
0.100000 slw
[] 0 sd
[] 0 sd
0 slj
0 slc
n 17.003200 3.900000 m 17.003200 6.000000 l 6.994400 6.000000 l 6.994400 3.900000 l s
0 slj
1.000000 1.000000 1.000000 srgb
n 7.394400 4.700000 m 6.994400 3.900000 l 6.594400 4.700000 l f
0.100000 slw
[] 0 sd
0 slj
0.000000 0.000000 0.000000 srgb
n 7.394400 4.700000 m 6.994400 3.900000 l 6.594400 4.700000 l cp s
0.100000 slw
[] 0 sd
[] 0 sd
0 slj
0 slc
n 12.994400 3.900000 m 12.994400 6.000000 l 6.994400 6.000000 l 6.994400 3.900000 l s
0 slj
1.000000 1.000000 1.000000 srgb
n 7.394400 4.700000 m 6.994400 3.900000 l 6.594400 4.700000 l f
0.100000 slw
[] 0 sd
0 slj
0.000000 0.000000 0.000000 srgb
n 7.394400 4.700000 m 6.994400 3.900000 l 6.594400 4.700000 l cp s
/Courier_e0 ff 0.800000 scf sf
(-) sw
2 div 10.050000 ex sub 5.800000 m (-)
 gs 1 -1 sc sh gr
1.000000 1.000000 1.000000 srgb
n 2.038500 8.796490 m 2.038500 10.696490 l 4.044900 10.696490 l 4.044900 8.796490 l f
0.100000 slw
[] 0 sd
[] 0 sd
0 slj
0.000000 0.000000 0.000000 srgb
n 2.038500 8.796490 m 2.038500 10.696490 l 4.044900 10.696490 l 4.044900 8.796490 l cp s
/Courier_e0 ff 0.800000 scf sf
( !) sw
2 div 3.041700 ex sub 9.942981 m ( !)
 gs 1 -1 sc sh gr
1.000000 1.000000 1.000000 srgb
n 4.038500 8.796490 m 4.038500 10.696490 l 6.071300 10.696490 l 6.071300 8.796490 l f
0.100000 slw
[] 0 sd
[] 0 sd
0 slj
0.000000 0.000000 0.000000 srgb
n 4.038500 8.796490 m 4.038500 10.696490 l 6.071300 10.696490 l 6.071300 8.796490 l cp s
/Courier_e0 ff 0.800000 scf sf
( ") sw
2 div 5.054900 ex sub 9.942981 m ( ")
 gs 1 -1 sc sh gr
0.280000 0.000000 1.000000 srgb
n 6.042900 8.796490 m 6.042900 10.696490 l 8.040500 10.696490 l 8.040500 8.796490 l f
0.100000 slw
[] 0 sd
[] 0 sd
0 slj
0.000000 0.000000 0.000000 srgb
n 6.042900 8.796490 m 6.042900 10.696490 l 8.040500 10.696490 l 8.040500 8.796490 l cp s
/Courier_e0 ff 0.800000 scf sf
( #) sw
2 div 7.041700 ex sub 9.942981 m ( #)
 gs 1 -1 sc sh gr
0.280000 0.000000 1.000000 srgb
n 8.038500 8.796490 m 8.038500 10.696490 l 10.027300 10.696490 l 10.027300 8.796490 l f
0.100000 slw
[] 0 sd
[] 0 sd
0 slj
0.000000 0.000000 0.000000 srgb
n 8.038500 8.796490 m 8.038500 10.696490 l 10.027300 10.696490 l 10.027300 8.796490 l cp s
/Courier_e0 ff 0.800000 scf sf
( $) sw
2 div 9.032900 ex sub 9.942981 m ( $)
 gs 1 -1 sc sh gr
0.070000 0.710000 0.890000 srgb
n 10.038500 8.796490 m 10.038500 10.696490 l 12.044900 10.696490 l 12.044900 8.796490 l f
0.100000 slw
[] 0 sd
[] 0 sd
0 slj
0.000000 0.000000 0.000000 srgb
n 10.038500 8.796490 m 10.038500 10.696490 l 12.044900 10.696490 l 12.044900 8.796490 l cp s
/Courier_e0 ff 0.800000 scf sf
( %) sw
2 div 11.041700 ex sub 9.942981 m ( %)
 gs 1 -1 sc sh gr
0.070000 0.710000 0.890000 srgb
n 12.038500 8.796490 m 12.038500 10.696490 l 14.044900 10.696490 l 14.044900 8.796490 l f
0.100000 slw
[] 0 sd
[] 0 sd
0 slj
0.000000 0.000000 0.000000 srgb
n 12.038500 8.796490 m 12.038500 10.696490 l 14.044900 10.696490 l 14.044900 8.796490 l cp s
/Courier_e0 ff 0.800000 scf sf
( &) sw
2 div 13.041700 ex sub 9.942981 m ( &)
 gs 1 -1 sc sh gr
0.070000 0.710000 0.890000 srgb
n 14.038500 8.796490 m 14.038500 10.696490 l 16.044900 10.696490 l 16.044900 8.796490 l f
0.100000 slw
[] 0 sd
[] 0 sd
0 slj
0.000000 0.000000 0.000000 srgb
n 14.038500 8.796490 m 14.038500 10.696490 l 16.044900 10.696490 l 16.044900 8.796490 l cp s
/Courier_e0 ff 0.800000 scf sf
( ') sw
2 div 15.041700 ex sub 9.942981 m ( ')
 gs 1 -1 sc sh gr
0.070000 0.710000 0.890000 srgb
n 16.047300 8.796490 m 16.047300 10.696490 l 18.053700 10.696490 l 18.053700 8.796490 l f
0.100000 slw
[] 0 sd
[] 0 sd
0 slj
0.000000 0.000000 0.000000 srgb
n 16.047300 8.796490 m 16.047300 10.696490 l 18.053700 10.696490 l 18.053700 8.796490 l cp s
/Courier_e0 ff 0.800000 scf sf
( *) sw
2 div 17.050500 ex sub 9.942981 m ( *)
 gs 1 -1 sc sh gr
/Courier_e0 ff 0.800000 scf sf
(. #/ $0+,+. %/ &0+-+. '/ *0) sw
2 div 8.547300 ex sub 7.796490 m (. #/ $0+,+. %/ &0+-+. '/ *0)
 gs 1 -1 sc sh gr
0.100000 slw
[] 0 sd
[] 0 sd
0 slj
0 slc
n 16.000100 11.600000 m 16.000100 13.900000 l 8.000100 13.900000 l 8.000100 11.900000 l s
0 slj
1.000000 1.000000 1.000000 srgb
n 8.400100 12.700000 m 8.000100 11.900000 l 7.600100 12.700000 l f
0.100000 slw
[] 0 sd
0 slj
0.000000 0.000000 0.000000 srgb
n 8.400100 12.700000 m 8.000100 11.900000 l 7.600100 12.700000 l cp s
0.100000 slw
[] 0 sd
[] 0 sd
0 slj
0 slc
n 12.000100 11.500000 m 12.000100 13.900000 l 8.000100 13.900000 l 8.000100 11.900000 l s
0 slj
1.000000 1.000000 1.000000 srgb
n 8.400100 12.700000 m 8.000100 11.900000 l 7.600100 12.700000 l f
0.100000 slw
[] 0 sd
0 slj
0.000000 0.000000 0.000000 srgb
n 8.400100 12.700000 m 8.000100 11.900000 l 7.600100 12.700000 l cp s
/Courier_e0 ff 0.800000 scf sf
(-) sw
2 div 10.050100 ex sub 13.650000 m (-)
 gs 1 -1 sc sh gr
0.100000 slw
[] 0 sd
[] 0 sd
0 slj
0 slc
n 11.041700 10.696490 m 11.041700 11.500000 l 13.041700 11.500000 l 13.041700 10.696490 l s
0.100000 slw
[] 0 sd
[] 0 sd
0 slj
0 slc
n 15.200100 10.800000 m 15.200100 11.600000 l 17.050500 11.600000 l 17.050500 10.696490 l s
0.100000 slw
[] 0 sd
[] 0 sd
0 slj
0 slc
n 7.041700 10.696490 m 7.041700 11.800000 l 9.032900 11.800000 l 9.032900 10.696490 l s
showpage
