#FIG 3.2
Landscape
Center
Metric
A4      
100.00
Single
-2
1200 2
6 2250 900 4050 1125
2 2 0 1 0 7 100 0 -1 0.000 0 0 -1 0 0 5
	 2250 900 4050 900 4050 1125 2250 1125 2250 900
4 0 0 100 0 0 12 0.0000 4 135 1380 2460 1080 LocalVariableTable\001
-6
6 2250 675 4050 900
2 2 0 1 0 7 100 0 -1 0.000 0 0 -1 0 0 5
	 2250 675 4050 675 4050 900 2250 900 2250 675
4 0 0 100 0 0 12 0.0000 4 135 1290 2505 855 LineNumberTable\001
-6
6 2025 1575 4275 1800
2 2 0 1 0 7 100 0 -1 0.000 0 0 -1 0 0 5
	 2025 1575 4275 1575 4275 1800 2025 1800 2025 1575
4 0 0 100 0 0 12 0.0000 4 180 660 2250 1732 Synthetic\001
-6
6 2025 1800 4275 2025
2 2 0 1 0 7 100 0 -1 0.000 0 0 -1 0 0 5
	 2025 1800 4275 1800 4275 2025 2025 2025 2025 1800
4 0 0 100 0 0 12 0.0000 4 180 795 2250 1957 Deprecated\001
-6
6 2025 1350 4275 1575
2 2 0 1 0 7 100 0 -1 0.000 0 0 -1 0 0 5
	 2025 1350 4275 1350 4275 1575 2025 1575 2025 1350
4 0 0 100 0 0 12 0.0000 4 180 780 2250 1507 Exceptions\001
-6
2 2 0 1 0 7 100 0 -1 0.000 0 0 -1 0 0 5
	 4275 1350 2025 1350 2025 225 4275 225 4275 1350
4 0 0 100 0 0 12 0.0000 4 135 375 2250 495 Code\001
