(classPool
(JNukeClass "Consts" "Consts.java"
  (JNukeMethod "Consts.<init>" (JNukeSignature "V" (JNukeVector))
  (JNukeByteCodes
    (JNukeRByteCode 0 "r0 = Get" l0 (line 3))
    (JNukeRByteCode 1 "     InvokeSpecial" (JNukeMethod "java/lang/Object.<init>" (JNukeSignature "V" (JNukeVector))) r0)
    (JNukeRByteCode 2 "<r0, r1> = Const" long 1 (line 8))
    (JNukeRByteCode 3 "<l1, l2> = Get" r0 r1)
    (JNukeRByteCode 4 "r0 = Const" float 2 (line 9))
    (JNukeRByteCode 5 "l6 = Get" r0)
    (JNukeRByteCode 6 "r0 = Const" int -1 (line 10))
    (JNukeRByteCode 7 "l3 = Get" r0)
    (JNukeRByteCode 8 "r0 = Const" int 4 (line 11))
    (JNukeRByteCode 9 "l4 = Get" r0)
    (JNukeRByteCode 10 "r0 = Const" int 5 (line 12))
    (JNukeRByteCode 11 "l5 = Get" r0)
    (JNukeRByteCode 12 "r0 = GetStatic" "java/lang/System" (pair "out" "Ljava/io/PrintStream;") (line 13))
    (JNukeRByteCode 13 "<r1, r2> = Get" l1 l2)
    (JNukeRByteCode 14 "     InvokeVirtual" (JNukeMethod "java/io/PrintStream.println" (JNukeSignature "V" (JNukeVector "J"))) r0 r1 r2)
    (JNukeRByteCode 15 "     Return" void (line 14))
))
)
)
