	time	#ins	#ins/s	#paths	time	#ins	#ins/s	#paths	time	#ins	#ins/s	#paths	time	#ins	#ins/s	#paths
DP 2 10	6.4	189	29.6	9,116	8.6	323	37.6	18,209	84.7	503	5.9	58,229	816.9	2,770	3.4	783,425
DP 3 1	0.2	4	16.3	72	1.8	60	33.7	3,701	29.7	151	5.1	21,582	845.7	2,457	2.9	952,480
DP 3 2	5.1	127	25.0	6,598	20.7	693	33.5	47,590	186.7	1,112	6.0	169,374	t.o.	t.o.	t.o.	t.o.
DP 3 3	32.5	818	25.2	48,887	92.8	2,994	32.3	211,476	597.6	3,670	6.1	569,548	t.o.	t.o.	t.o.	t.o.
PC 100	1.1	67	61.9	1,787	1.1	80	70.4	2,389	48.4	279	5.8	30,781	390.8	1,363	3.5	373,632
PC 1000	15.9	661	41.5	17,987	17.7	794	44.8	23,989	409.4	2,795	6.8	308,881	t.o.	t.o.	t.o.	t.o.