%!PS-Adobe-2.0 EPSF-2.0
%%Title: waitlist.dia
%%Creator: Dia v0.90
%%CreationDate: Mon Feb 10 11:18:16 2003
%%For: pascal
%%Magnification: 1.0000
%%Orientation: Portrait
%%BoundingBox: 0 0 322 329
%%Pages: 1
%%EndComments
%%BeginProlog
/cp {closepath} bind def
/c {curveto} bind def
/f {fill} bind def
/a {arc} bind def
/ef {eofill} bind def
/ex {exch} bind def
/gr {grestore} bind def
/gs {gsave} bind def
/sa {save} bind def
/rs {restore} bind def
/l {lineto} bind def
/m {moveto} bind def
/rm {rmoveto} bind def
/n {newpath} bind def
/s {stroke} bind def
/sh {show} bind def
/slc {setlinecap} bind def
/slj {setlinejoin} bind def
/slw {setlinewidth} bind def
/srgb {setrgbcolor} bind def
/rot {rotate} bind def
/sc {scale} bind def
/sd {setdash} bind def
/ff {findfont} bind def
/sf {setfont} bind def
/scf {scalefont} bind def
/sw {stringwidth pop} bind def
/tr {translate} bind def

/ellipsedict 8 dict def
ellipsedict /mtrx matrix put
/ellipse
{ ellipsedict begin
   /endangle exch def
   /startangle exch def
   /yrad exch def
   /xrad exch def
   /y exch def
   /x exch def   /savematrix mtrx currentmatrix def
   x y tr xrad yrad sc
   0 0 1 startangle endangle arc
   savematrix setmatrix
   end
} def

/mergeprocs {
dup length
3 -1 roll
dup
length
dup
5 1 roll
3 -1 roll
add
array cvx
dup
3 -1 roll
0 exch
putinterval
dup
4 2 roll
putinterval
} bind def
%%EndProlog

%%BeginSetup
%%EndSetup
28.346000 -28.346000 scale
0.028000 -8.480000 translate

1.000000 1.000000 1.000000 srgb
n 1.650000 2.050000 m 1.650000 3.950000 l 9.622800 3.950000 l 9.622800 2.050000 l f
0.100000 slw
[] 0 sd
[] 0 sd
0 slj
0.000000 0.000000 0.000000 srgb
n 1.650000 2.050000 m 1.650000 3.950000 l 9.622800 3.950000 l 9.622800 2.050000 l cp s
 [ /xi /xi /xi /xi /xi /xi /xi /xi /xi /xi /xi /xi /xi /xi /xi /xi
 /xi /xi /xi /xi /xi /xi /xi /xi /xi /xi /xi /xi /xi /xi /xi /xi
 /J /N /u /k /e /W /a /i /xi /xi /t /L /s /n /c /period
 /S /M /g /r /one /xi /xi /xi /xi /xi /xi /xi /xi /xi /xi /xi
 /xi /xi /xi /xi /xi /xi /xi /xi /xi /xi /xi /xi /xi /xi /xi /xi
 /xi /xi /xi /xi /xi /xi /xi /xi /xi /xi /xi /xi /xi /xi /xi /xi
 /xi /xi /xi /xi /xi /xi /xi /xi /xi /xi /xi /xi /xi /xi /xi /xi
 /xi /xi /xi /xi /xi /xi /xi /xi /xi /xi /xi /xi /xi /xi /xi /xi
 /xi /xi /xi /xi /xi /xi /xi /xi /xi /xi /xi /xi /xi /xi /xi /xi
 /xi /xi /xi /xi /xi /xi /xi /xi /xi /xi /xi /xi /xi /xi /xi /xi
 /xi /xi /xi /xi /xi /xi /xi /xi /xi /xi /xi /xi /xi /xi /xi /xi
 /xi /xi /xi /xi /xi /xi /xi /xi /xi /xi /xi /xi /xi /xi /xi /xi
 /xi /xi /xi /xi /xi /xi /xi /xi /xi /xi /xi /xi /xi /xi /xi /xi
 /xi /xi /xi /xi /xi /xi /xi /xi /xi /xi /xi /xi /xi /xi /xi /xi
 /xi /xi /xi /xi /xi /xi /xi /xi /xi /xi /xi /xi /xi /xi /xi /xi
 /xi /xi /xi /xi /xi /xi /xi /xi /xi /xi /xi /xi /xi /xi /xi /xi
] /e0 exch def
/Courier_e0 undefinefont
/Courier_e0
  /Courier findfont
  dup length dict begin
  {1 index /FID ne {def} {pop pop} ifelse} forall
  /Encoding e0 def
  currentdict end
definefont pop
/Courier_e0 ff 0.800000 scf sf
( !"#$%&'*+',*) sw
2 div 5.636400 ex sub 3.196491 m ( !"#$%&'*+',*)
 gs 1 -1 sc sh gr
0.100000 slw
[] 0 sd
0 slj
0 slc
n 5.481000 6.530000 m 5.481000 5.650000 l 5.476000 5.650000 l 5.476000 3.950000 l s
0.100000 slw
[] 0 sd
0 slj
0 slc
n 5.876000 4.750000 m 5.476000 3.950000 l 5.076000 4.750000 l s
/Courier_e0 ff 0.800000 scf sf
('-,*&-.$) sw
2 div 8.013600 ex sub 6.210000 m ('-,*&-.$)
 gs 1 -1 sc sh gr
0.717647 0.717647 0.717647 srgb
n 5.206000 6.530000 m 5.206000 8.430000 l 6.306000 8.430000 l 6.306000 6.530000 l f
0.100000 slw
[] 0 sd
[] 0 sd
0 slj
0.000000 0.000000 0.000000 srgb
n 5.206000 6.530000 m 5.206000 8.430000 l 6.306000 8.430000 l 6.306000 6.530000 l cp s
1.000000 1.000000 1.000000 srgb
n 6.375200 6.530000 m 6.375200 8.430000 l 9.763200 8.430000 l 9.763200 6.530000 l f
0.100000 slw
[] 0 sd
[] 0 sd
0 slj
0.000000 0.000000 0.000000 srgb
n 6.375200 6.530000 m 6.375200 8.430000 l 9.763200 8.430000 l 9.763200 6.530000 l cp s
/Courier_e0 ff 0.800000 scf sf
(/////) sw
2 div 8.069200 ex sub 7.676491 m (/////)
 gs 1 -1 sc sh gr
1.000000 1.000000 1.000000 srgb
n 0.022000 -3.050000 m 0.022000 -1.150000 l 11.250800 -1.150000 l 11.250800 -3.050000 l f
0.100000 slw
[] 0 sd
[] 0 sd
0 slj
0.000000 0.000000 0.000000 srgb
n 0.022000 -3.050000 m 0.022000 -1.150000 l 11.250800 -1.150000 l 11.250800 -3.050000 l cp s
/Courier_e0 ff 0.800000 scf sf
( !"#$%&'*0$*1&-&2$3) sw
2 div 5.636400 ex sub -1.903509 m ( !"#$%&'*0$*1&-&2$3)
 gs 1 -1 sc sh gr
0.100000 slw
[] 0 sd
0 slj
0 slc
n 5.636400 2.050000 m 5.636400 1.600000 l 5.636400 1.600000 l 5.636400 -1.150000 l s
[] 0 sd
0 slj
0 slc
n 5.636400 -1.150000 m 5.876400 -0.450000 l 5.636400 0.250000 l 5.396400 -0.450000 l f
5.636400 2.646491 m /Courier_e0 ff 0.800000 scf sf
(-)
 gs 1 -1 sc sh gr
5.636400 -0.553509 m (4)
 gs 1 -1 sc sh gr
showpage
