%!PS-Adobe-2.0 EPSF-2.0
%%Title: generalconnect.fig
%%Creator: fig2dev Version 3.2 Patchlevel 4
%%CreationDate: Mon Mar 28 09:46:23 2005
%%For: zboris@linux (Boris Z.)
%%BoundingBox: 0 0 561 537
%%Magnification: 1.0000
%%EndComments
/$F2psDict 200 dict def
$F2psDict begin
$F2psDict /mtrx matrix put
/col-1 {0 setgray} bind def
/col0 {0.000 0.000 0.000 srgb} bind def
/col1 {0.000 0.000 1.000 srgb} bind def
/col2 {0.000 1.000 0.000 srgb} bind def
/col3 {0.000 1.000 1.000 srgb} bind def
/col4 {1.000 0.000 0.000 srgb} bind def
/col5 {1.000 0.000 1.000 srgb} bind def
/col6 {1.000 1.000 0.000 srgb} bind def
/col7 {1.000 1.000 1.000 srgb} bind def
/col8 {0.000 0.000 0.560 srgb} bind def
/col9 {0.000 0.000 0.690 srgb} bind def
/col10 {0.000 0.000 0.820 srgb} bind def
/col11 {0.530 0.810 1.000 srgb} bind def
/col12 {0.000 0.560 0.000 srgb} bind def
/col13 {0.000 0.690 0.000 srgb} bind def
/col14 {0.000 0.820 0.000 srgb} bind def
/col15 {0.000 0.560 0.560 srgb} bind def
/col16 {0.000 0.690 0.690 srgb} bind def
/col17 {0.000 0.820 0.820 srgb} bind def
/col18 {0.560 0.000 0.000 srgb} bind def
/col19 {0.690 0.000 0.000 srgb} bind def
/col20 {0.820 0.000 0.000 srgb} bind def
/col21 {0.560 0.000 0.560 srgb} bind def
/col22 {0.690 0.000 0.690 srgb} bind def
/col23 {0.820 0.000 0.820 srgb} bind def
/col24 {0.500 0.190 0.000 srgb} bind def
/col25 {0.630 0.250 0.000 srgb} bind def
/col26 {0.750 0.380 0.000 srgb} bind def
/col27 {1.000 0.500 0.500 srgb} bind def
/col28 {1.000 0.630 0.630 srgb} bind def
/col29 {1.000 0.750 0.750 srgb} bind def
/col30 {1.000 0.880 0.880 srgb} bind def
/col31 {1.000 0.840 0.000 srgb} bind def

end
save
newpath 0 537 moveto 0 0 lineto 561 0 lineto 561 537 lineto closepath clip newpath
5.7 544.3 translate
1 -1 scale

/cp {closepath} bind def
/ef {eofill} bind def
/gr {grestore} bind def
/gs {gsave} bind def
/sa {save} bind def
/rs {restore} bind def
/l {lineto} bind def
/m {moveto} bind def
/rm {rmoveto} bind def
/n {newpath} bind def
/s {stroke} bind def
/sh {show} bind def
/slc {setlinecap} bind def
/slj {setlinejoin} bind def
/slw {setlinewidth} bind def
/srgb {setrgbcolor} bind def
/rot {rotate} bind def
/sc {scale} bind def
/sd {setdash} bind def
/ff {findfont} bind def
/sf {setfont} bind def
/scf {scalefont} bind def
/sw {stringwidth} bind def
/tr {translate} bind def
/tnt {dup dup currentrgbcolor
  4 -2 roll dup 1 exch sub 3 -1 roll mul add
  4 -2 roll dup 1 exch sub 3 -1 roll mul add
  4 -2 roll dup 1 exch sub 3 -1 roll mul add srgb}
  bind def
/shd {dup dup currentrgbcolor 4 -2 roll mul 4 -2 roll mul
  4 -2 roll mul srgb} bind def
 /DrawEllipse {
	/endangle exch def
	/startangle exch def
	/yrad exch def
	/xrad exch def
	/y exch def
	/x exch def
	/savematrix mtrx currentmatrix def
	x y tr xrad yrad sc 0 0 1 startangle endangle arc
	closepath
	savematrix setmatrix
	} def

/$F2psBegin {$F2psDict begin /$F2psEnteredState save def} def
/$F2psEnd {$F2psEnteredState restore end} def

$F2psBegin
10 setmiterlimit
0 slj 0 slc
 0.06299 0.06299 sc
%
% Fig objects follow
%
% 
% here starts figure with depth 50
% Ellipse
7.500 slw
n 6390 540 415 415 0 360 DrawEllipse gs 0.75 setgray ef gr gs col0 s gr

% Ellipse
n 6390 2160 415 415 0 360 DrawEllipse gs 0.75 setgray ef gr gs col0 s gr

% Ellipse
n 2250 3555 415 415 0 360 DrawEllipse gs col0 s gr

% Ellipse
n 5580 3600 415 415 0 360 DrawEllipse gs col0 s gr

% Ellipse
n 7100 3600 415 415 0 360 DrawEllipse gs 0.75 setgray ef gr gs col0 s gr

% Polyline
gs  clippath
5547 3185 m 5591 3226 l 5694 3115 l 5591 3183 l 5650 3074 l cp
eoclip
n 6210 2520 m
 5580 3195 l gs col0 s gr gr

% arrowhead
n 5650 3074 m 5591 3183 l 5694 3115 l 5650 3074 l  cp gs 0.00 setgray ef gr  col0 s
% Polyline
 [15 45] 45 sd
gs  clippath
2221 3167 m 2280 3162 l 2270 3011 l 2249 3133 l 2210 3015 l cp
eoclip
n 2205 2520 m
 2250 3150 l gs col0 s gr gr
 [] 0 sd
% arrowhead
n 2210 3015 m 2249 3133 l 2270 3011 l  col0 s
% Polyline
 [15 45] 45 sd
gs  clippath
7098 3226 m 7142 3185 l 7039 3074 l 7099 3183 l 6995 3115 l cp
eoclip
n 6525 2565 m
 7110 3195 l gs col0 s gr gr
 [] 0 sd
% arrowhead
n 6995 3115 m 7099 3183 l 7039 3074 l  col0 s
% Polyline
 [15 45] 45 sd
gs  clippath
6360 1770 m 6420 1770 l 6420 1618 l 6390 1738 l 6360 1618 l cp
eoclip
n 6390 945 m
 6390 1755 l gs col0 s gr gr
 [] 0 sd
% arrowhead
n 6360 1618 m 6390 1738 l 6420 1618 l  col0 s
% Polyline
15.000 slw
gs  clippath
5189 3630 m 5190 3570 l 5039 3567 l 5159 3600 l 5038 3627 l cp
2640 3524 m 2639 3584 l 2790 3587 l 2671 3555 l 2791 3527 l cp
eoclip
n 2655 3555 m
 5175 3600 l gs col4 s gr gr

% arrowhead
7.500 slw
n 2791 3527 m 2671 3555 l 2790 3587 l 2791 3527 l  cp gs col4 1.00 shd ef gr  col4 s
% arrowhead
n 5038 3627 m 5159 3600 l 5039 3567 l 5038 3627 l  cp gs col4 1.00 shd ef gr  col4 s
% Polyline
gs  clippath
5999 2235 m 6000 2175 l 5849 2171 l 5969 2205 l 5848 2231 l cp
eoclip
n 2655 2115 m
 5985 2205 l gs col0 s gr gr

% arrowhead
n 5848 2231 m 5969 2205 l 5849 2171 l 5848 2231 l  cp gs 0.00 setgray ef gr  col0 s
/Helvetica ff 180.00 scf sf
7020 450 m
gs 1 -1 sc (new ServerSocket\(...\)) col0 sh gr
/Helvetica ff 180.00 scf sf
7020 675 m
gs 1 -1 sc (accept\(...\)) col0 sh gr
/Helvetica ff 180.00 scf sf
5580 1440 m
gs 1 -1 sc (wait for connection) col0 sh gr
/Helvetica ff 180.00 scf sf
3150 3465 m
gs 1 -1 sc (conection ok) col0 sh gr
/Helvetica ff 180.00 scf sf
4905 2835 m
gs 1 -1 sc (new Socket\(\)) col0 sh gr
/Helvetica ff 180.00 scf sf
3465 2070 m
gs 1 -1 sc (make connection) col0 sh gr
/Helvetica ff 180.00 scf sf
495 2160 m
gs 1 -1 sc (new Socket\(...\)) col0 sh gr
/Helvetica ff 180.00 scf sf
4950 5085 m
gs 1 -1 sc (ServerSocket ss = new ServerSocket\(Port\);) col0 sh gr
/Helvetica ff 180.00 scf sf
4950 5490 m
gs 1 -1 sc (OutputStream os = s.getOutputStream\(\);) col0 sh gr
/Helvetica ff 180.00 scf sf
4950 5670 m
gs 1 -1 sc (...) col0 sh gr
/Times-Bold ff 180.00 scf sf
4950 5280 m
gs 1 -1 sc (Socket s = ss.accept\(\);) col0 sh gr
/Helvetica ff 180.00 scf sf
90 5325 m
gs 1 -1 sc (OutputStream os = s.getOutputStream\(\);) col0 sh gr
/Helvetica ff 180.00 scf sf
90 5445 m
gs 1 -1 sc (...) col0 sh gr
% Ellipse
n 2250 2115 415 415 0 360 DrawEllipse gs col0 s gr

/Helvetica ff 180.00 scf sf
-90 8640 m
gs 1 -1 sc (...) col0 sh gr
/Helvetica ff 180.00 scf sf
90 5085 m
gs 1 -1 sc (Socket s = new Socket\(remote IP, remote Port\);) col0 sh gr
% here ends figure;
$F2psEnd
rs
showpage
