%!PS-Adobe-2.0 EPSF-2.0
%%Title: designretenv.dia
%%Creator: Dia v0.90
%%CreationDate: Tue Mar 11 09:15:47 2003
%%For: pascal
%%Magnification: 1.0000
%%Orientation: Portrait
%%BoundingBox: 0 0 872 524
%%Pages: 1
%%EndComments
%%BeginProlog
/cp {closepath} bind def
/c {curveto} bind def
/f {fill} bind def
/a {arc} bind def
/ef {eofill} bind def
/ex {exch} bind def
/gr {grestore} bind def
/gs {gsave} bind def
/sa {save} bind def
/rs {restore} bind def
/l {lineto} bind def
/m {moveto} bind def
/rm {rmoveto} bind def
/n {newpath} bind def
/s {stroke} bind def
/sh {show} bind def
/slc {setlinecap} bind def
/slj {setlinejoin} bind def
/slw {setlinewidth} bind def
/srgb {setrgbcolor} bind def
/rot {rotate} bind def
/sc {scale} bind def
/sd {setdash} bind def
/ff {findfont} bind def
/sf {setfont} bind def
/scf {scalefont} bind def
/sw {stringwidth pop} bind def
/tr {translate} bind def

/ellipsedict 8 dict def
ellipsedict /mtrx matrix put
/ellipse
{ ellipsedict begin
   /endangle exch def
   /startangle exch def
   /yrad exch def
   /xrad exch def
   /y exch def
   /x exch def   /savematrix mtrx currentmatrix def
   x y tr xrad yrad sc
   0 0 1 startangle endangle arc
   savematrix setmatrix
   end
} def

/mergeprocs {
dup length
3 -1 roll
dup
length
dup
5 1 roll
3 -1 roll
add
array cvx
dup
3 -1 roll
0 exch
putinterval
dup
4 2 roll
putinterval
} bind def
%%EndProlog

%%BeginSetup
%%EndSetup
28.346000 -28.346000 scale
6.844800 -22.570000 translate

1.000000 1.000000 1.000000 srgb
n 6.429600 4.150000 m 6.429600 6.050000 l 19.770400 6.050000 l 19.770400 4.150000 l f
0.100000 slw
[] 0 sd
[] 0 sd
0 slj
0.000000 0.000000 0.000000 srgb
n 6.429600 4.150000 m 6.429600 6.050000 l 19.770400 6.050000 l 19.770400 4.150000 l cp s
 [ /xi /xi /xi /xi /xi /xi /xi /xi /xi /xi /xi /xi /xi /xi /xi /xi
 /xi /xi /xi /xi /xi /xi /xi /xi /xi /xi /xi /xi /xi /xi /xi /xi
 /J /N /u /k /e /R /n /t /xi /xi /i /m /E /v /r /o
 /T /h /a /d /S /c /F /B /C /I /s /L /M /g /W /H
 /p /one /zero /period /xi /xi /xi /xi /xi /xi /xi /xi /xi /xi /xi /xi
 /xi /xi /xi /xi /xi /xi /xi /xi /xi /xi /xi /xi /xi /xi /xi /xi
 /xi /xi /xi /xi /xi /xi /xi /xi /xi /xi /xi /xi /xi /xi /xi /xi
 /xi /xi /xi /xi /xi /xi /xi /xi /xi /xi /xi /xi /xi /xi /xi /xi
 /xi /xi /xi /xi /xi /xi /xi /xi /xi /xi /xi /xi /xi /xi /xi /xi
 /xi /xi /xi /xi /xi /xi /xi /xi /xi /xi /xi /xi /xi /xi /xi /xi
 /xi /xi /xi /xi /xi /xi /xi /xi /xi /xi /xi /xi /xi /xi /xi /xi
 /xi /xi /xi /xi /xi /xi /xi /xi /xi /xi /xi /xi /xi /xi /xi /xi
 /xi /xi /xi /xi /xi /xi /xi /xi /xi /xi /xi /xi /xi /xi /xi /xi
 /xi /xi /xi /xi /xi /xi /xi /xi /xi /xi /xi /xi /xi /xi /xi /xi
 /xi /xi /xi /xi /xi /xi /xi /xi /xi /xi /xi /xi /xi /xi /xi /xi
 /xi /xi /xi /xi /xi /xi /xi /xi /xi /xi /xi /xi /xi /xi /xi /xi
] /e0 exch def
/Courier_e0 undefinefont
/Courier_e0
  /Courier findfont
  dup length dict begin
  {1 index /FID ne {def} {pop pop} ifelse} forall
  /Encoding e0 def
  currentdict end
definefont pop
/Courier_e0 ff 0.800000 scf sf
( !"#$%"&'*+$,&-*./&+$&') sw
2 div 13.100000 ex sub 5.296491 m ( !"#$%"&'*+$,&-*./&+$&')
 gs 1 -1 sc sh gr
1.000000 1.000000 1.000000 srgb
n 15.850000 9.200000 m 15.850000 11.100000 l 22.793200 11.100000 l 22.793200 9.200000 l f
0.100000 slw
[] 0 sd
[] 0 sd
0 slj
0.000000 0.000000 0.000000 srgb
n 15.850000 9.200000 m 15.850000 11.100000 l 22.793200 11.100000 l 22.793200 9.200000 l cp s
/Courier_e0 ff 0.800000 scf sf
( !"#$01.$23) sw
2 div 19.321600 ex sub 10.346491 m ( !"#$01.$23)
 gs 1 -1 sc sh gr
1.000000 1.000000 1.000000 srgb
n 14.785200 15.150000 m 14.785200 17.050000 l 23.858000 17.050000 l 23.858000 15.150000 l f
0.100000 slw
[] 0 sd
[] 0 sd
0 slj
0.000000 0.000000 0.000000 srgb
n 14.785200 15.150000 m 14.785200 17.050000 l 23.858000 17.050000 l 23.858000 15.150000 l cp s
/Courier_e0 ff 0.800000 scf sf
( !"#$4'25#6.2+$) sw
2 div 19.321600 ex sub 16.296491 m ( !"#$4'25#6.2+$)
 gs 1 -1 sc sh gr
1.000000 1.000000 1.000000 srgb
n -6.714400 8.450000 m -6.714400 10.350000 l 4.514400 10.350000 l 4.514400 8.450000 l f
0.100000 slw
[] 0 sd
[] 0 sd
0 slj
0.000000 0.000000 0.000000 srgb
n -6.714400 8.450000 m -6.714400 10.350000 l 4.514400 10.350000 l 4.514400 8.450000 l cp s
/Courier_e0 ff 0.800000 scf sf
( !"#$%789&:'."5'*/&) sw
2 div -1.100000 ex sub 9.596491 m ( !"#$%789&:'."5'*/&)
 gs 1 -1 sc sh gr
0.100000 slw
[] 0 sd
0 slj
0 slc
n 19.321600 9.200000 m 19.321600 8.012500 l 13.100000 8.012500 l 13.100000 6.050000 l s
[] 0 sd
0 slj
0 slc
n 13.100000 6.050000 m 13.340000 6.750000 l 13.100000 7.450000 l 12.860000 6.750000 l f
0.100000 slw
[1.000000] 0 sd
[0.400000] 0 sd
0 slj
0 slc
n 6.429600 5.100000 m 6.429600 5.212500 l -1.100000 5.212500 l -1.100000 8.450000 l s
0.100000 slw
[] 0 sd
0 slj
0 slc
n -1.350000 7.650000 m -1.100000 8.450000 l -0.850000 7.650000 l s
0.100000 slw
[] 0 sd
0 slj
0 slc
n 19.321600 15.150000 m 19.321600 13.790000 l 19.321600 13.790000 l 19.321600 11.100000 l s
[] 0 sd
0 slj
0 slc
n 19.321600 11.100000 m 19.561600 11.800000 l 19.321600 12.500000 l 19.081600 11.800000 l f
1.000000 1.000000 1.000000 srgb
n -5.184400 11.246667 m -5.184400 13.146667 l 4.434000 13.146667 l 4.434000 11.246667 l f
0.100000 slw
[] 0 sd
[] 0 sd
0 slj
0.000000 0.000000 0.000000 srgb
n -5.184400 11.246667 m -5.184400 13.146667 l 4.434000 13.146667 l 4.434000 11.246667 l cp s
/Courier_e0 ff 0.800000 scf sf
( !"#$;/5#<2&2=$.) sw
2 div -0.375200 ex sub 12.393158 m ( !"#$;/5#<2&2=$.)
 gs 1 -1 sc sh gr
1.000000 1.000000 1.000000 srgb
n -6.794800 14.043333 m -6.794800 15.943333 l 4.434000 15.943333 l 4.434000 14.043333 l f
0.100000 slw
[] 0 sd
[] 0 sd
0 slj
0.000000 0.000000 0.000000 srgb
n -6.794800 14.043333 m -6.794800 15.943333 l 4.434000 15.943333 l 4.434000 14.043333 l cp s
/Courier_e0 ff 0.800000 scf sf
( !"#$>2*':$'<2&2=$.) sw
2 div -1.180400 ex sub 15.189825 m ( !"#$>2*':$'<2&2=$.)
 gs 1 -1 sc sh gr
1.000000 1.000000 1.000000 srgb
n -5.184400 16.840000 m -5.184400 18.740000 l 4.434000 18.740000 l 4.434000 16.840000 l f
0.100000 slw
[] 0 sd
[] 0 sd
0 slj
0.000000 0.000000 0.000000 srgb
n -5.184400 16.840000 m -5.184400 18.740000 l 4.434000 18.740000 l 4.434000 16.840000 l cp s
/Courier_e0 ff 0.800000 scf sf
( !"#$?$2@<2&2=$.) sw
2 div -0.375200 ex sub 17.986491 m ( !"#$?$2@<2&2=$.)
 gs 1 -1 sc sh gr
0.100000 slw
[] 0 sd
0 slj
0 slc
n 4.434000 12.196667 m 4.434000 12.450000 l 9.764800 12.450000 l 9.764800 6.050000 l s
0.100000 slw
[] 0 sd
0 slj
0 slc
n 4.434000 14.993333 m 4.434000 15.150000 l 9.764800 15.150000 l 9.764800 6.050000 l s
[] 0 sd
0 slj
0 slc
n 9.764800 6.050000 m 10.004800 6.750000 l 9.764800 7.450000 l 9.524800 6.750000 l f
0.100000 slw
[] 0 sd
0 slj
0 slc
n 4.434000 17.790000 m 4.434000 17.750000 l 9.764800 17.750000 l 9.764800 6.050000 l s
[] 0 sd
0 slj
0 slc
n 9.764800 6.050000 m 10.004800 6.750000 l 9.764800 7.450000 l 9.524800 6.750000 l f
1.000000 1.000000 1.000000 srgb
n 15.850000 20.620000 m 15.850000 22.520000 l 22.793200 22.520000 l 22.793200 20.620000 l f
0.100000 slw
[] 0 sd
[] 0 sd
0 slj
0.000000 0.000000 0.000000 srgb
n 15.850000 20.620000 m 15.850000 22.520000 l 22.793200 22.520000 l 22.793200 20.620000 l cp s
/Courier_e0 ff 0.800000 scf sf
( !"#$<$'1/3) sw
2 div 19.321600 ex sub 21.766491 m ( !"#$<$'1/3)
 gs 1 -1 sc sh gr
0.100000 slw
[] 0 sd
0 slj
0 slc
n 19.321600 17.050000 m 19.321600 19.850000 l 19.321600 19.850000 l 19.321600 20.620000 l s
/Courier_e0 ff 0.800000 scf sf
(A) sw
2 div 10.458353 ex sub 6.825000 m (A)
 gs 1 -1 sc sh gr
/Courier_e0 ff 0.800000 scf sf
(A) sw
2 div 4.858353 ex sub 12.225000 m (A)
 gs 1 -1 sc sh gr
/Courier_e0 ff 0.800000 scf sf
(A) sw
2 div 4.863153 ex sub 14.951491 m (A)
 gs 1 -1 sc sh gr
/Courier_e0 ff 0.800000 scf sf
(A) sw
2 div 4.895961 ex sub 17.551491 m (A)
 gs 1 -1 sc sh gr
/Courier_e0 ff 0.800000 scf sf
(BCC&) sw
2 div 20.430301 ex sub 8.975000 m (BCC&)
 gs 1 -1 sc sh gr
/Courier_e0 ff 0.800000 scf sf
(A) sw
2 div 13.730301 ex sub 6.825000 m (A)
 gs 1 -1 sc sh gr
/Courier_e0 ff 0.800000 scf sf
(BCC&) sw
2 div 20.430301 ex sub 14.925000 m (BCC&)
 gs 1 -1 sc sh gr
/Courier_e0 ff 0.800000 scf sf
(A) sw
2 div 20.030301 ex sub 11.925000 m (A)
 gs 1 -1 sc sh gr
/Courier_e0 ff 0.800000 scf sf
(BCCA) sw
2 div 20.474044 ex sub 17.775000 m (BCCA)
 gs 1 -1 sc sh gr
/Courier_e0 ff 0.800000 scf sf
(A) sw
2 div 19.779049 ex sub 20.425000 m (A)
 gs 1 -1 sc sh gr
showpage
