#FIG 3.2
Landscape
Center
Inches
Letter  
100.00
Single
-2
1200 2
0 32 #ffa00a
0 33 #cdcdcd
6 4200 1725 5625 3750
1 3 0 1 0 25 50 0 20 4.000 1 5.7596 5020 2376 586 586 5020 2376 5119 2953
1 3 0 1 0 11 45 0 20 4.000 1 5.7596 5020 2376 503 503 5020 2376 4989 2878
2 1 0 1 0 25 55 0 20 4.000 0 0 -1 0 0 5
	 4205 3638 4692 2793 4822 2868 4335 3713 4205 3638
-6
6 4200 1725 5625 3750
1 3 0 1 0 25 50 0 20 4.000 1 5.7596 5020 2376 586 586 5020 2376 5119 2953
1 3 0 1 0 11 45 0 20 4.000 1 5.7596 5020 2376 503 503 5020 2376 4989 2878
2 1 0 1 0 25 55 0 20 4.000 0 0 -1 0 0 5
	 4205 3638 4692 2793 4822 2868 4335 3713 4205 3638
-6
