(JNukeExitBlock (JNukeSchedule 
  (JNukeThreadSwitch (from_thread 0) (to_thread 0) (JNukeMethod "BufferWhile.main" (JNukeSignature "V" (JNukeVector "[Ljava/lang/String;"))) (pc 12) (line 7))
  (JNukeThreadSwitch (from_thread 0) (to_thread 0) (JNukeMethod "BufferWhile.main" (JNukeSignature "V" (JNukeVector "[Ljava/lang/String;"))) (pc 20) (line 8))
  (JNukeThreadSwitch (from_thread 0) (to_thread 0) (JNukeMethod "BufferWhile.main" (JNukeSignature "V" (JNukeVector "[Ljava/lang/String;"))) (pc 28) (line 9))
  (JNukeThreadSwitch (from_thread 0) (to_thread 1) (JNukeMethod "BufferWhile.main" (JNukeSignature "V" (JNukeVector "[Ljava/lang/String;"))) (pc 29) (line 10))
  (JNukeThreadSwitch (from_thread 1) (to_thread 1) (JNukeMethod "Producer2.run" (JNukeSignature "V" (JNukeVector))) (pc 4) (line 6))
  (JNukeThreadSwitch (from_thread 1) (to_thread 2) (JNukeMethod "java/lang/Thread.run" (JNukeSignature "V" (JNukeVector))) (pc 7) (line 57))
  (JNukeThreadSwitch (from_thread 2) (to_thread 3) (JNukeMethod "Buffer2.enq" (JNukeSignature "V" (JNukeVector "Ljava/lang/Object;"))) (pc 3) (line 11))
  (JNukeThreadSwitch (from_thread 3) (to_thread 3) (JNukeMethod "Consumer2.run" (JNukeSignature "V" (JNukeVector))) (pc 6) (line 7))
  (JNukeThreadSwitch (from_thread 3) (to_thread 2) (JNukeMethod "Buffer2.deq" (JNukeSignature "Ljava/lang/Object;" (JNukeVector))) (pc 3) (line 21))
  (JNukeThreadSwitch (from_thread 2) (to_thread 2) (JNukeMethod "Producer2.run" (JNukeSignature "V" (JNukeVector))) (pc 4) (line 6))
  (JNukeThreadSwitch (from_thread 2) (to_thread 3) (JNukeMethod "java/lang/Thread.run" (JNukeSignature "V" (JNukeVector))) (pc 7) (line 57))
)
)

(JNukeExitBlock (JNukeSchedule 
  (JNukeThreadSwitch (from_thread 0) (to_thread 0) (JNukeMethod "BufferWhile.main" (JNukeSignature "V" (JNukeVector "[Ljava/lang/String;"))) (pc 12) (line 7))
  (JNukeThreadSwitch (from_thread 0) (to_thread 0) (JNukeMethod "BufferWhile.main" (JNukeSignature "V" (JNukeVector "[Ljava/lang/String;"))) (pc 20) (line 8))
  (JNukeThreadSwitch (from_thread 0) (to_thread 0) (JNukeMethod "BufferWhile.main" (JNukeSignature "V" (JNukeVector "[Ljava/lang/String;"))) (pc 28) (line 9))
  (JNukeThreadSwitch (from_thread 0) (to_thread 1) (JNukeMethod "BufferWhile.main" (JNukeSignature "V" (JNukeVector "[Ljava/lang/String;"))) (pc 29) (line 10))
  (JNukeThreadSwitch (from_thread 1) (to_thread 1) (JNukeMethod "Producer2.run" (JNukeSignature "V" (JNukeVector))) (pc 4) (line 6))
  (JNukeThreadSwitch (from_thread 1) (to_thread 2) (JNukeMethod "java/lang/Thread.run" (JNukeSignature "V" (JNukeVector))) (pc 7) (line 57))
  (JNukeThreadSwitch (from_thread 2) (to_thread 3) (JNukeMethod "Buffer2.enq" (JNukeSignature "V" (JNukeVector "Ljava/lang/Object;"))) (pc 3) (line 11))
  (JNukeThreadSwitch (from_thread 3) (to_thread 2) (JNukeMethod "Consumer2.run" (JNukeSignature "V" (JNukeVector))) (pc 6) (line 7))
  (JNukeThreadSwitch (from_thread 2) (to_thread 2) (JNukeMethod "Producer2.run" (JNukeSignature "V" (JNukeVector))) (pc 4) (line 6))
  (JNukeThreadSwitch (from_thread 2) (to_thread 3) (JNukeMethod "java/lang/Thread.run" (JNukeSignature "V" (JNukeVector))) (pc 7) (line 57))
)
)

(JNukeExitBlock (JNukeSchedule 
  (JNukeThreadSwitch (from_thread 0) (to_thread 0) (JNukeMethod "BufferWhile.main" (JNukeSignature "V" (JNukeVector "[Ljava/lang/String;"))) (pc 12) (line 7))
  (JNukeThreadSwitch (from_thread 0) (to_thread 0) (JNukeMethod "BufferWhile.main" (JNukeSignature "V" (JNukeVector "[Ljava/lang/String;"))) (pc 20) (line 8))
  (JNukeThreadSwitch (from_thread 0) (to_thread 0) (JNukeMethod "BufferWhile.main" (JNukeSignature "V" (JNukeVector "[Ljava/lang/String;"))) (pc 28) (line 9))
  (JNukeThreadSwitch (from_thread 0) (to_thread 1) (JNukeMethod "BufferWhile.main" (JNukeSignature "V" (JNukeVector "[Ljava/lang/String;"))) (pc 29) (line 10))
  (JNukeThreadSwitch (from_thread 1) (to_thread 3) (JNukeMethod "Producer2.run" (JNukeSignature "V" (JNukeVector))) (pc 4) (line 6))
  (JNukeThreadSwitch (from_thread 3) (to_thread 3) (JNukeMethod "Consumer2.run" (JNukeSignature "V" (JNukeVector))) (pc 6) (line 7))
  (JNukeThreadSwitch (from_thread 3) (to_thread 2) (JNukeMethod "Buffer2.deq" (JNukeSignature "Ljava/lang/Object;" (JNukeVector))) (pc 3) (line 21))
  (JNukeThreadSwitch (from_thread 2) (to_thread 2) (JNukeMethod "Producer2.run" (JNukeSignature "V" (JNukeVector))) (pc 4) (line 6))
  (JNukeThreadSwitch (from_thread 2) (to_thread 3) (JNukeMethod "java/lang/Thread.run" (JNukeSignature "V" (JNukeVector))) (pc 7) (line 57))
  (JNukeThreadSwitch (from_thread 3) (to_thread 3) (JNukeMethod "Consumer2.run" (JNukeSignature "V" (JNukeVector))) (pc 6) (line 7))
)
)

(JNukeExitBlock (JNukeSchedule 
  (JNukeThreadSwitch (from_thread 0) (to_thread 0) (JNukeMethod "BufferWhile.main" (JNukeSignature "V" (JNukeVector "[Ljava/lang/String;"))) (pc 12) (line 7))
  (JNukeThreadSwitch (from_thread 0) (to_thread 0) (JNukeMethod "BufferWhile.main" (JNukeSignature "V" (JNukeVector "[Ljava/lang/String;"))) (pc 20) (line 8))
  (JNukeThreadSwitch (from_thread 0) (to_thread 0) (JNukeMethod "BufferWhile.main" (JNukeSignature "V" (JNukeVector "[Ljava/lang/String;"))) (pc 28) (line 9))
  (JNukeThreadSwitch (from_thread 0) (to_thread 1) (JNukeMethod "BufferWhile.main" (JNukeSignature "V" (JNukeVector "[Ljava/lang/String;"))) (pc 29) (line 10))
  (JNukeThreadSwitch (from_thread 1) (to_thread 3) (JNukeMethod "Producer2.run" (JNukeSignature "V" (JNukeVector))) (pc 4) (line 6))
  (JNukeThreadSwitch (from_thread 3) (to_thread 3) (JNukeMethod "Consumer2.run" (JNukeSignature "V" (JNukeVector))) (pc 6) (line 7))
  (JNukeThreadSwitch (from_thread 3) (to_thread 2) (JNukeMethod "Buffer2.deq" (JNukeSignature "Ljava/lang/Object;" (JNukeVector))) (pc 3) (line 21))
  (JNukeThreadSwitch (from_thread 2) (to_thread 3) (JNukeMethod "Producer2.run" (JNukeSignature "V" (JNukeVector))) (pc 4) (line 6))
  (JNukeThreadSwitch (from_thread 3) (to_thread 3) (JNukeMethod "Consumer2.run" (JNukeSignature "V" (JNukeVector))) (pc 6) (line 7))
)
)

(JNukeExitBlock (JNukeSchedule 
  (JNukeThreadSwitch (from_thread 0) (to_thread 0) (JNukeMethod "BufferWhile.main" (JNukeSignature "V" (JNukeVector "[Ljava/lang/String;"))) (pc 12) (line 7))
  (JNukeThreadSwitch (from_thread 0) (to_thread 0) (JNukeMethod "BufferWhile.main" (JNukeSignature "V" (JNukeVector "[Ljava/lang/String;"))) (pc 20) (line 8))
  (JNukeThreadSwitch (from_thread 0) (to_thread 0) (JNukeMethod "BufferWhile.main" (JNukeSignature "V" (JNukeVector "[Ljava/lang/String;"))) (pc 28) (line 9))
  (JNukeThreadSwitch (from_thread 0) (to_thread 1) (JNukeMethod "BufferWhile.main" (JNukeSignature "V" (JNukeVector "[Ljava/lang/String;"))) (pc 29) (line 10))
  (JNukeThreadSwitch (from_thread 1) (to_thread 3) (JNukeMethod "Producer2.run" (JNukeSignature "V" (JNukeVector))) (pc 4) (line 6))
  (JNukeThreadSwitch (from_thread 3) (to_thread 2) (JNukeMethod "Consumer2.run" (JNukeSignature "V" (JNukeVector))) (pc 6) (line 7))
  (JNukeThreadSwitch (from_thread 2) (to_thread 2) (JNukeMethod "Producer2.run" (JNukeSignature "V" (JNukeVector))) (pc 4) (line 6))
  (JNukeThreadSwitch (from_thread 2) (to_thread 3) (JNukeMethod "java/lang/Thread.run" (JNukeSignature "V" (JNukeVector))) (pc 7) (line 57))
  (JNukeThreadSwitch (from_thread 3) (to_thread 3) (JNukeMethod "Consumer2.run" (JNukeSignature "V" (JNukeVector))) (pc 6) (line 7))
)
)

(JNukeExitBlock (JNukeSchedule 
  (JNukeThreadSwitch (from_thread 0) (to_thread 0) (JNukeMethod "BufferWhile.main" (JNukeSignature "V" (JNukeVector "[Ljava/lang/String;"))) (pc 12) (line 7))
  (JNukeThreadSwitch (from_thread 0) (to_thread 0) (JNukeMethod "BufferWhile.main" (JNukeSignature "V" (JNukeVector "[Ljava/lang/String;"))) (pc 20) (line 8))
  (JNukeThreadSwitch (from_thread 0) (to_thread 0) (JNukeMethod "BufferWhile.main" (JNukeSignature "V" (JNukeVector "[Ljava/lang/String;"))) (pc 28) (line 9))
  (JNukeThreadSwitch (from_thread 0) (to_thread 1) (JNukeMethod "BufferWhile.main" (JNukeSignature "V" (JNukeVector "[Ljava/lang/String;"))) (pc 29) (line 10))
  (JNukeThreadSwitch (from_thread 1) (to_thread 3) (JNukeMethod "Producer2.run" (JNukeSignature "V" (JNukeVector))) (pc 4) (line 6))
  (JNukeThreadSwitch (from_thread 3) (to_thread 2) (JNukeMethod "Consumer2.run" (JNukeSignature "V" (JNukeVector))) (pc 6) (line 7))
  (JNukeThreadSwitch (from_thread 2) (to_thread 3) (JNukeMethod "Producer2.run" (JNukeSignature "V" (JNukeVector))) (pc 4) (line 6))
  (JNukeThreadSwitch (from_thread 3) (to_thread 3) (JNukeMethod "Consumer2.run" (JNukeSignature "V" (JNukeVector))) (pc 6) (line 7))
  (JNukeThreadSwitch (from_thread 3) (to_thread 2) (JNukeMethod "java/lang/Thread.run" (JNukeSignature "V" (JNukeVector))) (pc 7) (line 57))
)
)

(JNukeExitBlock (JNukeSchedule 
  (JNukeThreadSwitch (from_thread 0) (to_thread 0) (JNukeMethod "BufferWhile.main" (JNukeSignature "V" (JNukeVector "[Ljava/lang/String;"))) (pc 12) (line 7))
  (JNukeThreadSwitch (from_thread 0) (to_thread 0) (JNukeMethod "BufferWhile.main" (JNukeSignature "V" (JNukeVector "[Ljava/lang/String;"))) (pc 20) (line 8))
  (JNukeThreadSwitch (from_thread 0) (to_thread 0) (JNukeMethod "BufferWhile.main" (JNukeSignature "V" (JNukeVector "[Ljava/lang/String;"))) (pc 28) (line 9))
  (JNukeThreadSwitch (from_thread 0) (to_thread 1) (JNukeMethod "BufferWhile.main" (JNukeSignature "V" (JNukeVector "[Ljava/lang/String;"))) (pc 29) (line 10))
  (JNukeThreadSwitch (from_thread 1) (to_thread 2) (JNukeMethod "Producer2.run" (JNukeSignature "V" (JNukeVector))) (pc 4) (line 6))
  (JNukeThreadSwitch (from_thread 2) (to_thread 3) (JNukeMethod "Buffer2.enq" (JNukeSignature "V" (JNukeVector "Ljava/lang/Object;"))) (pc 3) (line 11))
  (JNukeThreadSwitch (from_thread 3) (to_thread 3) (JNukeMethod "Consumer2.run" (JNukeSignature "V" (JNukeVector))) (pc 6) (line 7))
)
)

(JNukeExitBlock (JNukeSchedule 
  (JNukeThreadSwitch (from_thread 0) (to_thread 0) (JNukeMethod "BufferWhile.main" (JNukeSignature "V" (JNukeVector "[Ljava/lang/String;"))) (pc 12) (line 7))
  (JNukeThreadSwitch (from_thread 0) (to_thread 0) (JNukeMethod "BufferWhile.main" (JNukeSignature "V" (JNukeVector "[Ljava/lang/String;"))) (pc 20) (line 8))
  (JNukeThreadSwitch (from_thread 0) (to_thread 3) (JNukeMethod "BufferWhile.main" (JNukeSignature "V" (JNukeVector "[Ljava/lang/String;"))) (pc 28) (line 9))
  (JNukeThreadSwitch (from_thread 3) (to_thread 1) (JNukeMethod "Buffer2.deq" (JNukeSignature "Ljava/lang/Object;" (JNukeVector))) (pc 3) (line 21))
  (JNukeThreadSwitch (from_thread 1) (to_thread 1) (JNukeMethod "Producer2.run" (JNukeSignature "V" (JNukeVector))) (pc 4) (line 6))
  (JNukeThreadSwitch (from_thread 1) (to_thread 2) (JNukeMethod "java/lang/Thread.run" (JNukeSignature "V" (JNukeVector))) (pc 7) (line 57))
  (JNukeThreadSwitch (from_thread 2) (to_thread 3) (JNukeMethod "Buffer2.enq" (JNukeSignature "V" (JNukeVector "Ljava/lang/Object;"))) (pc 3) (line 11))
  (JNukeThreadSwitch (from_thread 3) (to_thread 3) (JNukeMethod "Consumer2.run" (JNukeSignature "V" (JNukeVector))) (pc 6) (line 7))
  (JNukeThreadSwitch (from_thread 3) (to_thread 2) (JNukeMethod "Buffer2.deq" (JNukeSignature "Ljava/lang/Object;" (JNukeVector))) (pc 3) (line 21))
  (JNukeThreadSwitch (from_thread 2) (to_thread 2) (JNukeMethod "Producer2.run" (JNukeSignature "V" (JNukeVector))) (pc 4) (line 6))
  (JNukeThreadSwitch (from_thread 2) (to_thread 3) (JNukeMethod "java/lang/Thread.run" (JNukeSignature "V" (JNukeVector))) (pc 7) (line 57))
  (JNukeThreadSwitch (from_thread 3) (to_thread 3) (JNukeMethod "Consumer2.run" (JNukeSignature "V" (JNukeVector))) (pc 6) (line 7))
)
)

(JNukeExitBlock (JNukeSchedule 
  (JNukeThreadSwitch (from_thread 0) (to_thread 0) (JNukeMethod "BufferWhile.main" (JNukeSignature "V" (JNukeVector "[Ljava/lang/String;"))) (pc 12) (line 7))
  (JNukeThreadSwitch (from_thread 0) (to_thread 0) (JNukeMethod "BufferWhile.main" (JNukeSignature "V" (JNukeVector "[Ljava/lang/String;"))) (pc 20) (line 8))
  (JNukeThreadSwitch (from_thread 0) (to_thread 3) (JNukeMethod "BufferWhile.main" (JNukeSignature "V" (JNukeVector "[Ljava/lang/String;"))) (pc 28) (line 9))
  (JNukeThreadSwitch (from_thread 3) (to_thread 1) (JNukeMethod "Buffer2.deq" (JNukeSignature "Ljava/lang/Object;" (JNukeVector))) (pc 3) (line 21))
  (JNukeThreadSwitch (from_thread 1) (to_thread 1) (JNukeMethod "Producer2.run" (JNukeSignature "V" (JNukeVector))) (pc 4) (line 6))
  (JNukeThreadSwitch (from_thread 1) (to_thread 2) (JNukeMethod "java/lang/Thread.run" (JNukeSignature "V" (JNukeVector))) (pc 7) (line 57))
  (JNukeThreadSwitch (from_thread 2) (to_thread 3) (JNukeMethod "Buffer2.enq" (JNukeSignature "V" (JNukeVector "Ljava/lang/Object;"))) (pc 3) (line 11))
  (JNukeThreadSwitch (from_thread 3) (to_thread 3) (JNukeMethod "Consumer2.run" (JNukeSignature "V" (JNukeVector))) (pc 6) (line 7))
  (JNukeThreadSwitch (from_thread 3) (to_thread 2) (JNukeMethod "Buffer2.deq" (JNukeSignature "Ljava/lang/Object;" (JNukeVector))) (pc 3) (line 21))
  (JNukeThreadSwitch (from_thread 2) (to_thread 3) (JNukeMethod "Producer2.run" (JNukeSignature "V" (JNukeVector))) (pc 4) (line 6))
  (JNukeThreadSwitch (from_thread 3) (to_thread 3) (JNukeMethod "Consumer2.run" (JNukeSignature "V" (JNukeVector))) (pc 6) (line 7))
)
)

(JNukeExitBlock (JNukeSchedule 
  (JNukeThreadSwitch (from_thread 0) (to_thread 0) (JNukeMethod "BufferWhile.main" (JNukeSignature "V" (JNukeVector "[Ljava/lang/String;"))) (pc 12) (line 7))
  (JNukeThreadSwitch (from_thread 0) (to_thread 0) (JNukeMethod "BufferWhile.main" (JNukeSignature "V" (JNukeVector "[Ljava/lang/String;"))) (pc 20) (line 8))
  (JNukeThreadSwitch (from_thread 0) (to_thread 3) (JNukeMethod "BufferWhile.main" (JNukeSignature "V" (JNukeVector "[Ljava/lang/String;"))) (pc 28) (line 9))
  (JNukeThreadSwitch (from_thread 3) (to_thread 1) (JNukeMethod "Buffer2.deq" (JNukeSignature "Ljava/lang/Object;" (JNukeVector))) (pc 3) (line 21))
  (JNukeThreadSwitch (from_thread 1) (to_thread 1) (JNukeMethod "Producer2.run" (JNukeSignature "V" (JNukeVector))) (pc 4) (line 6))
  (JNukeThreadSwitch (from_thread 1) (to_thread 2) (JNukeMethod "java/lang/Thread.run" (JNukeSignature "V" (JNukeVector))) (pc 7) (line 57))
  (JNukeThreadSwitch (from_thread 2) (to_thread 3) (JNukeMethod "Buffer2.enq" (JNukeSignature "V" (JNukeVector "Ljava/lang/Object;"))) (pc 3) (line 11))
  (JNukeThreadSwitch (from_thread 3) (to_thread 2) (JNukeMethod "Consumer2.run" (JNukeSignature "V" (JNukeVector))) (pc 6) (line 7))
  (JNukeThreadSwitch (from_thread 2) (to_thread 2) (JNukeMethod "Producer2.run" (JNukeSignature "V" (JNukeVector))) (pc 4) (line 6))
  (JNukeThreadSwitch (from_thread 2) (to_thread 3) (JNukeMethod "java/lang/Thread.run" (JNukeSignature "V" (JNukeVector))) (pc 7) (line 57))
  (JNukeThreadSwitch (from_thread 3) (to_thread 3) (JNukeMethod "Consumer2.run" (JNukeSignature "V" (JNukeVector))) (pc 6) (line 7))
)
)

(JNukeExitBlock (JNukeSchedule 
  (JNukeThreadSwitch (from_thread 0) (to_thread 0) (JNukeMethod "BufferWhile.main" (JNukeSignature "V" (JNukeVector "[Ljava/lang/String;"))) (pc 12) (line 7))
  (JNukeThreadSwitch (from_thread 0) (to_thread 0) (JNukeMethod "BufferWhile.main" (JNukeSignature "V" (JNukeVector "[Ljava/lang/String;"))) (pc 20) (line 8))
  (JNukeThreadSwitch (from_thread 0) (to_thread 3) (JNukeMethod "BufferWhile.main" (JNukeSignature "V" (JNukeVector "[Ljava/lang/String;"))) (pc 28) (line 9))
  (JNukeThreadSwitch (from_thread 3) (to_thread 1) (JNukeMethod "Buffer2.deq" (JNukeSignature "Ljava/lang/Object;" (JNukeVector))) (pc 3) (line 21))
  (JNukeThreadSwitch (from_thread 1) (to_thread 1) (JNukeMethod "Producer2.run" (JNukeSignature "V" (JNukeVector))) (pc 4) (line 6))
  (JNukeThreadSwitch (from_thread 1) (to_thread 2) (JNukeMethod "java/lang/Thread.run" (JNukeSignature "V" (JNukeVector))) (pc 7) (line 57))
  (JNukeThreadSwitch (from_thread 2) (to_thread 3) (JNukeMethod "Buffer2.enq" (JNukeSignature "V" (JNukeVector "Ljava/lang/Object;"))) (pc 3) (line 11))
  (JNukeThreadSwitch (from_thread 3) (to_thread 2) (JNukeMethod "Consumer2.run" (JNukeSignature "V" (JNukeVector))) (pc 6) (line 7))
  (JNukeThreadSwitch (from_thread 2) (to_thread 3) (JNukeMethod "Producer2.run" (JNukeSignature "V" (JNukeVector))) (pc 4) (line 6))
  (JNukeThreadSwitch (from_thread 3) (to_thread 3) (JNukeMethod "Consumer2.run" (JNukeSignature "V" (JNukeVector))) (pc 6) (line 7))
  (JNukeThreadSwitch (from_thread 3) (to_thread 2) (JNukeMethod "java/lang/Thread.run" (JNukeSignature "V" (JNukeVector))) (pc 7) (line 57))
)
)

(JNukeExitBlock (JNukeSchedule 
  (JNukeThreadSwitch (from_thread 0) (to_thread 0) (JNukeMethod "BufferWhile.main" (JNukeSignature "V" (JNukeVector "[Ljava/lang/String;"))) (pc 12) (line 7))
  (JNukeThreadSwitch (from_thread 0) (to_thread 0) (JNukeMethod "BufferWhile.main" (JNukeSignature "V" (JNukeVector "[Ljava/lang/String;"))) (pc 20) (line 8))
  (JNukeThreadSwitch (from_thread 0) (to_thread 3) (JNukeMethod "BufferWhile.main" (JNukeSignature "V" (JNukeVector "[Ljava/lang/String;"))) (pc 28) (line 9))
  (JNukeThreadSwitch (from_thread 3) (to_thread 1) (JNukeMethod "Buffer2.deq" (JNukeSignature "Ljava/lang/Object;" (JNukeVector))) (pc 3) (line 21))
  (JNukeThreadSwitch (from_thread 1) (to_thread 3) (JNukeMethod "Producer2.run" (JNukeSignature "V" (JNukeVector))) (pc 4) (line 6))
  (JNukeThreadSwitch (from_thread 3) (to_thread 3) (JNukeMethod "Consumer2.run" (JNukeSignature "V" (JNukeVector))) (pc 6) (line 7))
  (JNukeThreadSwitch (from_thread 3) (to_thread 2) (JNukeMethod "Buffer2.deq" (JNukeSignature "Ljava/lang/Object;" (JNukeVector))) (pc 3) (line 21))
  (JNukeThreadSwitch (from_thread 2) (to_thread 2) (JNukeMethod "Producer2.run" (JNukeSignature "V" (JNukeVector))) (pc 4) (line 6))
  (JNukeThreadSwitch (from_thread 2) (to_thread 3) (JNukeMethod "java/lang/Thread.run" (JNukeSignature "V" (JNukeVector))) (pc 7) (line 57))
  (JNukeThreadSwitch (from_thread 3) (to_thread 3) (JNukeMethod "Consumer2.run" (JNukeSignature "V" (JNukeVector))) (pc 6) (line 7))
)
)

(JNukeExitBlock (JNukeSchedule 
  (JNukeThreadSwitch (from_thread 0) (to_thread 0) (JNukeMethod "BufferWhile.main" (JNukeSignature "V" (JNukeVector "[Ljava/lang/String;"))) (pc 12) (line 7))
  (JNukeThreadSwitch (from_thread 0) (to_thread 0) (JNukeMethod "BufferWhile.main" (JNukeSignature "V" (JNukeVector "[Ljava/lang/String;"))) (pc 20) (line 8))
  (JNukeThreadSwitch (from_thread 0) (to_thread 3) (JNukeMethod "BufferWhile.main" (JNukeSignature "V" (JNukeVector "[Ljava/lang/String;"))) (pc 28) (line 9))
  (JNukeThreadSwitch (from_thread 3) (to_thread 1) (JNukeMethod "Buffer2.deq" (JNukeSignature "Ljava/lang/Object;" (JNukeVector))) (pc 3) (line 21))
  (JNukeThreadSwitch (from_thread 1) (to_thread 3) (JNukeMethod "Producer2.run" (JNukeSignature "V" (JNukeVector))) (pc 4) (line 6))
  (JNukeThreadSwitch (from_thread 3) (to_thread 3) (JNukeMethod "Consumer2.run" (JNukeSignature "V" (JNukeVector))) (pc 6) (line 7))
  (JNukeThreadSwitch (from_thread 3) (to_thread 2) (JNukeMethod "Buffer2.deq" (JNukeSignature "Ljava/lang/Object;" (JNukeVector))) (pc 3) (line 21))
  (JNukeThreadSwitch (from_thread 2) (to_thread 3) (JNukeMethod "Producer2.run" (JNukeSignature "V" (JNukeVector))) (pc 4) (line 6))
  (JNukeThreadSwitch (from_thread 3) (to_thread 3) (JNukeMethod "Consumer2.run" (JNukeSignature "V" (JNukeVector))) (pc 6) (line 7))
)
)

(JNukeExitBlock (JNukeSchedule 
  (JNukeThreadSwitch (from_thread 0) (to_thread 0) (JNukeMethod "BufferWhile.main" (JNukeSignature "V" (JNukeVector "[Ljava/lang/String;"))) (pc 12) (line 7))
  (JNukeThreadSwitch (from_thread 0) (to_thread 0) (JNukeMethod "BufferWhile.main" (JNukeSignature "V" (JNukeVector "[Ljava/lang/String;"))) (pc 20) (line 8))
  (JNukeThreadSwitch (from_thread 0) (to_thread 3) (JNukeMethod "BufferWhile.main" (JNukeSignature "V" (JNukeVector "[Ljava/lang/String;"))) (pc 28) (line 9))
  (JNukeThreadSwitch (from_thread 3) (to_thread 1) (JNukeMethod "Buffer2.deq" (JNukeSignature "Ljava/lang/Object;" (JNukeVector))) (pc 3) (line 21))
  (JNukeThreadSwitch (from_thread 1) (to_thread 3) (JNukeMethod "Producer2.run" (JNukeSignature "V" (JNukeVector))) (pc 4) (line 6))
  (JNukeThreadSwitch (from_thread 3) (to_thread 2) (JNukeMethod "Consumer2.run" (JNukeSignature "V" (JNukeVector))) (pc 6) (line 7))
  (JNukeThreadSwitch (from_thread 2) (to_thread 2) (JNukeMethod "Producer2.run" (JNukeSignature "V" (JNukeVector))) (pc 4) (line 6))
  (JNukeThreadSwitch (from_thread 2) (to_thread 3) (JNukeMethod "java/lang/Thread.run" (JNukeSignature "V" (JNukeVector))) (pc 7) (line 57))
  (JNukeThreadSwitch (from_thread 3) (to_thread 3) (JNukeMethod "Consumer2.run" (JNukeSignature "V" (JNukeVector))) (pc 6) (line 7))
)
)

(JNukeExitBlock (JNukeSchedule 
  (JNukeThreadSwitch (from_thread 0) (to_thread 0) (JNukeMethod "BufferWhile.main" (JNukeSignature "V" (JNukeVector "[Ljava/lang/String;"))) (pc 12) (line 7))
  (JNukeThreadSwitch (from_thread 0) (to_thread 0) (JNukeMethod "BufferWhile.main" (JNukeSignature "V" (JNukeVector "[Ljava/lang/String;"))) (pc 20) (line 8))
  (JNukeThreadSwitch (from_thread 0) (to_thread 3) (JNukeMethod "BufferWhile.main" (JNukeSignature "V" (JNukeVector "[Ljava/lang/String;"))) (pc 28) (line 9))
  (JNukeThreadSwitch (from_thread 3) (to_thread 1) (JNukeMethod "Buffer2.deq" (JNukeSignature "Ljava/lang/Object;" (JNukeVector))) (pc 3) (line 21))
  (JNukeThreadSwitch (from_thread 1) (to_thread 3) (JNukeMethod "Producer2.run" (JNukeSignature "V" (JNukeVector))) (pc 4) (line 6))
  (JNukeThreadSwitch (from_thread 3) (to_thread 2) (JNukeMethod "Consumer2.run" (JNukeSignature "V" (JNukeVector))) (pc 6) (line 7))
  (JNukeThreadSwitch (from_thread 2) (to_thread 3) (JNukeMethod "Producer2.run" (JNukeSignature "V" (JNukeVector))) (pc 4) (line 6))
  (JNukeThreadSwitch (from_thread 3) (to_thread 3) (JNukeMethod "Consumer2.run" (JNukeSignature "V" (JNukeVector))) (pc 6) (line 7))
  (JNukeThreadSwitch (from_thread 3) (to_thread 2) (JNukeMethod "java/lang/Thread.run" (JNukeSignature "V" (JNukeVector))) (pc 7) (line 57))
)
)

(JNukeExitBlock (JNukeSchedule 
  (JNukeThreadSwitch (from_thread 0) (to_thread 0) (JNukeMethod "BufferWhile.main" (JNukeSignature "V" (JNukeVector "[Ljava/lang/String;"))) (pc 12) (line 7))
  (JNukeThreadSwitch (from_thread 0) (to_thread 0) (JNukeMethod "BufferWhile.main" (JNukeSignature "V" (JNukeVector "[Ljava/lang/String;"))) (pc 20) (line 8))
  (JNukeThreadSwitch (from_thread 0) (to_thread 3) (JNukeMethod "BufferWhile.main" (JNukeSignature "V" (JNukeVector "[Ljava/lang/String;"))) (pc 28) (line 9))
  (JNukeThreadSwitch (from_thread 3) (to_thread 1) (JNukeMethod "Buffer2.deq" (JNukeSignature "Ljava/lang/Object;" (JNukeVector))) (pc 3) (line 21))
  (JNukeThreadSwitch (from_thread 1) (to_thread 2) (JNukeMethod "Producer2.run" (JNukeSignature "V" (JNukeVector))) (pc 4) (line 6))
  (JNukeThreadSwitch (from_thread 2) (to_thread 3) (JNukeMethod "Buffer2.enq" (JNukeSignature "V" (JNukeVector "Ljava/lang/Object;"))) (pc 3) (line 11))
  (JNukeThreadSwitch (from_thread 3) (to_thread 3) (JNukeMethod "Consumer2.run" (JNukeSignature "V" (JNukeVector))) (pc 6) (line 7))
)
)

(JNukeExitBlock (JNukeSchedule 
  (JNukeThreadSwitch (from_thread 0) (to_thread 0) (JNukeMethod "BufferWhile.main" (JNukeSignature "V" (JNukeVector "[Ljava/lang/String;"))) (pc 12) (line 7))
  (JNukeThreadSwitch (from_thread 0) (to_thread 0) (JNukeMethod "BufferWhile.main" (JNukeSignature "V" (JNukeVector "[Ljava/lang/String;"))) (pc 20) (line 8))
  (JNukeThreadSwitch (from_thread 0) (to_thread 2) (JNukeMethod "BufferWhile.main" (JNukeSignature "V" (JNukeVector "[Ljava/lang/String;"))) (pc 28) (line 9))
  (JNukeThreadSwitch (from_thread 2) (to_thread 2) (JNukeMethod "Producer2.run" (JNukeSignature "V" (JNukeVector))) (pc 4) (line 6))
  (JNukeThreadSwitch (from_thread 2) (to_thread 3) (JNukeMethod "java/lang/Thread.run" (JNukeSignature "V" (JNukeVector))) (pc 7) (line 57))
  (JNukeThreadSwitch (from_thread 3) (to_thread 3) (JNukeMethod "Consumer2.run" (JNukeSignature "V" (JNukeVector))) (pc 6) (line 7))
  (JNukeThreadSwitch (from_thread 3) (to_thread 1) (JNukeMethod "Buffer2.deq" (JNukeSignature "Ljava/lang/Object;" (JNukeVector))) (pc 3) (line 21))
  (JNukeThreadSwitch (from_thread 1) (to_thread 1) (JNukeMethod "Producer2.run" (JNukeSignature "V" (JNukeVector))) (pc 4) (line 6))
  (JNukeThreadSwitch (from_thread 1) (to_thread 3) (JNukeMethod "java/lang/Thread.run" (JNukeSignature "V" (JNukeVector))) (pc 7) (line 57))
  (JNukeThreadSwitch (from_thread 3) (to_thread 3) (JNukeMethod "Consumer2.run" (JNukeSignature "V" (JNukeVector))) (pc 6) (line 7))
)
)

(JNukeExitBlock (JNukeSchedule 
  (JNukeThreadSwitch (from_thread 0) (to_thread 0) (JNukeMethod "BufferWhile.main" (JNukeSignature "V" (JNukeVector "[Ljava/lang/String;"))) (pc 12) (line 7))
  (JNukeThreadSwitch (from_thread 0) (to_thread 0) (JNukeMethod "BufferWhile.main" (JNukeSignature "V" (JNukeVector "[Ljava/lang/String;"))) (pc 20) (line 8))
  (JNukeThreadSwitch (from_thread 0) (to_thread 2) (JNukeMethod "BufferWhile.main" (JNukeSignature "V" (JNukeVector "[Ljava/lang/String;"))) (pc 28) (line 9))
  (JNukeThreadSwitch (from_thread 2) (to_thread 2) (JNukeMethod "Producer2.run" (JNukeSignature "V" (JNukeVector))) (pc 4) (line 6))
  (JNukeThreadSwitch (from_thread 2) (to_thread 3) (JNukeMethod "java/lang/Thread.run" (JNukeSignature "V" (JNukeVector))) (pc 7) (line 57))
  (JNukeThreadSwitch (from_thread 3) (to_thread 3) (JNukeMethod "Consumer2.run" (JNukeSignature "V" (JNukeVector))) (pc 6) (line 7))
  (JNukeThreadSwitch (from_thread 3) (to_thread 1) (JNukeMethod "Buffer2.deq" (JNukeSignature "Ljava/lang/Object;" (JNukeVector))) (pc 3) (line 21))
  (JNukeThreadSwitch (from_thread 1) (to_thread 3) (JNukeMethod "Producer2.run" (JNukeSignature "V" (JNukeVector))) (pc 4) (line 6))
  (JNukeThreadSwitch (from_thread 3) (to_thread 3) (JNukeMethod "Consumer2.run" (JNukeSignature "V" (JNukeVector))) (pc 6) (line 7))
)
)

(JNukeExitBlock (JNukeSchedule 
  (JNukeThreadSwitch (from_thread 0) (to_thread 0) (JNukeMethod "BufferWhile.main" (JNukeSignature "V" (JNukeVector "[Ljava/lang/String;"))) (pc 12) (line 7))
  (JNukeThreadSwitch (from_thread 0) (to_thread 0) (JNukeMethod "BufferWhile.main" (JNukeSignature "V" (JNukeVector "[Ljava/lang/String;"))) (pc 20) (line 8))
  (JNukeThreadSwitch (from_thread 0) (to_thread 2) (JNukeMethod "BufferWhile.main" (JNukeSignature "V" (JNukeVector "[Ljava/lang/String;"))) (pc 28) (line 9))
  (JNukeThreadSwitch (from_thread 2) (to_thread 2) (JNukeMethod "Producer2.run" (JNukeSignature "V" (JNukeVector))) (pc 4) (line 6))
  (JNukeThreadSwitch (from_thread 2) (to_thread 3) (JNukeMethod "java/lang/Thread.run" (JNukeSignature "V" (JNukeVector))) (pc 7) (line 57))
  (JNukeThreadSwitch (from_thread 3) (to_thread 1) (JNukeMethod "Consumer2.run" (JNukeSignature "V" (JNukeVector))) (pc 6) (line 7))
  (JNukeThreadSwitch (from_thread 1) (to_thread 1) (JNukeMethod "Producer2.run" (JNukeSignature "V" (JNukeVector))) (pc 4) (line 6))
  (JNukeThreadSwitch (from_thread 1) (to_thread 3) (JNukeMethod "java/lang/Thread.run" (JNukeSignature "V" (JNukeVector))) (pc 7) (line 57))
  (JNukeThreadSwitch (from_thread 3) (to_thread 3) (JNukeMethod "Consumer2.run" (JNukeSignature "V" (JNukeVector))) (pc 6) (line 7))
)
)

(JNukeExitBlock (JNukeSchedule 
  (JNukeThreadSwitch (from_thread 0) (to_thread 0) (JNukeMethod "BufferWhile.main" (JNukeSignature "V" (JNukeVector "[Ljava/lang/String;"))) (pc 12) (line 7))
  (JNukeThreadSwitch (from_thread 0) (to_thread 0) (JNukeMethod "BufferWhile.main" (JNukeSignature "V" (JNukeVector "[Ljava/lang/String;"))) (pc 20) (line 8))
  (JNukeThreadSwitch (from_thread 0) (to_thread 2) (JNukeMethod "BufferWhile.main" (JNukeSignature "V" (JNukeVector "[Ljava/lang/String;"))) (pc 28) (line 9))
  (JNukeThreadSwitch (from_thread 2) (to_thread 2) (JNukeMethod "Producer2.run" (JNukeSignature "V" (JNukeVector))) (pc 4) (line 6))
  (JNukeThreadSwitch (from_thread 2) (to_thread 3) (JNukeMethod "java/lang/Thread.run" (JNukeSignature "V" (JNukeVector))) (pc 7) (line 57))
  (JNukeThreadSwitch (from_thread 3) (to_thread 1) (JNukeMethod "Consumer2.run" (JNukeSignature "V" (JNukeVector))) (pc 6) (line 7))
  (JNukeThreadSwitch (from_thread 1) (to_thread 3) (JNukeMethod "Producer2.run" (JNukeSignature "V" (JNukeVector))) (pc 4) (line 6))
  (JNukeThreadSwitch (from_thread 3) (to_thread 3) (JNukeMethod "Consumer2.run" (JNukeSignature "V" (JNukeVector))) (pc 6) (line 7))
  (JNukeThreadSwitch (from_thread 3) (to_thread 1) (JNukeMethod "java/lang/Thread.run" (JNukeSignature "V" (JNukeVector))) (pc 7) (line 57))
)
)

(JNukeExitBlock (JNukeSchedule 
  (JNukeThreadSwitch (from_thread 0) (to_thread 0) (JNukeMethod "BufferWhile.main" (JNukeSignature "V" (JNukeVector "[Ljava/lang/String;"))) (pc 12) (line 7))
  (JNukeThreadSwitch (from_thread 0) (to_thread 0) (JNukeMethod "BufferWhile.main" (JNukeSignature "V" (JNukeVector "[Ljava/lang/String;"))) (pc 20) (line 8))
  (JNukeThreadSwitch (from_thread 0) (to_thread 2) (JNukeMethod "BufferWhile.main" (JNukeSignature "V" (JNukeVector "[Ljava/lang/String;"))) (pc 28) (line 9))
  (JNukeThreadSwitch (from_thread 2) (to_thread 3) (JNukeMethod "Producer2.run" (JNukeSignature "V" (JNukeVector))) (pc 4) (line 6))
  (JNukeThreadSwitch (from_thread 3) (to_thread 3) (JNukeMethod "Consumer2.run" (JNukeSignature "V" (JNukeVector))) (pc 6) (line 7))
  (JNukeThreadSwitch (from_thread 3) (to_thread 1) (JNukeMethod "Buffer2.deq" (JNukeSignature "Ljava/lang/Object;" (JNukeVector))) (pc 3) (line 21))
  (JNukeThreadSwitch (from_thread 1) (to_thread 1) (JNukeMethod "Producer2.run" (JNukeSignature "V" (JNukeVector))) (pc 4) (line 6))
  (JNukeThreadSwitch (from_thread 1) (to_thread 2) (JNukeMethod "java/lang/Thread.run" (JNukeSignature "V" (JNukeVector))) (pc 7) (line 57))
  (JNukeThreadSwitch (from_thread 2) (to_thread 3) (JNukeMethod "java/lang/Thread.run" (JNukeSignature "V" (JNukeVector))) (pc 7) (line 57))
  (JNukeThreadSwitch (from_thread 3) (to_thread 3) (JNukeMethod "Consumer2.run" (JNukeSignature "V" (JNukeVector))) (pc 6) (line 7))
)
)

(JNukeExitBlock (JNukeSchedule 
  (JNukeThreadSwitch (from_thread 0) (to_thread 0) (JNukeMethod "BufferWhile.main" (JNukeSignature "V" (JNukeVector "[Ljava/lang/String;"))) (pc 12) (line 7))
  (JNukeThreadSwitch (from_thread 0) (to_thread 0) (JNukeMethod "BufferWhile.main" (JNukeSignature "V" (JNukeVector "[Ljava/lang/String;"))) (pc 20) (line 8))
  (JNukeThreadSwitch (from_thread 0) (to_thread 2) (JNukeMethod "BufferWhile.main" (JNukeSignature "V" (JNukeVector "[Ljava/lang/String;"))) (pc 28) (line 9))
  (JNukeThreadSwitch (from_thread 2) (to_thread 3) (JNukeMethod "Producer2.run" (JNukeSignature "V" (JNukeVector))) (pc 4) (line 6))
  (JNukeThreadSwitch (from_thread 3) (to_thread 3) (JNukeMethod "Consumer2.run" (JNukeSignature "V" (JNukeVector))) (pc 6) (line 7))
  (JNukeThreadSwitch (from_thread 3) (to_thread 1) (JNukeMethod "Buffer2.deq" (JNukeSignature "Ljava/lang/Object;" (JNukeVector))) (pc 3) (line 21))
  (JNukeThreadSwitch (from_thread 1) (to_thread 3) (JNukeMethod "Producer2.run" (JNukeSignature "V" (JNukeVector))) (pc 4) (line 6))
  (JNukeThreadSwitch (from_thread 3) (to_thread 3) (JNukeMethod "Consumer2.run" (JNukeSignature "V" (JNukeVector))) (pc 6) (line 7))
)
)

(JNukeExitBlock (JNukeSchedule 
  (JNukeThreadSwitch (from_thread 0) (to_thread 0) (JNukeMethod "BufferWhile.main" (JNukeSignature "V" (JNukeVector "[Ljava/lang/String;"))) (pc 12) (line 7))
  (JNukeThreadSwitch (from_thread 0) (to_thread 0) (JNukeMethod "BufferWhile.main" (JNukeSignature "V" (JNukeVector "[Ljava/lang/String;"))) (pc 20) (line 8))
  (JNukeThreadSwitch (from_thread 0) (to_thread 2) (JNukeMethod "BufferWhile.main" (JNukeSignature "V" (JNukeVector "[Ljava/lang/String;"))) (pc 28) (line 9))
  (JNukeThreadSwitch (from_thread 2) (to_thread 3) (JNukeMethod "Producer2.run" (JNukeSignature "V" (JNukeVector))) (pc 4) (line 6))
  (JNukeThreadSwitch (from_thread 3) (to_thread 2) (JNukeMethod "Consumer2.run" (JNukeSignature "V" (JNukeVector))) (pc 6) (line 7))
)
)

(JNukeExitBlock (JNukeSchedule 
  (JNukeThreadSwitch (from_thread 0) (to_thread 0) (JNukeMethod "BufferWhile.main" (JNukeSignature "V" (JNukeVector "[Ljava/lang/String;"))) (pc 12) (line 7))
  (JNukeThreadSwitch (from_thread 0) (to_thread 0) (JNukeMethod "BufferWhile.main" (JNukeSignature "V" (JNukeVector "[Ljava/lang/String;"))) (pc 20) (line 8))
  (JNukeThreadSwitch (from_thread 0) (to_thread 2) (JNukeMethod "BufferWhile.main" (JNukeSignature "V" (JNukeVector "[Ljava/lang/String;"))) (pc 28) (line 9))
  (JNukeThreadSwitch (from_thread 2) (to_thread 3) (JNukeMethod "Producer2.run" (JNukeSignature "V" (JNukeVector))) (pc 4) (line 6))
  (JNukeThreadSwitch (from_thread 3) (to_thread 1) (JNukeMethod "Consumer2.run" (JNukeSignature "V" (JNukeVector))) (pc 6) (line 7))
  (JNukeThreadSwitch (from_thread 1) (to_thread 1) (JNukeMethod "Producer2.run" (JNukeSignature "V" (JNukeVector))) (pc 4) (line 6))
)
)

(JNukeExitBlock (JNukeSchedule 
  (JNukeThreadSwitch (from_thread 0) (to_thread 0) (JNukeMethod "BufferWhile.main" (JNukeSignature "V" (JNukeVector "[Ljava/lang/String;"))) (pc 12) (line 7))
  (JNukeThreadSwitch (from_thread 0) (to_thread 0) (JNukeMethod "BufferWhile.main" (JNukeSignature "V" (JNukeVector "[Ljava/lang/String;"))) (pc 20) (line 8))
  (JNukeThreadSwitch (from_thread 0) (to_thread 2) (JNukeMethod "BufferWhile.main" (JNukeSignature "V" (JNukeVector "[Ljava/lang/String;"))) (pc 28) (line 9))
  (JNukeThreadSwitch (from_thread 2) (to_thread 1) (JNukeMethod "Producer2.run" (JNukeSignature "V" (JNukeVector))) (pc 4) (line 6))
  (JNukeThreadSwitch (from_thread 1) (to_thread 3) (JNukeMethod "Buffer2.enq" (JNukeSignature "V" (JNukeVector "Ljava/lang/Object;"))) (pc 3) (line 11))
  (JNukeThreadSwitch (from_thread 3) (to_thread 3) (JNukeMethod "Consumer2.run" (JNukeSignature "V" (JNukeVector))) (pc 6) (line 7))
  (JNukeThreadSwitch (from_thread 3) (to_thread 1) (JNukeMethod "Buffer2.deq" (JNukeSignature "Ljava/lang/Object;" (JNukeVector))) (pc 3) (line 21))
  (JNukeThreadSwitch (from_thread 1) (to_thread 1) (JNukeMethod "Producer2.run" (JNukeSignature "V" (JNukeVector))) (pc 4) (line 6))
  (JNukeThreadSwitch (from_thread 1) (to_thread 3) (JNukeMethod "java/lang/Thread.run" (JNukeSignature "V" (JNukeVector))) (pc 7) (line 57))
  (JNukeThreadSwitch (from_thread 3) (to_thread 3) (JNukeMethod "Consumer2.run" (JNukeSignature "V" (JNukeVector))) (pc 6) (line 7))
)
)

(JNukeExitBlock (JNukeSchedule 
  (JNukeThreadSwitch (from_thread 0) (to_thread 0) (JNukeMethod "BufferWhile.main" (JNukeSignature "V" (JNukeVector "[Ljava/lang/String;"))) (pc 12) (line 7))
  (JNukeThreadSwitch (from_thread 0) (to_thread 0) (JNukeMethod "BufferWhile.main" (JNukeSignature "V" (JNukeVector "[Ljava/lang/String;"))) (pc 20) (line 8))
  (JNukeThreadSwitch (from_thread 0) (to_thread 2) (JNukeMethod "BufferWhile.main" (JNukeSignature "V" (JNukeVector "[Ljava/lang/String;"))) (pc 28) (line 9))
  (JNukeThreadSwitch (from_thread 2) (to_thread 1) (JNukeMethod "Producer2.run" (JNukeSignature "V" (JNukeVector))) (pc 4) (line 6))
  (JNukeThreadSwitch (from_thread 1) (to_thread 3) (JNukeMethod "Buffer2.enq" (JNukeSignature "V" (JNukeVector "Ljava/lang/Object;"))) (pc 3) (line 11))
  (JNukeThreadSwitch (from_thread 3) (to_thread 3) (JNukeMethod "Consumer2.run" (JNukeSignature "V" (JNukeVector))) (pc 6) (line 7))
  (JNukeThreadSwitch (from_thread 3) (to_thread 1) (JNukeMethod "Buffer2.deq" (JNukeSignature "Ljava/lang/Object;" (JNukeVector))) (pc 3) (line 21))
  (JNukeThreadSwitch (from_thread 1) (to_thread 3) (JNukeMethod "Producer2.run" (JNukeSignature "V" (JNukeVector))) (pc 4) (line 6))
  (JNukeThreadSwitch (from_thread 3) (to_thread 3) (JNukeMethod "Consumer2.run" (JNukeSignature "V" (JNukeVector))) (pc 6) (line 7))
)
)

(JNukeExitBlock (JNukeSchedule 
  (JNukeThreadSwitch (from_thread 0) (to_thread 0) (JNukeMethod "BufferWhile.main" (JNukeSignature "V" (JNukeVector "[Ljava/lang/String;"))) (pc 12) (line 7))
  (JNukeThreadSwitch (from_thread 0) (to_thread 0) (JNukeMethod "BufferWhile.main" (JNukeSignature "V" (JNukeVector "[Ljava/lang/String;"))) (pc 20) (line 8))
  (JNukeThreadSwitch (from_thread 0) (to_thread 2) (JNukeMethod "BufferWhile.main" (JNukeSignature "V" (JNukeVector "[Ljava/lang/String;"))) (pc 28) (line 9))
  (JNukeThreadSwitch (from_thread 2) (to_thread 1) (JNukeMethod "Producer2.run" (JNukeSignature "V" (JNukeVector))) (pc 4) (line 6))
  (JNukeThreadSwitch (from_thread 1) (to_thread 3) (JNukeMethod "Buffer2.enq" (JNukeSignature "V" (JNukeVector "Ljava/lang/Object;"))) (pc 3) (line 11))
  (JNukeThreadSwitch (from_thread 3) (to_thread 1) (JNukeMethod "Consumer2.run" (JNukeSignature "V" (JNukeVector))) (pc 6) (line 7))
  (JNukeThreadSwitch (from_thread 1) (to_thread 1) (JNukeMethod "Producer2.run" (JNukeSignature "V" (JNukeVector))) (pc 4) (line 6))
  (JNukeThreadSwitch (from_thread 1) (to_thread 3) (JNukeMethod "java/lang/Thread.run" (JNukeSignature "V" (JNukeVector))) (pc 7) (line 57))
  (JNukeThreadSwitch (from_thread 3) (to_thread 3) (JNukeMethod "Consumer2.run" (JNukeSignature "V" (JNukeVector))) (pc 6) (line 7))
)
)

(JNukeExitBlock (JNukeSchedule 
  (JNukeThreadSwitch (from_thread 0) (to_thread 0) (JNukeMethod "BufferWhile.main" (JNukeSignature "V" (JNukeVector "[Ljava/lang/String;"))) (pc 12) (line 7))
  (JNukeThreadSwitch (from_thread 0) (to_thread 0) (JNukeMethod "BufferWhile.main" (JNukeSignature "V" (JNukeVector "[Ljava/lang/String;"))) (pc 20) (line 8))
  (JNukeThreadSwitch (from_thread 0) (to_thread 2) (JNukeMethod "BufferWhile.main" (JNukeSignature "V" (JNukeVector "[Ljava/lang/String;"))) (pc 28) (line 9))
  (JNukeThreadSwitch (from_thread 2) (to_thread 1) (JNukeMethod "Producer2.run" (JNukeSignature "V" (JNukeVector))) (pc 4) (line 6))
  (JNukeThreadSwitch (from_thread 1) (to_thread 3) (JNukeMethod "Buffer2.enq" (JNukeSignature "V" (JNukeVector "Ljava/lang/Object;"))) (pc 3) (line 11))
  (JNukeThreadSwitch (from_thread 3) (to_thread 1) (JNukeMethod "Consumer2.run" (JNukeSignature "V" (JNukeVector))) (pc 6) (line 7))
  (JNukeThreadSwitch (from_thread 1) (to_thread 3) (JNukeMethod "Producer2.run" (JNukeSignature "V" (JNukeVector))) (pc 4) (line 6))
  (JNukeThreadSwitch (from_thread 3) (to_thread 3) (JNukeMethod "Consumer2.run" (JNukeSignature "V" (JNukeVector))) (pc 6) (line 7))
  (JNukeThreadSwitch (from_thread 3) (to_thread 1) (JNukeMethod "java/lang/Thread.run" (JNukeSignature "V" (JNukeVector))) (pc 7) (line 57))
)
)

(JNukeExitBlock (JNukeSchedule 
  (JNukeThreadSwitch (from_thread 0) (to_thread 0) (JNukeMethod "BufferWhile.main" (JNukeSignature "V" (JNukeVector "[Ljava/lang/String;"))) (pc 12) (line 7))
  (JNukeThreadSwitch (from_thread 0) (to_thread 0) (JNukeMethod "BufferWhile.main" (JNukeSignature "V" (JNukeVector "[Ljava/lang/String;"))) (pc 20) (line 8))
  (JNukeThreadSwitch (from_thread 0) (to_thread 1) (JNukeMethod "BufferWhile.main" (JNukeSignature "V" (JNukeVector "[Ljava/lang/String;"))) (pc 28) (line 9))
  (JNukeThreadSwitch (from_thread 1) (to_thread 1) (JNukeMethod "Producer2.run" (JNukeSignature "V" (JNukeVector))) (pc 4) (line 6))
  (JNukeThreadSwitch (from_thread 1) (to_thread 2) (JNukeMethod "java/lang/Thread.run" (JNukeSignature "V" (JNukeVector))) (pc 7) (line 57))
)
)

(JNukeExitBlock (JNukeSchedule 
  (JNukeThreadSwitch (from_thread 0) (to_thread 0) (JNukeMethod "BufferWhile.main" (JNukeSignature "V" (JNukeVector "[Ljava/lang/String;"))) (pc 12) (line 7))
  (JNukeThreadSwitch (from_thread 0) (to_thread 0) (JNukeMethod "BufferWhile.main" (JNukeSignature "V" (JNukeVector "[Ljava/lang/String;"))) (pc 20) (line 8))
  (JNukeThreadSwitch (from_thread 0) (to_thread 1) (JNukeMethod "BufferWhile.main" (JNukeSignature "V" (JNukeVector "[Ljava/lang/String;"))) (pc 28) (line 9))
  (JNukeThreadSwitch (from_thread 1) (to_thread 2) (JNukeMethod "Producer2.run" (JNukeSignature "V" (JNukeVector))) (pc 4) (line 6))
)
)

(JNukeExitBlock (JNukeSchedule 
  (JNukeThreadSwitch (from_thread 0) (to_thread 0) (JNukeMethod "BufferWhile.main" (JNukeSignature "V" (JNukeVector "[Ljava/lang/String;"))) (pc 12) (line 7))
  (JNukeThreadSwitch (from_thread 0) (to_thread 2) (JNukeMethod "BufferWhile.main" (JNukeSignature "V" (JNukeVector "[Ljava/lang/String;"))) (pc 20) (line 8))
  (JNukeThreadSwitch (from_thread 2) (to_thread 2) (JNukeMethod "Producer2.run" (JNukeSignature "V" (JNukeVector))) (pc 4) (line 6))
  (JNukeThreadSwitch (from_thread 2) (to_thread 1) (JNukeMethod "java/lang/Thread.run" (JNukeSignature "V" (JNukeVector))) (pc 7) (line 57))
)
)

(JNukeExitBlock (JNukeSchedule 
  (JNukeThreadSwitch (from_thread 0) (to_thread 0) (JNukeMethod "BufferWhile.main" (JNukeSignature "V" (JNukeVector "[Ljava/lang/String;"))) (pc 12) (line 7))
  (JNukeThreadSwitch (from_thread 0) (to_thread 2) (JNukeMethod "BufferWhile.main" (JNukeSignature "V" (JNukeVector "[Ljava/lang/String;"))) (pc 20) (line 8))
  (JNukeThreadSwitch (from_thread 2) (to_thread 1) (JNukeMethod "Producer2.run" (JNukeSignature "V" (JNukeVector))) (pc 4) (line 6))
)
)

(JNukeExitBlock (JNukeSchedule 
  (JNukeThreadSwitch (from_thread 0) (to_thread 0) (JNukeMethod "BufferWhile.main" (JNukeSignature "V" (JNukeVector "[Ljava/lang/String;"))) (pc 12) (line 7))
  (JNukeThreadSwitch (from_thread 0) (to_thread 1) (JNukeMethod "BufferWhile.main" (JNukeSignature "V" (JNukeVector "[Ljava/lang/String;"))) (pc 20) (line 8))
  (JNukeThreadSwitch (from_thread 1) (to_thread 1) (JNukeMethod "Producer2.run" (JNukeSignature "V" (JNukeVector))) (pc 4) (line 6))
  (JNukeThreadSwitch (from_thread 1) (to_thread 2) (JNukeMethod "java/lang/Thread.run" (JNukeSignature "V" (JNukeVector))) (pc 7) (line 57))
)
)

(JNukeExitBlock (JNukeSchedule 
  (JNukeThreadSwitch (from_thread 0) (to_thread 0) (JNukeMethod "BufferWhile.main" (JNukeSignature "V" (JNukeVector "[Ljava/lang/String;"))) (pc 12) (line 7))
  (JNukeThreadSwitch (from_thread 0) (to_thread 1) (JNukeMethod "BufferWhile.main" (JNukeSignature "V" (JNukeVector "[Ljava/lang/String;"))) (pc 20) (line 8))
  (JNukeThreadSwitch (from_thread 1) (to_thread 2) (JNukeMethod "Producer2.run" (JNukeSignature "V" (JNukeVector))) (pc 4) (line 6))
)
)

(JNukeExitBlock (JNukeSchedule 
  (JNukeThreadSwitch (from_thread 0) (to_thread 1) (JNukeMethod "BufferWhile.main" (JNukeSignature "V" (JNukeVector "[Ljava/lang/String;"))) (pc 12) (line 7))
  (JNukeThreadSwitch (from_thread 1) (to_thread 1) (JNukeMethod "Producer2.run" (JNukeSignature "V" (JNukeVector))) (pc 4) (line 6))
)
)

