%!PS-Adobe-2.0 EPSF-1.2
%%Title: G
%%Creator: graphviz version 2.26.3 (20100126.1600)
%%CreationDate: Aug 2 09:47
%%For:cartho cartho
%%Pages: 1
%%DocumentFonts:
%%BoundingBox: 39 40 207 294%%HiResBoundingBox: 39.743788 40.500069 206.819572 293.499905%%EndComments

%%BeginProlog
%%BeginPreview: 168 254 8 1270
% 00000000000000000000000000000000000000000000000000000000000000000000000000004455
% 88888844330000000000000000000000000000000000000000000000000000000000000000000000
% 00000000000000000000000000000000000000000000000000000000000000000000000000000000
% 00000000000000000000000000000000004455888888443300000000000000000000000000000000
% 0000000000000000
% 00000000000000000000000000000000000000000000000000000000000022447788aabbffffffcc
% bb99bbddffffddbb9988554400000000000000000000000000000000000000000000000000000000
% 00000000000000000000000000000000000000000000000000000000000000000000000000000000
% 00000000000000000022447788aabbffffffccbb99bbddffffddbb99885544000000000000000000
% 0000000000000000
% 000000000000000000000000000000000000000000000000000000003399ffeebb99886644110000
% 000000000033447788bbbbffee881100000000000000000000000000000000000000000000000000
% 00000000000000000000000000000000000000000000000000000000000000000000000000000000
% 000000000000003399ffeebb99886644110000000000000033447788bbbbffee8811000000000000
% 0000000000000000
% 000000000000000000000000000000000000000000000000000055bbff9944000000000000000000
% 00000000000000000000000066ddee99220000000000000000000000000000000000000000000000
% 00000000000000000000000000000000000000000000000000000000000000000000000000000000
% 000000000055bbff994400000000000000000000000000000000000000000066ddee992200000000
% 0000000000000000
% 00000000000000000000000000000000000000000000000066ddee88220000000000000000000000
% 000000000000000000000000000044bbffaa44000000000000000000000000000000000000000000
% 00000000000000000000000000000000000000000000000000000000000000000000000000000000
% 00000066ddee88220000000000000000000000000000000000000000000000000044bbffaa440000
% 0000000000000000
% 0000000000000000000000000000000000000000001188eedd881100000000000000000000000000
% 000000000000000000000000000000002299ffbb5500000000000000000000000000000000000000
% 00000000000000000000000000000000000000000000000000000000000000000000000000000000
% 1188eedd881100000000000000000000000000000000000000000000000000000000002299ffbb55
% 0000000000000000
% 000000000000000000000000000000000000000011ccdd6600000000000000000000000000000000
% 0000000000000000000000000000000000001188ee88000000000000000000000000000000000000
% 00000000000000000000000000000000000000000000000000000000000000000000000000000011
% ccdd66000000000000000000000000000000000000000000000000000000000000000000001188ee
% 8800000000000000
% 0000000000000000000000000000000000000011cccc110000000000000000000000000000000000
% 000000000000000000000000000000000000000033ee990000000000000000000000000000000000
% 000000000000000000000000000000000000000000000000000000000000000000000000000011cc
% cc110000000000000000000000000000000000000000000000000000000000000000000000000033
% ee99000000000000
% 00000000000000000000000000000000000011cccc11000000000000000000000000000000000000
% 00000000000000000000000000000000000000000033ee9900000000000000000000000000000000
% 0000000000000000000000000000000000000000000000000000000000000000000000000011cccc
% 11000000000000000000000000000000000000000000000000000000000000000000000000000000
% 33ee990000000000
% 000000000000000000000000000000000011cccc1100000000000000000000000000000000000000
% 0000000000000000000000000000000000000000000033ee99000000000000000000000000000000
% 00000000000000000000000000000000000000000000000000000000000000000000000011cccc11
% 00000000000000000000000000000000000000000000000000000000000000000000000000000000
% 0033ee9900000000
% 0000000000000000000000000000000011cccc110000000000000000000000000000000000000000
% 000000000000000000000000000000000000000000000033ee990000000000000000000000000000
% 000000000000000000000000000000000000000000000000000000000000000000000011cccc1100
% 00000000000000000000000000000000000000000000000000000000000000000000000000000000
% 000033ee99000000
% 00000000000000000000000000000011cccc11000000000000000000000000000000000000000000
% 00000000000000000000000000000000000000000000000033ee8800000000000000000000000000
% 0000000000000000000000000000000000000000000000000000000000000000000011cccc110000
% 00000000000000000000000000000000000000000000000000000000000000000000000000000000
% 00000033ee880000
% 00000000000000000000000000000055dd1100000000000000000000000000000000000000000000
% 0000000000000000000000000000000000000000000000000055ee00000000000000000000000000
% 0000000000000000000000000000000000000000000000000000000000000000000055dd11000000
% 00000000000000000000000000000000000000000000000000000000000000000000000000000000
% 0000000055ee0000
% 00000000000000000000000000000099990000000000000000000000000000000000000000000000
% 0000000000000000000000000000000000000000000000000000ee55000000000000000000000000
% 00000000000000000000000000000000000000000000000000000000000000000000999900000000
% 00000000000000000000000000000000000000000000000000000000000000000000000000000000
% 0000000000ee5500
% 000000000000000000000000000000ee550000000000000000000000000000000000000000000000
% 00000000000000000000000000000000000000000000000000009988000000000000000000000000
% 00000000000000000000000000000000000000000000000000000000000000000000ee5500000000
% 00000000000000000000000000000000000000000000000000000000000000000000000000000000
% 0000000000998800
% 000000000000000000000000000044ff000000000000000000000000000000000000000000000000
% 000000000000000000000000000000000000000000000000000066dd000000000000000000000000
% 00000000000000000000000000000000000000000000000000000000000000000044ff0000000000
% 00000000000000000000000000000000000000000000000000000000000000000000000000000000
% 000000000066dd00
% 000000000000000000000000000088aa000000000000000000000000000000000000000000000000
% 000000000000000000000000000000000000000000000000000011ff330000000000000000000000
% 00000000000000000000000000000000000000000000000000000000000000000088aa0000000000
% 00000000000000000000000000000000000000000000000000000000000000000000000000000000
% 000000000011ff33
% 0000000000000000000000000000dd66000000000000000000000000000000000000000000000000
% 000000000000000000000000000000000000000000000000000000bb770000000000000000000000
% 000000000000000000000000000000000000000000000000000000000000000000dd660000000000
% 00000000000000000000000000000000000000000000000000000000000000000000000000000000
% 000000000000bb77
% 0000000000000000000000000022ff220000000000000000000000000000000000001166dd44cc77
% 22ddbb11008888000000000000000000000000000000000000000077bb0000000000000000000000
% 000000000000000000000000000000000000000000000000000000000000000022ff220000000000
% 0000000000000000000000000000007755668800119988aaaa000000000000000000000000000000
% 00000000000077bb
% 0000000000000000000000000022ff220000000000000000000000000000000000000044ff112211
% 0066dd00008800000000000000000000000000000000000000000077bb0000000000000000000000
% 000000000000000000000000000000000000000000000000000000000000000022ff220000000000
% 000000000000000000000000000000dd1100440022aa0000ff440000000000000000000000000000
% 00000000000077bb
% 0000000000000000000000000000dd660000000000000000000000000000000000000044ff000000
% 0000dd661188000000000000000000000000000000000000000000bb770000000000000000000000
% 000000000000000000000000000000000000000000000000000000000000000000dd660000000000
% 00000000000000000000000000000099dd66000000002244ff440000000000000000000000000000
% 000000000000bb77
% 000000000000000000000000000088aa0000000000000000000000000000000000000044ff000000
% 000077bb7722000000000000000000000000000000000000000011ff330000000000000000000000
% 00000000000000000000000000000000000000000000000000000000000000000088aa0000000000
% 0000000000000000000000000000001166ee990000883300ff440000000000000000000000000000
% 000000000011ff33
% 000000000000000000000000000044ff0000000000000000000000000000000000000044ff000000
% 000011ee8800000000000000000000000000000000000000000066dd000000000000000000000000
% 00000000000000000000000000000000000000000000000000000000000000000044ff0000000000
% 000000000000000000000000000000660011ff0044ff1111ff440000000000000000000000000000
% 000000000066dd00
% 000000000000000000000000000000ee5500000000000000000000000000000000001188ff661100
% 00000088440000000000000000000000000000000000000000009988000000000000000000000000
% 00000000000000000000000000000000000000000000000000000000000000000000ee5500000000
% 000000000000000000000000000000bb5566660011cccc77ddaa2200000000000000000000000000
% 0000000000998800
% 00000000000000000000000000000099990000000000000000000000000000000000000000000000
% 0000001100000000000000000000000000000000000000000000ee55000000000000000000000000
% 00000000000000000000000000000000000000000000000000000000000000000000999900000000
% 00000000000000000000000000000000000000000000000000000000000000000000000000000000
% 0000000000ee5500
% 00000000000000000000000000000055dd1100000000000000000000000000000000000000000000
% 0000000000000000000000000000000000000000000000000055ee00000000000000000000000000
% 0000000000000000000000000000000000000000000000000000000000000000000055dd11000000
% 00000000000000000000000000000000000000000000000000000000000000000000000000000000
% 0000000055ee0000
% 00000000000000000000000000000011cccc11000000000000000000000000000000000000000000
% 00000000000000000000000000000000000000000000000033ee8800000000000000000000000000
% 0000000000000000000000000000000000000000000000000000000000000000000011cccc110000
% 00000000000000000000000000000000000000000000000000000000000000000000000000000000
% 00000033ee880000
% 0000000000000000000000000000000011cccc110000000000000000000000000000000000000000
% 000000000000000000000000000000000000000000000033ee990000000000000000000000000000
% 000000000000000000000000000000000000000000000000000000000000000000000011cccc1100
% 00000000000000000000000000000000000000000000000000000000000000000000000000000000
% 000033ee99000000
% 000000000000000000000000000000000011cccc1100000000000000000000000000000000000000
% 0000000000000000000000000000000000000000000033ee99000000000000000000000000000000
% 00000000000000000000000000000000000000000000000000000000000000000000000011cccc11
% 00000000000000000000000000000000000000000000000000000000000000000000000000000000
% 0033ee9900000000
% 00000000000000000000000000000000000011cccc11000000000000000000000000000000000000
% 00000000000000000000000000000000000000000033ee9900000000000000000000000000000000
% 0000000000000000000000000000000000000000000000000000000000000000000000000011cccc
% 11000000000000000000000000000000000000000000000000000000000000000000000000000000
% 33ee990000000000
% 0000000000000000000000000000000000000011cccc110000000000000000000000000000000000
% 000000000000000000000000000000000000000033ee990000000000000000000000000000000000
% 000000000000000000000000000000000000000000000000000000000000000000000000000011cc
% cc110000000000000000000000000000000000000000000000000000000000000000000000000033
% ee99000000000000
% 000000000000000000000000000000000000000011ccdd6600000000000000000000000000000000
% 0000000000000000000000000000000000001188ee88000000000000000000000000000000000000
% 00000000000000000000000000000000000000000000000000000000000000000000000000000011
% ccdd66000000000000000000000000000000000000000000000000000000000000000000001188ee
% 8800000000000000
% 0000000000000000000000000000000000000000001188eedd881100000000000000000000000000
% 000000000000000000000000000000002299ffbb5500000000000000000000000000000000000000
% 00000000000000000000000000000000000000000000000000000000000000000000000000000000
% 1188eedd881100000000000000000000000000000000000000000000000000000000002299ffbb55
% 0000000000000000
% 00000000000000000000000000000000000000000000000066ddee88220000000000000000000000
% 000000000000000000000000000044bbffaa44000000000000000000000000000000000000000000
% 00000000000000000000000000000000000000000000000000000000000000000000000000000000
% 00000066ddee88220000000000000000000000000000000000000000000000000044bbffaa440000
% 0000000000000000
% 0000000000000000000000000000000000000000000000000000b0c9ff9944000000000000000000
% 00000000000000000000000066ddee99b69900000000000000000000000000000000000000000000
% 00000000000000000000000000000000000000000000000000000000000000000000000000000000
% 000000000055bbff994400000000000000000000000000000000000000000066ddee992200000000
% 0000000000000000
% 0000000000000000000000000000000000000000000000000077ee333399ffeebb99886644110000
% 000000000033447788bbbbffee88110033ee99000000000000000000000000000000000000000000
% 00000000000000000000000000000000000000000000000000000000000000000000000000000000
% 000000000000003399ffeebb99886644110000000000000033447788bbbbffee8811000000000000
% 0000000000000000
% 00000000000000000000000000000000000000000000000033ff5500000022447788aabbffffffcc
% bb99bbddffffddbb99885544000000000033ee990000000000000000000000000000000000000000
% 00000000000000000000000000000000000000000000000000000000000000000000000000000000
% 00000000000000000022447788ccbbffffffccbb99bbddffffddbbd0905544000000000000000000
% 0000000000000000
% 000000000000000000000000000000000000000000000011ee880000000000000000000000004455
% a8e08844330000000000000000000000000033ee9900000000000000000000000000000000000000
% 00000000000000000000000000000000000000000000000000000000000000000000000000000000
% 00000000000000000000000044ee11000044558888884433000000dd660000000000000000000000
% 0000000000000000
% 0000000000000000000000000000000000000000000000bbbb000000000000000000000000000000
% 44bb000000000000000000000000000000000033ee99000000000000000000000000000000000000
% 00000000000000000000000000000000000000000000000000000000000000000000000000000000
% 00000000000000000000000099990000000000000000000000000099990000000000000000000000
% 0000000000000000
% 0000000000000000000000000000000000000000000088ee11000000000000000000000000000000
% 44bb00000000000000000000000000000000000033ee990000000000000000000000000000000000
% 00000000000000000000000000000000000000000000000000000000000000000000000000000000
% 000000000000000000000011ee440000000000000000000000000055ee0000000000000000000000
% 0000000000000000
% 00000000000000000000000000000000000000000055ff3300000000000000000000000000000000
% 44bb0000000000000000000000000000000000000033ee9900000000000000000000000000000000
% 00000000000000000000000000000000000000000000000000000000000000000000000000000000
% 000000000000000000000066dd000000000000000000000000000000ee5500000000000000000000
% 0000000000000000
% 000000000000000000000000000000000000000022ee770000000000000000000000000000000000
% 44bb000000000000000000000000000000000000000033ee99000000000000000000000000000000
% 00000000000000000000000000000000000000000000000000000000000000000000000000000000
% 0000000000000000000000bb88000000000000000000000000000000999900000000000000000000
% 0000000000000000
% 0000000000000000000000000000000000000000bbaa000000000000000000000000000000000000
% 44bb00000000000000000000000000000000000000000033ee990000000000000000000000000000
% 00000000000000000000000000000000000000000000000000000000000000000000000000000000
% 0000000000000000000022ff2200000000000000000000000000000055ee00000000000000000000
% 0000000000000000
% 0000000000000000000000000000000000000088ee11000000000000000000000000000000000000
% 44bb0000000000000000000000000000000000000000000033ee9900000000000000000000000000
% 00000000000000000000000000000000000000000000000000000000000000000000000000000000
% 0000000000000000000088bb0000000000000000000000000000000000ff33000000000000000000
% 0000000000000000
% 00000000000000000000000000000000000033ff5500000000000000000000000000000000000000
% 44bb000000000000000000000000000000000000000000000033ee99000000000000000000000000
% 00000000000000000000000000000000000000000000000000000000000000000000000000000000
% 00000000000000000000dd660000000000000000000000000000000000aa88000000000000000000
% 0000000000000000
% 000000000000000000000000000000000000cc990000000000000000000000000000000000000000
% 44bb00000000000000000000000000000000000000000000000033ee990000000000000000000000
% 00000000000000000000000000000000000000000000000000000000000000000000000000000000
% 00000000000000000044ee11000000000000000000000000000000000077cc000000000000000000
% 0000000000000000
% 000000000000000000000000000000000088dd110000000000000000000000000000000000000000
% 44bb0000000000000000000000000000000000000000000000000033ee9900000000000000000000
% 00000000000000000000000000000000000000000000000000000000000000000000000000000000
% 000000000000000000999900000000000000000000000000000000000033ff110000000000000000
% 0000000000000000
% 0000000000000000000000000000000033ff44000000000000000000000000000000000000000000
% 44bb000000000000000000000000000000000000000000000000000033ee99000000000000000000
% 00000000000000000000000000000000000000000000000000000000000000000000000000000000
% 000000000000000011ee4400000000000000000000000000000000000000dd550000000000000000
% 0000000000000000
% 00000000000000000000000000000011dd8800000000000000000000000000000000000000000000
% 44bb00000000000000000000000000000000000000000000000000000033ee990000000000000000
% 00000000000000000000000000000000000000000000000000000000000000000000000000000000
% 000000000000000066dd000000000000000000000000000000000000000099880000000000000000
% 0000000000000000
% 00000000000000000000000000000088dd1100000000000000000000000000000000000000000000
% 44bb0000000000000000000000000000000000000000000000000000000033ee9900000000000000
% 00000000000000000000000000000000000000000000000000000000000000000000000000000000
% 0000000000000000bb88000000000000000000000000000000000000000066dd0000000000000000
% 0000000000000000
% 000000000000000000000000000044ff330000000000000000000000000000000000000000000000
% 44bb000000000000000000000000000000000000000000000000000000000033ee99000000000000
% 00000000000000000000000000000000000000000000000000000000000000000000000000000000
% 0000000000000022ff22000000000000000000000000000000000000000022ff2200000000000000
% 0000000000000000
% 0000000000000000000000000000bb99000000000000000000000000000000000000000000000000
% 44bb00000000000000000000000000000000000000000000000000000000000033ee990000000000
% 00000000000000000000000000000000000000000000000000000000000000000000000000000000
% 0000000000000088bb00000000000000000000000000000000000000000000cc6600000000000000
% 0000000000000000
% 0000000000000000000000000066ee11000000000000000000000000000000000000000000000000
% 44bb0000000000000000000000000000000000000000000000000000000000000033ee9900000000
% 00000000000000000000000000000000000000000000000000000000000000000000000000000000
% 00000000000000dd6600000000000000000000000000000000000000000000889900000000000000
% 0000000000000000
% 00000000000000000000000011dd7700000000000000000000000000000000000000000000000000
% 44bb000000000000000000000000000000000000000000000000000000000000000033ee99000000
% 00000000000000000000000000000000000000000000000000000000000000000000000000000000
% 00000000000044ee110000000000000000000000000000000000000000000066cc00000000000000
% 0000000000000000
% 00000000000000000000000088dd0000000000000000000000000000000000000000000000000000
% 44bb00000000000000000000000000000000000000000000000000000000000000000033ee990000
% 00000000000000000000000000000000000000000000000000000000000000000000000000000000
% 0000000000009999000000000000000000000000000000000000000000000033ff00000000000000
% 0000000000000000
% 000000000000000000000022ff440000000000000000000000000000000000000000000000000000
% 44bb0000000000000000000000000000000000000000000000000000000000000000000033ee9900
% 00000000000000000000000000000000000000000000000000000000000000000000000000000000
% 000000000011ee44000000000000000000000000000000000000000000000000ff44000000000000
% 0000000000000000
% 0000000000000000000000aabb000000000000000000000000000000000000000000000000000000
% 44bb000000000000000000000000000000000000000000000000000000000000000000000033ee99
% 00000000000000000000000000000000000000000000000000000000000000000000000000000000
% 000000000066dd00000000000000000000000000000000000000000000000000bb77000000000000
% 0000000000000000
% 0000000000000000000044ff22000000000000000000000000000000000000000000000000000000
% 44bb00000000000000000000000000000000000000000000000000000000000000000000000033ee
% 99000000000000000000000000000000000000000000000000000000000000000000000000000000
% 0000000000bb88000000000000000000000000000000000000000000000000008899000000000000
% 0000000000000000
% 00000000000000000000dd8800000000000000000000000000000000000000000000000000000000
% 44bb0000000000000000000000000000000000000000000000000000000000000000000000000033
% ee990000000000000000000000000000000000000000000000000000000000000000000000000000
% 0000000022ff220000000000000000000000000000000000000000000000000055cc000000000000
% 0000000000000000
% 00000000000000000066ee1100000000000000000000000000000000000000000000000000000000
% 44bb0000000000000000000000000000000000000000000000000000000000000000000000000000
% 33ee9900000000000000000000000000000000000000000000000000000000000000000000000000
% 0000000088cc000000000000000000000000000000000000000000000000000022ff110000000000
% 0000000000000000
% 000000000000000000dd880000000000000000000000000000000000000000000000000000000000
% 44bb0000000000000000000000000000000000000000000000000000000000000000000000000000
% 0033ee99000000000000000000000000000000000000000000000000000000000000000000000000
% 00000000dd66000000000000000000000000000000000000000000000000000000ee440000000000
% 0000000000000000
% 000000000000000055ee110000000000000000000000000000000000000000000000000000000000
% 44bb0000000000000000000000000000000000000000000000000000000000000000000000000000
% 000033ee990000000000000000000000000000000000000000000000000000000000000000000000
% 00000044ff11000000000000000000000000000000000000000000000000000000bb880000000000
% 0000000000000000
% 0000000000000000bb88000000000000000000000000000000000000000000000000000000a7ffff
% ffffffffff3300000000000000000000000000000000000000000000000000000000000000000000
% 00000033ee9900000000000000000000000000000000000000000000000000000000000000000033
% b6550099990000000000000000000000000000000000000000000000000000000088880000000000
% 0000000000000000
% 0000000000000044ff2200000000000000000000000000000000000000000000000000000077fcff
% ffffffffff2200000000000000000000000000000000000000000000000000000000000000000000
% 0000000033ee99000000000000000000000000000000000000000000000000000000000000000088
% fffcf5f8770000000000000000000000000000000000000000000000000000000088bb0000000000
% 0000000000000000
% 0000000000000099990000000000000000000000000000000000000000000000000000000022ffff
% ffffffffda0000000000000000000000000000000000000000000000000000000000000000000000
% 000000000033ee990000000000000000000000000000000000000000000000000000000000000088
% ffffffffffdd77000000000000000000000000000000000000000000000000000055cc0000000000
% 0000000000000000
% 00000000000022ff220000000000000000000000000000000000000000000000000000000000ddff
% fffffff9770000000000000000000000000000000000000000000000000000000000000000000000
% 00000000000033ee9900000000330000000000000000000000000000000000000000000000000088
% ffffffffffffff110000000000000000000000000000000000000000000000000044ff0000000000
% 0000000000000000
% 00000000000099bb00000000000000000000000000000000000000000000000000000000000077f9
% ffffffff220000000000000000000000000000000000000000000000000000000000000000000000
% 0000000000000033ee990000a0ff4400000000000000000000000000000000000000000000000088
% fffffffffffc77000000000000000000000000000000000000000000000000000000ff1100000000
% 0000000000000000
% 000000000011ff4400000000000000000000000000000000000000000000000000000000000022ff
% ffffffbb000000000000000000000000000000000000000000000000000000000000000000000000
% 000000000000000033ee99a0fcffcd00000000000000000000000000000000000000000000000088
% fffffffffba000000000000000000000000000000000000000000000000000000000ff4400000000
% 0000000000000000
% 000000000088cc0000000000000000000000000000000000000000000000000000000000000000bb
% fffffb66000000000000000000000000000000000000000000000000000000000000000000000000
% 00000000000000000033e0fcffffff44000000000000000000000000000000000000000000000088
% fffffffcd70000000000000000000000000000000000000000000000000000000000bb5500000000
% 0000000000000000
% 0000000000dd66000000000000000000000000000000000000000000000000000000000000000066
% fbffff11000000000000000000000000000000000000000000000000000000000000000000000000
% 000000000000000000a0fcffffffffc4000000000000000000000000000000000000000000000088
% ffffffe9110000000000000000000000000000000000000000000000000000000000bb8800000000
% 0000000000000000
% 0000000033ff11000000000000000000000000000000000000000000000000000000000000000011
% ffffb600000000000000000000000000000000000000000000000000000000000000000000000000
% 0000000000000000a0fcffffffffffff440000000000000000000000000000000000000000000088
% fffff633000000000000000000000000000000000000000000000000000000000000888800000000
% 0000000000000000
% 0000000088aa00000000000000000000000000000000000000000000000000000000000000000000
% b6ff6600000000000000000000000000000000000000000000000000000000000000000000000000
% 0000000000000000aefbffffffffffffa70000000000000000000000000000000000000000000098
% ffff550000000000000000000000000000000000000000000000000000000000000088bb00000000
% 0000000000000000
% 00000000cc6600000000000000000000000000000000000000000000000000000000000000004455
% b0e88844330000000000000000000000000000000000000000000000000000000000000000000000
% 00000000000000000044cdffffffffffff22000000000000000000000000445588888844330000cd
% ff77000000000000000000000000000000000000000000000000000000000000000088bb00000000
% 0000000000000000
% 00000022ff2200000000000000000000000000000000000000000000000022447788aabbffffffcc
% bb99bbddffffddbb9988554400000000000000000000000000000000000000000000000000000000
% 000000000000000000000044c4ffffffffa70000000022447788aabbffffffccbb99bbddffffdde0
% d388554400000000000000000000000000000000000000000000000000000000000066bb00000000
% 0000000000000000
% 00000077cc00000000000000000000000000000000000000000000003399ffeebb99886644110000
% 000000000033447788bbbbffee881100000000000000000000000000000000000000000000000000
% 0000000000000000000000000044c4ffffff22003399ffeebb998866441100000000000000334477
% 88bbbbffee881100000000000000000000000000000000000000000000000000000044bb00000000
% 0000000000000000
% 000000cc7700000000000000000000000000000000000000000055bbff9944000000000000000000
% 00000000000000000000000066ddee99220000000000000000000000000000000000000000000000
% 00000000000000000000000000000022a7ffa4bbff99440000000000000000000000000000000000
% 0000000066ddee99220000000000000000000000000000000000000000000000000044bb00000000
% 0000000000000000
% 000011ff220000000000000000000000000000000000000066ddee88220000000000000000000000
% 000000000000000000000000000044bbffaa44000000000000000000000000000000000000000000
% 0000000000000000000000000000000066e2ee882200000000000000000000000000000000000000
% 00000000000044bbffaa44000000000000000000000000000000000000000000000044ff00000000
% 0000000000000000
% 000066dd00000000000000000000000000000000001188eedd881100000000000000000000000000
% 000000000000000000000000000000002299ffbb5500000000000000000000000000000000000000
% 000000000000000000000000001188eedd8811000000000000000000000000000000000000000000
% 00000000000000002299ffbb5500000000000000000000000000000000000000000044ff00000000
% 0000000000000000
% 0000aa880000000000000000000000000000000011ccdd6600000000000000000000000000000000
% 0000000000000000000000000000000000001188ee88000000000000000000000000000000000000
% 00000000000000000000000011ccdd66000000000000000000000000000000000000000000000000
% 000000000000000000001188ee88000000000000000000000000000000000000000044ff00000000
% 0000000000000000
% 0000ff4400000000000000000000000000000011cccc110000000000000000000000000000000000
% 000000000000000000000000000000000000000033ee990000000000000000000000000000000000
% 000000000000000000000011cccc1100000000000000000000000000000000000000000000000000
% 00000000000000000000000033ee990000000000000000000000000000000000000044ff00000000
% 0000000000000000
% 0011ff11000000000000000000000000000011cccc11000000000000000000000000000000000000
% 00000000000000000000000000000000000000000033ee9900000000000000000000000000000000
% 0000000000000000000011cccc110000000000000000000000000000000000000000000000000000
% 0000000000000000000000000033ee9900000000000000000000000000000000000000ff00000000
% 0000000000000000
% 0044ff000000000000000000000000000011cccc1100000000000000000000000000000000000000
% 0000000000000000000000000000000000000000000033ee99000000000000000000000000000000
% 00000000000000000011cccc11000000000000000000000000000000000000000000000000000000
% 000000000000000000000000000033ee99000000000000000000000000000000000033ff00000000
% 0000000000000000
% 0066bb0000000000000000000000000011cccc110000000000000000000000000000000000000000
% 000000000000000000000000000000000000000000000033ee990000000000000000000000000000
% 000000000000000011cccc1100000000000000000000000000000000000000000000000000000000
% 00000000000000000000000000000033ee990000000000000000000000000000000044ff00000000
% 0000000000000000
% 0088bb00000000000000000000000011cccc11000000000000000000000000000000000000000000
% 00000000000000000000000000000000000000000000000033ee8800000000000000000000000000
% 0000000000000011cccc110000000000000000000000000000000000000000000000000000000000
% 0000000000000000000000000000000033ee8800000000000000000000000000000044dd00000000
% 0000000000000000
% 00998800000000000000000000000055dd1100000000000000000000000000000000000000000000
% 0000000000000000000000000000000000000000000000000055ee00000000000000000000000000
% 0000000000000055dd11000000000000000000000000000000000000000000000000000000000000
% 000000000000000000000000000000000055ee00000000000000000000000000000055bb00000000
% 0000000000000000
% 00bb7700000000000000000000000099990000000000000000000000000000000000000000000000
% 0000000000000000000000000000000000000000000000000000ee55000000000000000000000000
% 00000000000000999900000000000000000000000000000000000000000000000000000000000000
% 000000000000000000000000000000000000ee55000000000000000000000000000088bb00000000
% 0000000000000000
% 00ee44000000000000000000000000ee550000000000000000000000000000000000000000000000
% 00000000000000000000000000000000000000000000000000009988000000000000000000000000
% 00000000000000ee5500000000000000000000000000000000000000337700000000000000000000
% 0000000000000000000000000000000000009988000000000000000000000000000088bb00000000
% 0000000000000000
% 00ff22000000000000000000000044ff000000000000000000000000000000000000000000000000
% 000000000000000000000000000000000000000000000000000066dd000000000000000000000000
% 00000000000044ff000000000000000000000000000000000000002288ff00000000000000000000
% 00000000000000000000000000000000000066dd0000000000000000000000000000888800000000
% 0000000000000000
% 44ff00000000000000000000000088aa000000000000000000000000000000000000000000000000
% 000000000000000000000000000000000000000000000000000011ff330000000000000000000000
% 00000000000088aa000000000000000000000000000000000000000044ff00000000000000000000
% 00000000000000000000000000000000000011ff3300000000000000000000000000aa8800000000
% 0000000000000000
% 44ee000000000000000000000000dd66000000000000000000000000000000000000000000000000
% 000000000000000000000000000000000000000000000000000000bb770000000000000000000000
% 000000000000dd66000000000000000000000000000000000000000044ff00000000000000000000
% 00000000000000000000000000000000000000bb7700000000000000000000000000bb8800000000
% 0000000000000000
% 44ff000000000000000000000022ff220000000000000000000000000000000088ff550022cc2211
% 88cc99bbdd88bbccbb00000000000000000000000000000000000077bb0000000000000000000000
% 000000000022ff2200000000000000000000000000118888cc88000044ff000033aa88dddd660011
% 8888aa9911000000000000000000000000000077bb00000000000000000000000000bb6600000000
% 0000000000000000
% 33ff000000000000000000000022ff220000000000000000000000000000000000dd660022660000
% 44ff220055ff1111ff33000000000000000000000000000000000077bb0000000000000000000000
% 000000000022ff220000000000000000000000000022990044ff000044ff0000dd440044ff000099
% 660000aa99000000000000000000000000000077bb00000000000000000000000000ff4400000000
% 0000000000000000
% 00ff000000000000000000000000dd66000000000000000000000000000000000066dd0088110000
% 44ff000044ff0000ff440000000000000000000000000000000000bb770000000000000000000000
% 000000000000dd660000000000000000000000000000114477ff000044ff0000ee660000dd0000ff
% 44000055ff0000000000000000000000000000bb7700000000000000000000000044ff0000000000
% 0000000000000000
% 00ff44000000000000000000000088aa000000000000000000000000000000000000ee4488000000
% 44ff000044ff0000ff440000000000000000000000000000000011ff330000000000000000000000
% 00000000000088aa0000000000000000000000000055660044ff000044ff000066dd8888330000ff
% 66000044ee0000000000000000000000000011ff3300000000000000000000000077bb0000000000
% 0000000000000000
% 00ff44000000000000000000000044ff00000000000000000000000000000000000088ee22000000
% 44ff000044ff0000ff440000000000000000000000000000000066dd000000000000000000000000
% 00000000000044ff00000000000000000000000000ee550055ff000044ff00001144000000000099
% bb000088880000000000000000000000000066dd0000000000000000000000000099880000000000
% 0000000000000000
% 00bb44000000000000000000000000ee55000000000000000000000000000000000011bb00000011
% 88ff442288ff4444ff88110000000000000000000000000000009988000000000000000000000000
% 00000000000000ee5500000000000000000000000099ee8866ff882288ff440077ffffbbbb660011
% 99aa88880000000000000000000000000000998800000000000000000000000000cc660000000000
% 0000000000000000
% 00bb7700000000000000000000000099990000000000000000000000000000000000001100000000
% 0000000000000000000000000000000000000000000000000000ee55000000000000000000000000
% 00000000000000999900000000000000000000000000000000000000000000006655334444aa0000
% 000000000000000000000000000000000000ee5500000000000000000000000000ff330000000000
% 0000000000000000
% 00bb8800000000000000000000000055dd1100000000000000000000000000000000000000000000
% 0000000000000000000000000000000000000000000000000055ee00000000000000000000000000
% 0000000000000055dd1100000000000000000000000000000000000000000000ee22000011660000
% 000000000000000000000000000000000055ee0000000000000000000000000044ee000000000000
% 0000000000000000
% 00998800000000000000000000000011cccc11000000000000000000000000000000000000000000
% 00000000000000000000000000000000000000000000000033ee8800000000000000000000000000
% 0000000000000011cccc1100000000000000000000000000000000000000000088eebb8866000000
% 0000000000000000000000000000000033ee880000000000000000000000000088bb000000000000
% 0000000000000000
% 0088aa0000000000000000000000000011cccc110000000000000000000000000000000000000000
% 000000000000000000000000000000000000000000000033ee990000000000000000000000000000
% 000000000000000011cccc1100000000000000000000000000000000000000000000000000000000
% 00000000000000000000000000000033ee990000000000000000000000000000aa88000000000000
% 0000000000000000
% 0033ff110000000000000000000000000011cccc1100000000000000000000000000000000000000
% 0000000000000000000000000000000000000000000033ee99000000000000000000000000000000
% 00000000000000000011cccc11000000000000000000000000000000000000000000000000000000
% 000000000000000000000000000033ee99000000000000000000000000000011ee55000000000000
% 0000000000000000
% 0000dd66000000000000000000000000000011cccc11000000000000000000000000000000000000
% 00000000000000000000000000000000000000000033ee9900000000000000000000000000000000
% 0000000000000000000011cccc110000000000000000000000000000000000000000000000000000
% 0000000000000000000000000033ee9900000000000000000000000000000066dd00000000000000
% 0000000000000000
% 000088aa00000000000000000000000000000011cccc110000000000000000000000000000000000
% 000000000000000000000000000000000000000033ee990000000000000000000000000000000000
% 000000000000000000000011cccc1100000000000000000000000000000000000000000000000000
% 00000000000000000000000033ee9900000000000000000000000000000000cc8800000000000000
% 0000000000000000
% 000033ff1100000000000000000000000000000011ccdd6600000000000000000000000000000000
% 0000000000000000000000000000000000001188ee88000000000000000000000000000000000000
% 00000000000000000000000011ccdd66000000000000000000000000000000000000000000000000
% 000000000000000000001188ee880000000000000000000000000000000033ff2200000000000000
% 0000000000000000
% 000000dd66000000000000000000000000000000001188eedd881100000000000000000000000000
% 000000000000000000000000000000002299ffbb5500000000000000000000000000000000000000
% 000000000000000000000000001188eedd8811000000000000000000000000000000000000000000
% 00000000000000002299ffbb55000000000000000000000000000000000088aa0000000000000000
% 0000000000000000
% 00000088cc0000000000000000000000000000000000000066ddee88220000000000000000000000
% 000000000000000000000000000044bbffaa44000000000000000000000000000000000000000000
% 0000000000000000000000000000000066ddee882200000000000000000000000000000000000000
% 00000000000044bbffaa4400000000000000000000000000000000000000ee550000000000000000
% 0000000000000000
% 00000022ff22000000000000000000000000000000000000000055bbff9944000000000000000000
% 00000000000000000000000066ddee99220000000000000000000000000000000000000000000000
% 00000000000000000000000000000000000055bbff99440000000000000000000000000000000000
% 0000000066ddee9922000000000000000000000000000000000000000066ee000000000000000000
% 0000000000000000
% 00000000cc77000000000000000000000000000000000000000000003399ffeebb99886644110000
% 000000000033447788bbbbffee881100000000000000000000000000000000000000000000000000
% 00000000000000000000000000000000000000003399ffeebb998866441100000000000000334477
% 88bbbbffee881100000000000000000000000000000000000000000000bb88000000000000000000
% 0000000000000000
% 0000000077cc00000000000000000000000000000000000000000000000022447788aabbffffffcc
% bb99bbddffffddbb99a8bb4400000000000000000000000000000000000000000000000000000000
% 00000000000000000000000000000000000000000000225dd288aabbffffffccbb99bbddffffddbb
% 9988554400000000000000000000000000000000000000000000000022ff22000000000000000000
% 0000000000000000
% 0000000022ee55000000000000000000000000000000000000000000000000000000000000004455
% 88888844330000000022ff4400000000000000000000000000000000000000000000000000000000
% 000000000000000000000000000000000000000000000099bb000000000044558888884433000000
% 00000000000000000000000000000000000000000000000000000000bbbb00000000000000000000
% 0000000000000000
% 000000000077ee110000000000000000000000000000000000000000000000000000000000000000
% 0000000000000000000099bb00000000000000000000000000000000000000000000000000000000
% 0000000000000000000000000000000000000000000022ff44000000000000000000000000000000
% 00000000000000000000000000000000000000000000000000000055ee2200000000000000000000
% 0000000000000000
% 000000000000bbaa0000000000000000000000000000000000000000000000000000000000000000
% 0000000000000000000022ff44000000000000000000000000000000000000000000000000000000
% 0000000000000000000000000000000000000000000099bb00000000000000000000000000000000
% 000000000000000000000000000000000000000000000000000011ee770000000000000000000000
% 0000000000000000
% 00000000000033ff4400000000000000000000000000000000000000000000000000000000000000
% 000000000000000000000099bb000000000000000000000000000000000000000000000000000000
% 00000000000000000000000000000000000000000022ff4400000000000000000000000000000000
% 0000000000000000000000000000000000000000000000000000aabb000000000000000000000000
% 0000000000000000
% 0000000000000088dd11000000000000000000000000000000000000000000000000000000000000
% 000000000000000000000022ff440000000000000000000000000000000000000000000000000000
% 00000000000000000000000000000000000000000099bb0000000000000000000000000000000000
% 0000000000000000000000000000000000000000000000000055ff22000000000000000000000000
% 0000000000000000
% 0000000000000000cc88000000000000000000000000000000000000000000000000000000000000
% 00000000000000000000000099bb0000000000000000000000000000000000000000000000000000
% 000000000000000000000000000000000000000022ff440000000000000000000000000000000000
% 00000000000000000000000000000000000000000000000011dd8800000000000000000000000000
% 0000000000000000
% 000000000000000033ff440000000000000000000000000000000000000000000000000000000000
% 00000000000000000000000022ff4400000000000000000000000000000000000000000000000000
% 000000000000000000000000000000000000000099bb000000000000000000000000000000000000
% 00000000000000000000000000000000000000000000000088cc0000000000000000000000000000
% 0000000000000000
% 00000000000000000088dd0000000000000000000000000000000000000000000000000000000000
% 0000000000000000000000000099bb00000000000000000000000000000000000000000000000000
% 0000000000000000000000000000000000000022ff44000000000000000000000000000000000000
% 000000000000000000000000000000000000000000000044ff330000000000000000000000000000
% 0000000000000000
% 00000000000000000011dd8800000000000000000000000000000000000000000000000000000000
% 0000000000000000000000000022ff44000000000000000000000000000000000000000000000000
% 0000000000000000000000000000000000000099bb00000000000000000000000000000000000000
% 0000000000000000000000000000000000000000000000dd88000000000000000000000000000000
% 0000000000000000
% 0000000000000000000044ff33000000000000000000000000000000000000000000000000000000
% 000000000000000000000000000099bb000000000000000000000000000000000000000000000000
% 00000000000000000000000000000000000022ff4400000000000000000000000000000000000000
% 0000000000000000000000000000000000000000000088dd11000000000000000000000000000000
% 0000000000000000
% 000000000000000000000099cc000000000000000000000000000000000000000000000000000000
% 000000000000000000000000000022ff440000000000000000000000000000000000000000000000
% 00000000000000000000000000000000000099bb0000000000000000000000000000000000000000
% 00000000000000000000000000000000000000000033ff4400000000000000000000000000000000
% 0000000000000000
% 000000000000000000000011ee770000000000000000000000000000000000000000000000000000
% 00000000000000000000000000000099bb0000000000000000000000000000000000000000000000
% 000000000000000000000000000000000022ff440000000000000000000000000000000000000000
% 000000000000000000000000000000000000000011cc880000000000000000000000000000000000
% 0000000000000000
% 00000000000000000000000055ff6600000000000000000000000000000000000000000000000000
% 00000000000000000000000000000022ff4400000000000000000000000000000000000000000000
% 000000000000000000000000000000000099bb000000000000000000000000000000000000000000
% 0000000000000000000000000000000000000000aacc110000000000000000000000000000000000
% 0000000000000000
% 0000000000000000000000000066ff66000000000000000000000000000000000000000000000000
% 0000000000000000000000000000000099bb00000000000000000000000000000000000000000000
% 0000000000000000000000000000000022ff44000000000000000000000000000000000000000000
% 0000000000000000000000000000000000000099cc11000000000000000000000000000000000000
% 0000000000000000
% 000000000000000000000000000066ff550000000000000000000000000000000000000000000000
% 0000000000000000000000000000000022ff44000000000000000000000000000000000000000000
% 0000000000000000000000000000000099bb00000000000000000000000000000000000000000000
% 00000000000000000000000000000000000099ee3300000000000000000000000000000000000000
% 0000000000000000
% 00000000000000000000000000000066ee3300000000000000000000000000000000000000000000
% 000000000000000000000000000000000099bb000000000000000000000000000000000000000000
% 00000000000000000000000000000022ff4400000000000000000000000000000000000000000000
% 000000000000000000000000000000000099ee330000000000000000000000000000000000000000
% 0000000000000000
% 0000000000000000000000000000000088ee33000000000000000000000000000000000000000000
% 000000000000000000000000000000000022ff440000000000000000000000000000000000000000
% 00000000000000000000000000000099bb0000000000000000000000000000000000000000000000
% 0000000000000000000000000000000088ee33000000000000000000000000000000000000000000
% 0000000000000000
% 000000000000000000000000000000000099ee330000000000000000000000000000000000000000
% 00000000000000000000000000000000000099bb0000000000000000000000000000000000000000
% 000000000000000000000000000022ff440000000000000000000000000000000000000000000000
% 00000000000000000000000000000066ee3300000000000000000000000000000000000000000000
% 0000000000000000
% 00000000000000000000000000000000000099ee2200000000000000000000000000000000000000
% 00000000000000000000000000000000000022ff4400000000000000000000000000000000000000
% 000000000000000000000000000099bb000000000000000000000000000000000000000000000000
% 000000000000000000000000000066ff660000000000000000000000000000000000000000000000
% 0000000000000000
% 0000000000000000000000000000000000000099cc11000000000000000000000000000000000000
% 0000000000000000000000000000000000000099bb00000000000000000000000000000000000000
% 0000000000000000000000000022ff44000000000000000000000000000000000000000000000000
% 0000000000000000000000000066ff66000000000000000000000000000000000000000000000000
% 0000000000000000
% 0000000000000000000000000000000000000000cccc110000000000000000000000000000000000
% 0000000000000000000000000000000000000022ff44000000000000000000000000000000000000
% 0000000000000000000000000099bb00000000000000000000000000000000000000000000000000
% 00000000000000000000000055ff6600000000000000000000000000000000000000000000000000
% 0000000000000000
% 000000000000000000000000000000000000000011cccc1100000000000000000000000000000000
% 000000000000000000000000000000000000000099bb000000000000000000000000000000000000
% 00000000000000000000000022ff4400000000000000000000000000000000000000000000000000
% 000000000000000000000033ee660000000000000000000000000000000000000000000000000000
% 0000000000000000
% 00000000000000000000000000000000000000000011cccc22000000000000000000000000000000
% 000000000000000000000000000000000000000022ff440000000000000000000000000000000000
% 00000000000000000000000099bb0000000000000000000000000000000000000000000000000000
% 0000000000000000000066ee88000000000000000000000000000000000000000000000000000000
% 0000000000000000
% 0000000000000000000000000000000000000000000011aaee440000000000000000000000000000
% 00000000000000000000000000000000000000000099bb0000000000000000000000000000000000
% 000000000000000000000022ff440000000000000000000000000000000000000000000000000000
% 00000000000000000088ff6600000000000000000000000000000000000000000000000000000000
% 0000000000000000
% 00000000000000000000000000000000000000000000000088ff6600000000000000000000000000
% 00000000000000000000000000000000000000000022ff4400000000000000000000000000000000
% 000000000000000000000099bb000000000000000000000000000000000000000000000000000000
% 0000000000000011aaee330000000000000000000000000000000000000000000000000000000000
% 0000000000000000
% 0000000000000000000000000000000000000000000000000055ee99000000000000000000000000
% 0000000000000000000000000000000000000000000099bb00001122000000000000000000000000
% 0000000000000044000022ff44000000000000000000000000000000000000000000000000000000
% 00000000000033cccc11000000000000000000000000000000000000000000000000000000000000
% 0000000000000000
% 000000000000000000000000000000000000000000000000000033ddcc1100000000000000000000
% 0000000000000000000000000000000000000000000022ff5090f8ff000000000000000000000000
% 00000000000055ffe66699bb00000000000000000000000000000000000000000000000000000000
% 000000000055ee991100000000000000000000000000000000000000000000000000000000000000
% 0000000000000000
% 00000000000000000000000000000000000000000000000000000011bbee33000000000000000000
% 0000000000000000000000000000000000000000000011d3fbfbffff110000000000000000000000
% 00000000000088fffffbfc8f00000000000000000000000000000000000000000000000000000000
% 0000000088ff77000000000000000000000000000000000000000000000000000000000000000000
% 0000000000000000
% 000000000000000000000000000000000000000000000000000000000088ff660000000000000000
% 00000000000000000000000000000000000000001190f8fbffffffff440000000000000000000000
% 00000000000090fffffffffbe6550000000000000000000000000000000000000000000000000000
% 00001199ee4400000000000000000000000000000000000000000000000000000000000000000000
% 0000000000000000
% 00000000000000000000000000000000000000000000000000000000000066ff8800000000000000
% 000000000000000000000000000000000000000044fffffffffffff5550000000000000000000000
% 000000000000cdffffffffffffff0000000000000000000000000000000000000000000000000000
% 0022cccc220000000000000000000000000000000000000000000000000000000000000000000000
% 0000000000000000
% 0000000000000000000000000000000000000000000000000000000000000033eebb110000000000
% 000000000000000000000000000000000000000000a0fcffffffffff880000000000000000000000
% 000000000000ddfffffffffff9330000000000000000000000000000000000000000000000000000
% 44eeaa11000000000000000000000000000000000000000000000000000000000000000000000000
% 0000000000000000
% 000000000000000000000000000000000000000000000000000000000000000011ccee5500000000
% 00000000000000000000000000000000000000000000a0fcffffffff900000000000000000000000
% 000000000000fffffffffff533000000000000000000000000000000000000000000000000001188
% ff880000000000000000000000000000000000000000000000000000000000000000000000000000
% 0000000000000000
% 0000000000000000000000000000000000000000000000000000000000000000000088ffaa110000
% 0000000000000000000000000000000000000000000000a0fcffffffcd0000000000000000000000
% 000000000011fffffffff5330000000000000000000000000000000000000000000000000044dddd
% 44000000000000000000000000000000000000000000000000000000000000000000000000000000
% 0000000000000000
% 000000000000000000000000000000000000000000000000000000000000000000000022bbee5500
% 000000000000000000000000000000000000000000000000a0fcffffdd0000000000000000000000
% 000000000044fffffff5330000000000000000000000000000000000000000000000001188ff8800
% 00000000000000000000000000000000000000000000000000000000000000000000000000000000
% 0000000000000000
% 0000000000000000000000000000000000000000000000000000000000000000000000000077eeaa
% 2200000000000000000000000000000000000000000000000070fcffff0000000000000000000000
% 000000000055f2fff53300000000000000000000000000000000000000000000000044ddcc330000
% 00000000000000000000000000000000000000000000000000000000000000000000000000000000
% 0000000000000000
% 000000000000000000000000000000000000000000000000000000000000000000000000000022bb
% ee7700000000004411000000000000000000000000000000000066ffff2200000000445588888844
% 330000000088fff533000000000000000000000000000000000022330000000011aaff8800000000
% 00000000000000000000000000000000000000000000000000000000000000000000000000000000
% 0000000000000000
% 00000000000000000000000000000000000000000000000000000000000000000000000000000000
% 77eebb22000088ffa70000000000000000000000000000000000228fffa0aabbffffffccbb99bbdd
% ffffddbb99c0f969000000000000000000000000000000000033f5ff22000055eecc330000000000
% 00000000000000000000000000000000000000000000000000000000000000000000000000000000
% 0000000000000000
% 00000000000000000000000000000000000000000000000000000000000000000000000000000000
% 0022aaee7711f8fffca000000000000000000000000000003399ffeec09988664411000000000000
% 0033447788bbc0ffee88110000000000000000000000000011ebfffba711aaee8800000000000000
% 00000000000000000000000000000000000000000000000000000000000000000000000000000000
% 0000000000000000
% 00000000000000000000000000000000000000000000000000000000000000000000000000000000
% 00000055eecbfbfffffc80000000000000000000000055bbff994400000000000000000000000000
% 000000000000000066ddee99220000000000000000000011d7fcffffffe6bb220000000000000000
% 00000000000000000000000000000000000000000000000000000000000000000000000000000000
% 0000000000000000
% 00000000000000000000000000000000000000000000000000000000000000000000000000000000
% 0000000030ffffffffffff66000000000000000066ddee8822000000000000000000000000000000
% 0000000000000000000044bbffaa440000000000000000bbfcffffffffd700000000000000000000
% 00000000000000000000000000000000000000000000000000000000000000000000000000000000
% 0000000000000000
% 00000000000000000000000000000000000000000000000000000000000000000000000000000000
% 00000000c4ffffffffffffff44000000001188eedd88110000000000000000000000000000000000
% 0000000000000000000000002299ffbb550000000000a0fcfffffffffffb55000000000000000000
% 00000000000000000000000000000000000000000000000000000000000000000000000000000000
% 0000000000000000
% 00000000000000000000000000000000000000000000000000000000000000000000000000000000
% 00000044fffffffffffffffff633000011ccdd660000000000000000000000000000000000000000
% 00000000000000000000000000001188ee8800000090fcffffffffffffffe9000000000000000000
% 00000000000000000000000000000000000000000000000000000000000000000000000000000000
% 0000000000000000
% 00000000000000000000000000000000000000000000000000000000000000000000000000000000
% 00000033ddfffff5fffffffffff52211cccc11000000000000000000000000000000000000000000
% 0000000000000000000000000000000033ee990066fffffffffffffbfff6bb000000000000000000
% 00000000000000000000000000000000000000000000000000000000000000000000000000000000
% 0000000000000000
% 00000000000000000000000000000000000000000000000000000000000000000000000000000000
% 000000000000335588bbe9ffffffd1cccc1100000000000000000000000000000000000000000000
% 000000000000000000000000000000000033eeaeffffffffcda78844110000000000000000000000
% 00000000000000000000000000000000000000000000000000000000000000000000000000000000
% 0000000000000000
% 00000000000000000000000000000000000000000000000000000000000000000000000000000000
% 0000000000000000000000004470ddcc110000000000000000000000000000000000000000000000
% 00000000000000000000000000000000000033eed055220000000000000000000000000000000000
% 00000000000000000000000000000000000000000000000000000000000000000000000000000000
% 0000000000000000
% 00000000000000000000000000000000000000000000000000000000000000000000000000000000
% 00000000000000000000000011cccc11000000000000000000000000000000000000000000000000
% 0000000000000000000000000000000000000033ee99000000000000000000000000000000000000
% 00000000000000000000000000000000000000000000000000000000000000000000000000000000
% 0000000000000000
% 00000000000000000000000000000000000000000000000000000000000000000000000000000000
% 000000000000000000000011cccc1100000000000000000000000000000000000000000000000000
% 000000000000000000000000000000000000000033ee880000000000000000000000000000000000
% 00000000000000000000000000000000000000000000000000000000000000000000000000000000
% 0000000000000000
% 00000000000000000000000000000000000000000000000000000000000000000000000000000000
% 000000000000000000000055dd110000000000000000000000000000000000000000000000000000
% 00000000000000000000000000000000000000000055ee0000000000000000000000000000000000
% 00000000000000000000000000000000000000000000000000000000000000000000000000000000
% 0000000000000000
% 00000000000000000000000000000000000000000000000000000000000000000000000000000000
% 00000000000000000000009999000000000000000000000000000000000000000000000000000000
% 00000000000000000000000000000000000000000000ee5500000000000000000000000000000000
% 00000000000000000000000000000000000000000000000000000000000000000000000000000000
% 0000000000000000
% 00000000000000000000000000000000000000000000000000000000000000000000000000000000
% 0000000000000000000000ee55000000000000000000000000000000000000000000000000000000
% 00000000000000000000000000000000000000000000998800000000000000000000000000000000
% 00000000000000000000000000000000000000000000000000000000000000000000000000000000
% 0000000000000000
% 00000000000000000000000000000000000000000000000000000000000000000000000000000000
% 0000000000000000000044ff000000000000000000000000000000ee330000000000000000000000
% 0000000000000000000000000000000000000000000066dd00000000000000000000000000000000
% 00000000000000000000000000000000000000000000000000000000000000000000000000000000
% 0000000000000000
% 00000000000000000000000000000000000000000000000000000000000000000000000000000000
% 0000000000000000000088aa00000000000000000000000000000077110000000000000000000000
% 0000000000000000000000000000000000000000000011ff33000000000000000000000000000000
% 00000000000000000000000000000000000000000000000000000000000000000000000000000000
% 0000000000000000
% 00000000000000000000000000000000000000000000000000000000000000000000000000000000
% 00000000000000000000dd6600000000000000000000000000000022220000000000000000000000
% 0000000000000000000000000000000000000000000000bb77000000000000000000000000000000
% 00000000000000000000000000000000000000000000000000000000000000000000000000000000
% 0000000000000000
% 00000000000000000000000000000000000000000000000000000000000000000000000000000000
% 00000000000000000022ff22000000000000000000000000000044ff4400118888cc880088ff5500
% 22cc22118888cc8800000000000000000000000000000077bb000000000000000000000000000000
% 00000000000000000000000000000000000000000000000000000000000000000000000000000000
% 0000000000000000
% 00000000000000000000000000000000000000000000000000000000000000000000000000000000
% 00000000000000000022ff22000000000000000000000000000000ff440022990044ff0000dd6600
% 22660022990044ff00000000000000000000000000000077bb000000000000000000000000000000
% 00000000000000000000000000000000000000000000000000000000000000000000000000000000
% 0000000000000000
% 00000000000000000000000000000000000000000000000000000000000000000000000000000000
% 00000000000000000000dd66000000000000000000000000000000ff440000114477ff000066dd00
% 88110000114477ff000000000000000000000000000000bb77000000000000000000000000000000
% 00000000000000000000000000000000000000000000000000000000000000000000000000000000
% 0000000000000000
% 00000000000000000000000000000000000000000000000000000000000000000000000000000000
% 0000000000000000000088aa000000000000000000000000000000ff440055660044ff000000ee44
% 88000055660044ff000000000000000000000000000011ff33000000000000000000000000000000
% 00000000000000000000000000000000000000000000000000000000000000000000000000000000
% 0000000000000000
% 00000000000000000000000000000000000000000000000000000000000000000000000000000000
% 0000000000000000000044ff000000000000000000000000000000ff4400ee550055ff00000088ee
% 220000ee550055ff000000000000000000000000000066dd00000000000000000000000000000000
% 00000000000000000000000000000000000000000000000000000000000000000000000000000000
% 0000000000000000
% 00000000000000000000000000000000000000000000000000000000000000000000000000000000
% 0000000000000000000000ee550000000000000000000000000000ff440099ee8866ff88000011bb
% 00000099ee8866ff8800000000000000000000000000998800000000000000000000000000000000
% 00000000000000000000000000000000000000000000000000000000000000000000000000000000
% 0000000000000000
% 00000000000000000000000000000000000000000000000000000000000000000000000000000000
% 000000000000000000000099990000000000000000000000000000ff440000000000000000000011
% 00000000000000000000000000000000000000000000ee5500000000000000000000000000000000
% 00000000000000000000000000000000000000000000000000000000000000000000000000000000
% 0000000000000000
% 00000000000000000000000000000000000000000000000000000000000000000000000000000000
% 000000000000000000000055dd1100000000000000000000002200ff110000000000000000000000
% 00000000000000000000000000000000000000000055ee0000000000000000000000000000000000
% 00000000000000000000000000000000000000000000000000000000000000000000000000000000
% 0000000000000000
% 00000000000000000000000000000000000000000000000000000000000000000000000000000000
% 000000000000000000000011cccc1100000000000000000022dd8866000000000000000000000000
% 000000000000000000000000000000000000000033ee880000000000000000000000000000000000
% 00000000000000000000000000000000000000000000000000000000000000000000000000000000
% 0000000000000000
% 00000000000000000000000000000000000000000000000000000000000000000000000000000000
% 00000000000000000000000011cccc11000000000000000000000000000000000000000000000000
% 0000000000000000000000000000000000000033ee99000000000000000000000000000000000000
% 00000000000000000000000000000000000000000000000000000000000000000000000000000000
% 0000000000000000
% 00000000000000000000000000000000000000000000000000000000000000000000000000000000
% 0000000000000000000000000011cccc110000000000000000000000000000000000000000000000
% 00000000000000000000000000000000000033ee9900000000000000000000000000000000000000
% 00000000000000000000000000000000000000000000000000000000000000000000000000000000
% 0000000000000000
% 00000000000000000000000000000000000000000000000000000000000000000000000000000000
% 000000000000000000000000000011cccc1100000000000000000000000000000000000000000000
% 000000000000000000000000000000000033ee990000000000000000000000000000000000000000
% 00000000000000000000000000000000000000000000000000000000000000000000000000000000
% 0000000000000000
% 00000000000000000000000000000000000000000000000000000000000000000000000000000000
% 00000000000000000000000000000011cccc11000000000000000000000000000000000000000000
% 0000000000000000000000000000000033ee99000000000000000000000000000000000000000000
% 00000000000000000000000000000000000000000000000000000000000000000000000000000000
% 0000000000000000
% 00000000000000000000000000000000000000000000000000000000000000000000000000000000
% 0000000000000000000000000000000011ccdd660000000000000000000000000000000000000000
% 00000000000000000000000000001188ee8800000000000000000000000000000000000000000000
% 00000000000000000000000000000000000000000000000000000000000000000000000000000000
% 0000000000000000
% 00000000000000000000000000000000000000000000000000000000000000000000000000000000
% 00000000000000000000000000000000001188eedd88110000000000000000000000000000000000
% 0000000000000000000000002299ffbb550000000000000000000000000000000000000000000000
% 00000000000000000000000000000000000000000000000000000000000000000000000000000000
% 0000000000000000
% 00000000000000000000000000000000000000000000000000000000000000000000000000000000
% 000000000000000000000000000000000000000066ddee8822000000000000000000000000000000
% 0000000000000000000044bbffaa4400000000000000000000000000000000000000000000000000
% 00000000000000000000000000000000000000000000000000000000000000000000000000000000
% 0000000000000000
% 00000000000000000000000000000000000000000000000000000000000000000000000000000000
% 0000000000000000000000000000000000000000000055bbff994400000000000000000000000000
% 000000000000000066ddee9922000000000000000000000000000000000000000000000000000000
% 00000000000000000000000000000000000000000000000000000000000000000000000000000000
% 0000000000000000
% 00000000000000000000000000000000000000000000000000000000000000000000000000000000
% 0000000000000000000000000000000000000000000000003399ffeebb9988664411000000000000
% 0033447788bbbbffee88110000000000000000000000000000000000000000000000000000000000
% 00000000000000000000000000000000000000000000000000000000000000000000000000000000
% 0000000000000000
% 00000000000000000000000000000000000000000000000000000000000000000000000000000000
% 000000000000000000000000000000000000000000000000000022447788b0cdffffffccbb99bbdd
% ffffe4de998855440000000000000000000000000000000000000000000000000000000000000000
% 00000000000000000000000000000000000000000000000000000000000000000000000000000000
% 0000000000000000
% 00000000000000000000000000000000000000000000000000000000000000000000000000000000
% 00000000000000000000000000000000000000000000000000000000000044ff0000445588888844
% 330090ff330000000000000000000000000000000000000000000000000000000000000000000000
% 00000000000000000000000000000000000000000000000000000000000000000000000000000000
% 0000000000000000
% 00000000000000000000000000000000000000000000000000000000000000000000000000000000
% 00000000000000000000000000000000000000000000000000000000000044dd0000000000000000
% 0000e9ffa00000000000000000000000000000000000000000000000000000000000000000000000
% 00000000000000000000000000000000000000000000000000000000000000000000000000000000
% 0000000000000000
% 00000000000000000000000000000000000000000000000000000000000000000000000000000000
% 00000000000000000000000000000000000000000000000000000000000044bb0000000000000000
% 0022fffff81100000000000000000000000000000000000000000000000000000000000000000000
% 00000000000000000000000000000000000000000000000000000000000000000000000000000000
% 0000000000000000
% 00000000000000000000000000000000000000000000000000000000000000000000000000000000
% 00000000000000000000000000000000000000000000000000000000000088bb0000000000000000
% 0066f9fffb7700000000000000000000000000000000000000000000000000000000000000000000
% 00000000000000000000000000000000000000000000000000000000000000000000000000000000
% 0000000000000000
% 00000000000000000000000000000000000000000000000000000000000000000000000000000000
% 00000000000000000000000000000000000000000000000000000000000088bb0000000000000000
% 00bbffffffeb00000000000000000000000000000000000000000000000000000000000000000000
% 00000000000000000000000000000000000000000000000000000000000000000000000000000000
% 0000000000000000
% 00000000000000000000000000000000000000000000000000000000000000000000000000000000
% 00000000000000000000000000000000000000000000000000000000000088aa0000000000000000
% 00f6fffffffb55000000000000000000000000000000000000000000000000000000000000000000
% 00000000000000000000000000000000000000000000000000000000000000000000000000000000
% 0000000000000000
% 00000000000000000000000000000000000000000000000000000000000000000000000000000000
% 00000000000000000000000000000000000000000000000000000000000088880000000000000000
% 44ffffffffffc9000000000000000000000000000000000000000000000000000000000000000000
% 00000000000000000000000000000000000000000000000000000000000000000000000000000000
% 0000000000000000
% 00000000000000000000000000000000000000000000000000000000000000000000000000000000
% 000000000000000000000000000000000000000000000000000000000000aa880000000000000000
% 88ffffffffffff220000000000000000000000000000000000000000000000000000000000000000
% 00000000000000000000000000000000000000000000000000000000000000000000000000000000
% 0000000000000000
% 00000000000000000000000000000000000000000000000000000000000000000000000000000000
% 000000000000000000000000000000000000000000000000000000000000bb880000000000000000
% daffffffffffffa00000000000000000000000000000000000000000000000000000000000000000
% 00000000000000000000000000000000000000000000000000000000000000000000000000000000
% 0000000000000000
% 00000000000000000000000000000000000000000000000000000000000000000000000000000000
% 000000000000000000000000000000000000000000000000000000000000bb880000000000000011
% fffffff8f0ffffda0000000000000000000000000000000000000000000000000000000000000000
% 00000000000000000000000000000000000000000000000000000000000000000000000000000000
% 0000000000000000
% 00000000000000000000000000000000000000000000000000000000000000000000000000000000
% 000000000000000000000000000000000000000000000000000000000000bb440000000000000000
% 778888d7a84444110000000000000000000000000000000000000000000000000000000000000000
% 00000000000000000000000000000000000000000000000000000000000000000000000000000000
% 0000000000000000
% 00000000000000000000000000000000000000000000000000000000000000000000000000000000
% 000000000000000000000000000000000000000000000000000000000000dd440000000000000000
% 000000bb880000000000000000000000000000000000000000000000000000000000000000000000
% 00000000000000000000000000000000000000000000000000000000000000000000000000000000
% 0000000000000000
% 00000000000000000000000000000000000000000000000000000000000000000000000000000000
% 000000000000000000000000000000000000000000000000000000000000ff440000000000000000
% 000000bb880000000000000000000000000000000000000000000000000000000000000000000000
% 00000000000000000000000000000000000000000000000000000000000000000000000000000000
% 0000000000000000
% 00000000000000000000000000000000000000000000000000000000000000000000000000000000
% 000000000000000000000000000000000000000000000000000000000000ff440000000000000000
% 000000bb880000000000000000000000000000000000000000000000000000000000000000000000
% 00000000000000000000000000000000000000000000000000000000000000000000000000000000
% 0000000000000000
% 00000000000000000000000000000000000000000000000000000000000000000000000000000000
% 000000000000000000000000000000000000000000000000000000000000ff440000000000000000
% 000000bb880000000000000000000000000000000000000000000000000000000000000000000000
% 00000000000000000000000000000000000000000000000000000000000000000000000000000000
% 0000000000000000
% 00000000000000000000000000000000000000000000000000000000000000000000000000000000
% 000000000000000000000000000000000000000000000000000000000000ff440000000000000000
% 000000aa880000000000000000000000000000000000000000000000000000000000000000000000
% 00000000000000000000000000000000000000000000000000000000000000000000000000000000
% 0000000000000000
% 00000000000000000000000000000000000000000000000000000000000000000000000000000000
% 000000000000000000000000000000000000000000000000000000000000ff440000000000000000
% 00000088880000000000000000000000000000000000000000000000000000000000000000000000
% 00000000000000000000000000000000000000000000000000000000000000000000000000000000
% 0000000000000000
% 00000000000000000000000000000000000000000000000000000000000000000000000000000000
% 000000000000000000000000000000000000000000000000000000000000ff440000000000000000
% 00000088880000000000000000000000000000000000000000000000000000000000000000000000
% 00000000000000000000000000000000000000000000000000000000000000000000000000000000
% 0000000000000000
% 00000000000000000000000000000000000000000000000000000000000000000000000000000000
% 000000000000000000000000000000000000000000000000000000000000ff440000000000000000
% 00000088880000000000000000000000000000000000000000000000000000000000000000000000
% 00000000000000000000000000000000000000000000000000000000000000000000000000000000
% 0000000000000000
% 00000000000000000000000000000000000000000000000000000000000000000000000000000000
% 000000000000000000000000000000000000000000000000000000000000ff440000000000000000
% 00000088880000000000000000000000000000000000000000000000000000000000000000000000
% 00000000000000000000000000000000000000000000000000000000000000000000000000000000
% 0000000000000000
% 00000000000000000000000000000000000000000000000000000000000000000000000000000000
% 000000000000000000000000000000000000000000000000000000000000ff440000000000000000
% 00000088880000000000000000000000000000000000000000000000000000000000000000000000
% 00000000000000000000000000000000000000000000000000000000000000000000000000000000
% 0000000000000000
% 00000000000000000000000000000000000000000000000000000000000000000000000000000000
% 000000000000000000000000000000000000000000000000000000000000ff440000000000000000
% 00000088880000000000000000000000000000000000000000000000000000000000000000000000
% 00000000000000000000000000000000000000000000000000000000000000000000000000000000
% 0000000000000000
% 00000000000000000000000000000000000000000000000000000000000000000000000000000000
% 000000000000000000000000000000000000000000000000000000000000bb440000000000000000
% 00000088880000000000000000000000000000000000000000000000000000000000000000000000
% 00000000000000000000000000000000000000000000000000000000000000000000000000000000
% 0000000000000000
% 00000000000000000000000000000000000000000000000000000000000000000000000000000000
% 000000000000000000000000000000000000000000000000000000000000bb440000000000000000
% 00000088880000000000000000000000000000000000000000000000000000000000000000000000
% 00000000000000000000000000000000000000000000000000000000000000000000000000000000
% 0000000000000000
% 00000000000000000000000000000000000000000000000000000000000000000000000000000000
% 000000000000000000000000000000000000000000000000000000000000bb440000000000000000
% 000000aa880000000000000000000000000000000000000000000000000000000000000000000000
% 00000000000000000000000000000000000000000000000000000000000000000000000000000000
% 0000000000000000
% 00000000000000000000000000000000000000000000000000000000000000000000000000000000
% 000000000000000000000000000000000000000000000000000000000000c4764444330000000000
% 000000bb880000000000000000000000000000000000000000000000000000000000000000000000
% 00000000000000000000000000000000000000000000000000000000000000000000000000000000
% 0000000000000000
% 00000000000000000000000000000000000000000000000000000000000000000000000000000000
% 000000000000000000000000000000000000000000000000000022fffffffffffbf6cd0000000000
% 000000bb770000000000000000000000000000000000000000000000000000000000000000000000
% 00000000000000000000000000000000000000000000000000000000000000000000000000000000
% 0000000000000000
% 00000000000000000000000000000000000000000000000000000000000000000000000000000000
% 000000000000000000000000000000000000000000000000000011fffffffffffffb880000000000
% 000000bb440000000000000000000000000000000000000000000000000000000000000000000000
% 00000000000000000000000000000000000000000000000000000000000000000000000000000000
% 0000000000000000
% 00000000000000000000000000000000000000000000000000000000000000000000000000000000
% 000000000000000000000000000000000000000000000000000000a7ffffffffffff330000000000
% 000000ee440000000000000000000000000000000000000000000000000000000000000000000000
% 00000000000000000000000000000000000000000000000000000000000000000000000000000000
% 0000000000000000
% 00000000000000000000000000000000000000000000000000000000000000000000000000000000
% 00000000000000000000000000000000000000000000000000000033fffffffffff6000000000000
% 000000ff440000000000000000000000000000000000000000000000000000000000000000000000
% 00000000000000000000000000000000000000000000000000000000000000000000000000000000
% 0000000000000000
% 00000000000000000000000000000000000000000000000000000000000000000000000000000000
% 00000000000000000000000000000000000000000000000000000000cdffffffffa7000000000000
% 000000ff440000000000000000000000000000000000000000000000000000000000000000000000
% 00000000000000000000000000000000000000000000000000000000000000000000000000000000
% 0000000000000000
% 00000000000000000000000000000000000000000000000000000000000000000000000000000000
% 0000000000000000000000000000000000000000000000000000000066fcfffffb66000000000000
% 000000ff000000000000000000000000000000000000000000000000000000000000000000000000
% 00000000000000000000000000000000000000000000000000000000000000000000000000000000
% 0000000000000000
% 00000000000000000000000000000000000000000000000000000000000000000000000000000000
% 0000000000000000000000000000000000000000000000000000000000ebffffff22000000000000
% 000022ff000000000000000000000000000000000000000000000000000000000000000000000000
% 00000000000000000000000000000000000000000000000000000000000000000000000000000000
% 0000000000000000
% 00000000000000000000000000000000000000000000000000000000000000000000000000000000
% 000000000000000000000000000000000000000000000000000000000088fdffdd00000000000000
% 000044ff000000000000000000000000000000000000000000000000000000000000000000000000
% 00000000000000000000000000000000000000000000000000000000000000000000000000000000
% 0000000000000000
% 00000000000000000000000000000000000000000000000000000000000000000000000000000000
% 000000000000000000000000000000000000000000000000000000000011ffff9000000000000000
% 000044ff000000000000000000000000000000000000000000000000000000000000000000000000
% 00000000000000000000000000000000000000000000000000000000000000000000000000000000
% 0000000000000000
% 00000000000000000000000000000000000000000000000000000000000000000000000000000000
% 000000000000000000000000000000000000000000000000000000000000a7ff5500445588888844
% 330044bb000000000000000000000000000000000000000000000000000000000000000000000000
% 00000000000000000000000000000000000000000000000000000000000000000000000000000000
% 0000000000000000
% 00000000000000000000000000000000000000000000000000000000000000000000000000000000
% 000000000000000000000000000000000000000000000000000022447788bbecffffffccbb99bbdd
% ffffe2d7998855440000000000000000000000000000000000000000000000000000000000000000
% 00000000000000000000000000000000000000000000000000000000000000000000000000000000
% 0000000000000000
% 00000000000000000000000000000000000000000000000000000000000000000000000000000000
% 0000000000000000000000000000000000000000000000003399ffeebb9988664411000000000000
% 0033447788bbbbffee88110000000000000000000000000000000000000000000000000000000000
% 00000000000000000000000000000000000000000000000000000000000000000000000000000000
% 0000000000000000
% 00000000000000000000000000000000000000000000000000000000000000000000000000000000
% 0000000000000000000000000000000000000000000055bbff994400000000000000000000000000
% 000000000000000066ddee9922000000000000000000000000000000000000000000000000000000
% 00000000000000000000000000000000000000000000000000000000000000000000000000000000
% 0000000000000000
% 00000000000000000000000000000000000000000000000000000000000000000000000000000000
% 000000000000000000000000000000000000000066ddee8822000000000000000000000000000000
% 0000000000000000000044bbffaa4400000000000000000000000000000000000000000000000000
% 00000000000000000000000000000000000000000000000000000000000000000000000000000000
% 0000000000000000
% 00000000000000000000000000000000000000000000000000000000000000000000000000000000
% 00000000000000000000000000000000001188eedd88110000000000000000000000000000000000
% 0000000000000000000000002299ffbb550000000000000000000000000000000000000000000000
% 00000000000000000000000000000000000000000000000000000000000000000000000000000000
% 0000000000000000
% 00000000000000000000000000000000000000000000000000000000000000000000000000000000
% 0000000000000000000000000000000011ccdd660000000000000000000000000000000000000000
% 00000000000000000000000000001188ee8800000000000000000000000000000000000000000000
% 00000000000000000000000000000000000000000000000000000000000000000000000000000000
% 0000000000000000
% 00000000000000000000000000000000000000000000000000000000000000000000000000000000
% 00000000000000000000000000000011cccc11000000000000000000000000000000000000000000
% 0000000000000000000000000000000033ee99000000000000000000000000000000000000000000
% 00000000000000000000000000000000000000000000000000000000000000000000000000000000
% 0000000000000000
% 00000000000000000000000000000000000000000000000000000000000000000000000000000000
% 000000000000000000000000000011cccc1100000000000000000000000000000000000000000000
% 000000000000000000000000000000000033ee990000000000000000000000000000000000000000
% 00000000000000000000000000000000000000000000000000000000000000000000000000000000
% 0000000000000000
% 00000000000000000000000000000000000000000000000000000000000000000000000000000000
% 0000000000000000000000000011cccc110000000000000000000000000000000000000000000000
% 00000000000000000000000000000000000033ee9900000000000000000000000000000000000000
% 00000000000000000000000000000000000000000000000000000000000000000000000000000000
% 0000000000000000
% 00000000000000000000000000000000000000000000000000000000000000000000000000000000
% 00000000000000000000000011cccc11000000000000000000000000000000000000000000000000
% 0000000000000000000000000000000000000033ee99000000000000000000000000000000000000
% 00000000000000000000000000000000000000000000000000000000000000000000000000000000
% 0000000000000000
% 00000000000000000000000000000000000000000000000000000000000000000000000000000000
% 000000000000000000000011cccc1100000000000000000000000000000000000000000000000000
% 000000000000000000000000000000000000000033ee880000000000000000000000000000000000
% 00000000000000000000000000000000000000000000000000000000000000000000000000000000
% 0000000000000000
% 00000000000000000000000000000000000000000000000000000000000000000000000000000000
% 000000000000000000000055dd110000000000000000000000000000000000000000000000000000
% 00000000000000000000000000000000000000000055ee0000000000000000000000000000000000
% 00000000000000000000000000000000000000000000000000000000000000000000000000000000
% 0000000000000000
% 00000000000000000000000000000000000000000000000000000000000000000000000000000000
% 00000000000000000000009999000000000000000000000000000000000000000000000000000000
% 00000000000000000000000000000000000000000000ee5500000000000000000000000000000000
% 00000000000000000000000000000000000000000000000000000000000000000000000000000000
% 0000000000000000
% 00000000000000000000000000000000000000000000000000000000000000000000000000000000
% 0000000000000000000000ee55000000000000000000000000000000000000000000000000000000
% 00000000000000000000000000000000000000000000998800000000000000000000000000000000
% 00000000000000000000000000000000000000000000000000000000000000000000000000000000
% 0000000000000000
% 00000000000000000000000000000000000000000000000000000000000000000000000000000000
% 0000000000000000000044ff00000000000000000000000000000000000066ee0000000000000000
% 0000000000000000000000000000000000000000000066dd00000000000000000000000000000000
% 00000000000000000000000000000000000000000000000000000000000000000000000000000000
% 0000000000000000
% 00000000000000000000000000000000000000000000000000000000000000000000000000000000
% 0000000000000000000088aa00000000000000000000000000000000000022770000000000000000
% 0000000000000000000000000000000000000000000011ff33000000000000000000000000000000
% 00000000000000000000000000000000000000000000000000000000000000000000000000000000
% 0000000000000000
% 00000000000000000000000000000000000000000000000000000000000000000000000000000000
% 00000000000000000000dd6600000000000000000000000000000000000000550000000000000000
% 0000000000000000000000000000000000000000000000bb77000000000000000000000000000000
% 00000000000000000000000000000000000000000000000000000000000000000000000000000000
% 0000000000000000
% 00000000000000000000000000000000000000000000000000000000000000000000000000000000
% 00000000000000000022ff2200000000000000000000000000000000001199ff000088aa88bb6600
% 44aa7799dd00000000000000000000000000000000000077bb000000000000000000000000000000
% 00000000000000000000000000000000000000000000000000000000000000000000000000000000
% 0000000000000000
% 00000000000000000000000000000000000000000000000000000000000000000000000000000000
% 00000000000000000022ff2200000000000000000000000000000000000044ff0000aa220044ff00
% 00ff55003300000000000000000000000000000000000077bb000000000000000000000000000000
% 00000000000000000000000000000000000000000000000000000000000000000000000000000000
% 0000000000000000
% 00000000000000000000000000000000000000000000000000000000000000000000000000000000
% 00000000000000000000dd6600000000000000000000000000000000000044ff000000114477ff00
% 00ff440000000000000000000000000000000000000000bb77000000000000000000000000000000
% 00000000000000000000000000000000000000000000000000000000000000000000000000000000
% 0000000000000000
% 00000000000000000000000000000000000000000000000000000000000000000000000000000000
% 0000000000000000000088aa00000000000000000000000000000000000044ff000055660044ff00
% 00ff440000000000000000000000000000000000000011ff33000000000000000000000000000000
% 00000000000000000000000000000000000000000000000000000000000000000000000000000000
% 0000000000000000
% 00000000000000000000000000000000000000000000000000000000000000000000000000000000
% 0000000000000000000044ff00000000000000000000000000000000000044ff0000ee550055ff00
% 00ff440000000000000000000000000000000000000066dd00000000000000000000000000000000
% 00000000000000000000000000000000000000000000000000000000000000000000000000000000
% 0000000000000000
% 00000000000000000000000000000000000000000000000000000000000000000000000000000000
% 0000000000000000000000ee55000000000000000000000000000000000044ff000099ee8877ff66
% 44ff9933000000000000000000000000000000000000998800000000000000000000000000000000
% 00000000000000000000000000000000000000000000000000000000000000000000000000000000
% 0000000000000000
% 00000000000000000000000000000000000000000000000000000000000000000000000000000000
% 00000000000000000000009999000000000000000000000000000000000044ff0000000000000000
% 00000000000000000000000000000000000000000000ee5500000000000000000000000000000000
% 00000000000000000000000000000000000000000000000000000000000000000000000000000000
% 0000000000000000
% 00000000000000000000000000000000000000000000000000000000000000000000000000000000
% 000000000000000000000055dd110000000000000000000000000000221144cc0000000000000000
% 00000000000000000000000000000000000000000055ee0000000000000000000000000000000000
% 00000000000000000000000000000000000000000000000000000000000000000000000000000000
% 0000000000000000
% 00000000000000000000000000000000000000000000000000000000000000000000000000000000
% 000000000000000000000011cccc110000000000000000000000000088cc88330000000000000000
% 000000000000000000000000000000000000000033ee880000000000000000000000000000000000
% 00000000000000000000000000000000000000000000000000000000000000000000000000000000
% 0000000000000000
% 00000000000000000000000000000000000000000000000000000000000000000000000000000000
% 00000000000000000000000011cccc11000000000000000000000000000000000000000000000000
% 0000000000000000000000000000000000000033ee99000000000000000000000000000000000000
% 00000000000000000000000000000000000000000000000000000000000000000000000000000000
% 0000000000000000
% 00000000000000000000000000000000000000000000000000000000000000000000000000000000
% 0000000000000000000000000011cccc110000000000000000000000000000000000000000000000
% 00000000000000000000000000000000000033ee9900000000000000000000000000000000000000
% 00000000000000000000000000000000000000000000000000000000000000000000000000000000
% 0000000000000000
% 00000000000000000000000000000000000000000000000000000000000000000000000000000000
% 000000000000000000000000000011cccc1100000000000000000000000000000000000000000000
% 000000000000000000000000000000000033ee990000000000000000000000000000000000000000
% 00000000000000000000000000000000000000000000000000000000000000000000000000000000
% 0000000000000000
% 00000000000000000000000000000000000000000000000000000000000000000000000000000000
% 00000000000000000000000000000011cccc11000000000000000000000000000000000000000000
% 0000000000000000000000000000000033ee99000000000000000000000000000000000000000000
% 00000000000000000000000000000000000000000000000000000000000000000000000000000000
% 0000000000000000
% 00000000000000000000000000000000000000000000000000000000000000000000000000000000
% 0000000000000000000000000000000011ccdd660000000000000000000000000000000000000000
% 00000000000000000000000000001188ee8800000000000000000000000000000000000000000000
% 00000000000000000000000000000000000000000000000000000000000000000000000000000000
% 0000000000000000
% 00000000000000000000000000000000000000000000000000000000000000000000000000000000
% 00000000000000000000000000000000001188eedd88110000000000000000000000000000000000
% 0000000000000000000000002299ffbb550000000000000000000000000000000000000000000000
% 00000000000000000000000000000000000000000000000000000000000000000000000000000000
% 0000000000000000
% 00000000000000000000000000000000000000000000000000000000000000000000000000000000
% 000000000000000000000000000000000000000066ddee8822000000000000000000000000000000
% 0000000000000000000044bbffaa4400000000000000000000000000000000000000000000000000
% 00000000000000000000000000000000000000000000000000000000000000000000000000000000
% 0000000000000000
% 00000000000000000000000000000000000000000000000000000000000000000000000000000000
% 0000000000000000000000000000000000000000000055bbff994400000000000000000000000000
% 000000000000000066ddee9922000000000000000000000000000000000000000000000000000000
% 00000000000000000000000000000000000000000000000000000000000000000000000000000000
% 0000000000000000
% 00000000000000000000000000000000000000000000000000000000000000000000000000000000
% 0000000000000000000000000000000000000000000000003399ffeebb9988664411000000000000
% 0033447788bbbbffee88110000000000000000000000000000000000000000000000000000000000
% 00000000000000000000000000000000000000000000000000000000000000000000000000000000
% 0000000000000000
% 00000000000000000000000000000000000000000000000000000000000000000000000000000000
% 000000000000000000000000000000000000000000000000000022447788aabbffffffccbb99bbdd
% ffffddbb998855440000000000000000000000000000000000000000000000000000000000000000
% 00000000000000000000000000000000000000000000000000000000000000000000000000000000
% 0000000000000000
% 00000000000000000000000000000000000000000000000000000000000000000000000000000000
% 00000000000000000000000000000000000000000000000000000000000000000000445588888844
% 33000000000000000000000000000000000000000000000000000000000000000000000000000000
% 00000000000000000000000000000000000000000000000000000000000000000000000000000000
% 0000000000000000
%%EndImage
%%EndPreview
save countdictstack mark newpath /showpage {} def /setpagedevice /pop load def
%%EndProlog
%%Page 1 1
save
/DotDict 200 dict def
DotDict begin

/setupLatin1 {
mark
/EncodingVector 256 array def
 EncodingVector 0

ISOLatin1Encoding 0 255 getinterval putinterval
EncodingVector 45 /hyphen put

% Set up ISO Latin 1 character encoding
/starnetISO {
        dup dup findfont dup length dict begin
        { 1 index /FID ne { def }{ pop pop } ifelse
        } forall
        /Encoding EncodingVector def
        currentdict end definefont
} def
/Times-Roman starnetISO def
/Times-Italic starnetISO def
/Times-Bold starnetISO def
/Times-BoldItalic starnetISO def
/Helvetica starnetISO def
/Helvetica-Oblique starnetISO def
/Helvetica-Bold starnetISO def
/Helvetica-BoldOblique starnetISO def
/Courier starnetISO def
/Courier-Oblique starnetISO def
/Courier-Bold starnetISO def
/Courier-BoldOblique starnetISO def
cleartomark
} bind def

/coord-font-family /Times-Roman def
/default-font-family /Times-Roman def
/coordfont coord-font-family findfont 8 scalefont def

/InvScaleFactor 1.0 def
/set_scale {
       dup 1 exch div /InvScaleFactor exch def
       scale
} bind def

% styles
/solid { [] 0 setdash } bind def
/dashed { [9 InvScaleFactor mul dup ] 0 setdash } bind def
/dotted { [1 InvScaleFactor mul 6 InvScaleFactor mul] 0 setdash } bind def
/invis {/fill {newpath} def /stroke {newpath} def /show {pop newpath} def} bind def
/bold { 2 setlinewidth } bind def
/filled { } bind def
/unfilled { } bind def
/rounded { } bind def
/diagonals { } bind def

% hooks for setting color 
/nodecolor { sethsbcolor } bind def
/edgecolor { sethsbcolor } bind def
/graphcolor { sethsbcolor } bind def
/nopcolor {pop pop pop} bind def

/beginpage {	% i j npages
	/npages exch def
	/j exch def
	/i exch def
	/str 10 string def
	npages 1 gt {
		gsave
			coordfont setfont
			0 0 moveto
			(\() show i str cvs show (,) show j str cvs show (\)) show
		grestore
	} if
} bind def

/set_font {
	findfont exch
	scalefont setfont
} def

% draw text fitted to its expected width
/alignedtext {			% width text
	/text exch def
	/width exch def
	gsave
		width 0 gt {
			[] 0 setdash
			text stringwidth pop width exch sub text length div 0 text ashow
		} if
	grestore
} def

/boxprim {				% xcorner ycorner xsize ysize
		4 2 roll
		moveto
		2 copy
		exch 0 rlineto
		0 exch rlineto
		pop neg 0 rlineto
		closepath
} bind def

/ellipse_path {
	/ry exch def
	/rx exch def
	/y exch def
	/x exch def
	matrix currentmatrix
	newpath
	x y translate
	rx ry scale
	0 0 1 0 360 arc
	setmatrix
} bind def

/endpage { showpage } bind def
/showpage { } def

/layercolorseq
	[	% layer color sequence - darkest to lightest
		[0 0 0]
		[.2 .8 .8]
		[.4 .8 .8]
		[.6 .8 .8]
		[.8 .8 .8]
	]
def

/layerlen layercolorseq length def

/setlayer {/maxlayer exch def /curlayer exch def
	layercolorseq curlayer 1 sub layerlen mod get
	aload pop sethsbcolor
	/nodecolor {nopcolor} def
	/edgecolor {nopcolor} def
	/graphcolor {nopcolor} def
} bind def

/onlayer { curlayer ne {invis} if } def

/onlayers {
	/myupper exch def
	/mylower exch def
	curlayer mylower lt
	curlayer myupper gt
	or
	{invis} if
} def

/curlayer 0 def

14 default-font-family set_font
1 setmiterlimit
% /arrowlength 10 def
% /arrowwidth 5 def

% make sure pdfmark is harmless for PS-interpreters other than Distiller
/pdfmark where {pop} {userdict /pdfmark /cleartomark load put} ifelse
% make '<<' and '>>' safe on PS Level 1 devices
/languagelevel where {pop languagelevel}{1} ifelse
2 lt {
    userdict (<<) cvn ([) cvn load put
    userdict (>>) cvn ([) cvn load put
} if

setupLatin1
0 0 1 beginpage
gsave
36 36 174 260 boxprim clip newpath
1 1 set_scale 0 rotate 40 41 translate
% jar
gsave
1 setlinewidth
0 0 0 nodecolor
76.32 18 27 18 ellipse_path stroke
0 0 0 nodecolor
14 /Times-Roman set_font
68.32 12.9 moveto 16 (jar) alignedtext
grestore
% java
gsave
1 setlinewidth
0 0 0 nodecolor
76.32 90 27 18 ellipse_path stroke
0 0 0 nodecolor
14 /Times-Roman set_font
64.82 84.9 moveto 23 (java) alignedtext
grestore
% jar->java
gsave
1 setlinewidth
0 0 0 edgecolor
newpath 82.21 35.59 moveto
83.03 43.59 83.26 53.24 82.91 62.18 curveto
stroke
0 0 0 edgecolor
newpath 79.41 61.99 moveto
82.23 72.2 lineto
86.4 62.46 lineto
closepath fill
1 setlinewidth
solid
0 0 0 edgecolor
newpath 79.41 61.99 moveto
82.23 72.2 lineto
86.4 62.46 lineto
closepath stroke
grestore
% algo
gsave
1 setlinewidth
0 0 0 nodecolor
112.32 162 27 18 ellipse_path stroke
0 0 0 nodecolor
14 /Times-Roman set_font
99.82 156.9 moveto 25 (algo) alignedtext
grestore
% algo->java
gsave
1 setlinewidth
0 0 0 edgecolor
newpath 103.6 144.57 moveto
99.36 136.08 94.16 125.69 89.45 116.27 curveto
stroke
0 0 0 edgecolor
newpath 92.55 114.65 moveto
84.95 107.27 lineto
86.29 117.78 lineto
closepath fill
1 setlinewidth
solid
0 0 0 edgecolor
newpath 92.55 114.65 moveto
84.95 107.27 lineto
86.29 117.78 lineto
closepath stroke
grestore
% java->jar
gsave
1 setlinewidth
0 0 0 edgecolor
newpath 70.4 72.2 moveto
69.6 64.18 69.37 54.52 69.73 45.6 curveto
stroke
0 0 0 edgecolor
newpath 73.23 45.81 moveto
70.42 35.59 lineto
66.24 45.33 lineto
closepath fill
1 setlinewidth
solid
0 0 0 edgecolor
newpath 73.23 45.81 moveto
70.42 35.59 lineto
66.24 45.33 lineto
closepath stroke
grestore
% rv
gsave
1 setlinewidth
0 0 0 nodecolor
40.32 234 27 18 ellipse_path stroke
0 0 0 nodecolor
14 /Times-Roman set_font
33.82 228.9 moveto 13 (rv) alignedtext
grestore
% rv->algo
gsave
1 setlinewidth
0 0 0 edgecolor
newpath 55.59 218.73 moveto
65.51 208.8 78.63 195.68 89.75 184.56 curveto
stroke
0 0 0 edgecolor
newpath 92.47 186.79 moveto
97.07 177.25 lineto
87.52 181.84 lineto
closepath fill
1 setlinewidth
solid
0 0 0 edgecolor
newpath 92.47 186.79 moveto
97.07 177.25 lineto
87.52 181.84 lineto
closepath stroke
grestore
% rv->java
gsave
1 setlinewidth
0 0 0 edgecolor
newpath 26 218.37 moveto
11.13 200.14 -8.33 169.29 4.32 144 curveto
12.76 127.1 29.29 114.12 44.38 105.13 curveto
stroke
0 0 0 edgecolor
newpath 46.48 107.97 moveto
53.51 100.04 lineto
43.07 101.85 lineto
closepath fill
1 setlinewidth
solid
0 0 0 edgecolor
newpath 46.48 107.97 moveto
53.51 100.04 lineto
43.07 101.85 lineto
closepath stroke
grestore
% vm
gsave
1 setlinewidth
0 0 0 nodecolor
40.32 162 27 18 ellipse_path stroke
0 0 0 nodecolor
14 /Times-Roman set_font
30.82 156.9 moveto 19 (vm) alignedtext
grestore
% rv->vm
gsave
1 setlinewidth
0 0 0 edgecolor
newpath 40.32 215.83 moveto
40.32 208.13 40.32 198.97 40.32 190.42 curveto
stroke
0 0 0 edgecolor
newpath 43.82 190.41 moveto
40.32 180.41 lineto
36.82 190.41 lineto
closepath fill
1 setlinewidth
solid
0 0 0 edgecolor
newpath 43.82 190.41 moveto
40.32 180.41 lineto
36.82 190.41 lineto
closepath stroke
grestore
% vm->java
gsave
1 setlinewidth
0 0 0 edgecolor
newpath 49.03 144.57 moveto
53.28 136.08 58.47 125.69 63.18 116.27 curveto
stroke
0 0 0 edgecolor
newpath 66.34 117.78 moveto
67.68 107.27 lineto
60.08 114.65 lineto
closepath fill
1 setlinewidth
solid
0 0 0 edgecolor
newpath 66.34 117.78 moveto
67.68 107.27 lineto
60.08 114.65 lineto
closepath stroke
grestore
% sa
gsave
1 setlinewidth
0 0 0 nodecolor
139.32 234 27 18 ellipse_path stroke
0 0 0 nodecolor
14 /Times-Roman set_font
133.32 228.9 moveto 12 (sa) alignedtext
grestore
% sa->algo
gsave
1 setlinewidth
0 0 0 edgecolor
newpath 132.64 216.2 moveto
129.57 208.01 125.85 198.1 122.45 189.01 curveto
stroke
0 0 0 edgecolor
newpath 125.7 187.73 moveto
118.91 179.59 lineto
119.15 190.19 lineto
closepath fill
1 setlinewidth
solid
0 0 0 edgecolor
newpath 125.7 187.73 moveto
118.91 179.59 lineto
119.15 190.19 lineto
closepath stroke
grestore
% sa->java
gsave
1 setlinewidth
0 0 0 edgecolor
newpath 146.43 216.41 moveto
152.9 197.49 159.83 167.03 148.32 144 curveto
139.87 127.1 123.34 114.12 108.25 105.13 curveto
stroke
0 0 0 edgecolor
newpath 109.56 101.85 moveto
99.12 100.04 lineto
106.15 107.97 lineto
closepath fill
1 setlinewidth
solid
0 0 0 edgecolor
newpath 109.56 101.85 moveto
99.12 100.04 lineto
106.15 107.97 lineto
closepath stroke
grestore
endpage
showpage
grestore
end
restore
%%Trailer
cleartomark countdictstack exch sub { end } repeat restore
%%EOF
