(classPool
(JNukeClass "StringBuffer_append" "StringBuffer_append.java"
  (JNukeVar "I" "count")
  (JNukeVar "[C" "value")
  (JNukeMethod "StringBuffer_append.<init>" (JNukeSignature "V" (JNukeVector))
  (JNukeByteCodes
    (JNukeAByteCode 0 "Load" ref 0x0 (line 1))
    (JNukeAByteCode 1 "InvokeSpecial" (JNukeMethod "java/lang/Object.<init>" (JNukeSignature "V" (JNukeVector))))
    (JNukeAByteCode 2 "Return" void)
))
  (JNukeMethod "StringBuffer_append.expandCapacity" (JNukeSignature "V" (JNukeVector "I"))
  (JNukeByteCodes
    (JNukeAByteCode 0 "Return" void (line 5))
))
  (JNukeMethod "StringBuffer_append.append" (JNukeSignature "LStringBuffer_append;" (JNukeVector "C"))
  (JNukeByteCodes
    (JNukeAByteCode 0 "Load" ref 0x0 (line 8))
    (JNukeAByteCode 1 "GetField" "StringBuffer_append" (pair "count" "I"))
    (JNukeAByteCode 2 "Const" int 1)
    (JNukeAByteCode 3 "Prim" iadd)
    (JNukeAByteCode 4 "Store" int 0x2)
    (JNukeAByteCode 5 "Load" int 0x2 (line 9))
    (JNukeAByteCode 6 "Load" ref 0x0)
    (JNukeAByteCode 7 "GetField" "StringBuffer_append" (pair "value" "[C"))
    (JNukeAByteCode 8 "ArrayLength")
    (JNukeAByteCode 9 "Cond" if_icmple 13)
    (JNukeAByteCode 10 "Load" ref 0x0 (line 10))
    (JNukeAByteCode 11 "Load" int 0x2)
    (JNukeAByteCode 12 "InvokeSpecial" (JNukeMethod "StringBuffer_append.expandCapacity" (JNukeSignature "V" (JNukeVector "I"))))
    (JNukeAByteCode 13 "Load" ref 0x0 (line 11))
    (JNukeAByteCode 14 "GetField" "StringBuffer_append" (pair "value" "[C"))
    (JNukeAByteCode 15 "Load" ref 0x0)
    (JNukeAByteCode 16 "Dupx" 0x1 0x0)
    (JNukeAByteCode 17 "GetField" "StringBuffer_append" (pair "count" "I"))
    (JNukeAByteCode 18 "Dupx" 0x1 0x1)
    (JNukeAByteCode 19 "Const" int 1)
    (JNukeAByteCode 20 "Prim" iadd)
    (JNukeAByteCode 21 "PutField" "StringBuffer_append" (pair "count" "I"))
    (JNukeAByteCode 22 "Load" int 0x1)
    (JNukeAByteCode 23 "AStore" char)
    (JNukeAByteCode 24 "Load" ref 0x0 (line 12))
    (JNukeAByteCode 25 "Return" ref)
))
)
)
