Coord_multilock.<init>:6:Write access to field Coord_multilock.lockX by thread 0 (holding 0 locks)
Coord_multilock.<init>:7:Write access to field Coord_multilock.lockY by thread 0 (holding 0 locks)
ViewXY_multilock.<init>:10:Write access to field ViewXY_multilock.coord by thread 0 (holding 0 locks)
ViewXY_multilock.run:14:Read access to field ViewXY_multilock.coord by thread 1 (holding 0 locks)
Coord_multilock.getXY:32:monitorenter by thread 1
Coord_multilock.getX:18:Read access to field Coord_multilock.lockX by thread 1 (holding 1 locks: Coord_multilock)
Coord_multilock.getX:18:monitorenter by thread 1
Coord_multilock.getX:19:Read access to field Coord_multilock.x by thread 1 (holding 2 locks: Coord_multilock, java/lang/Object)
Coord_multilock.getY:25:Read access to field Coord_multilock.lockY by thread 1 (holding 1 locks: Coord_multilock)
ViewX_Y_multilock.<init>:10:Write access to field ViewX_Y_multilock.coord by thread 0 (holding 0 locks)
Coord_multilock.getY:25:monitorenter by thread 1
Coord_multilock.getY:26:Read access to field Coord_multilock.y by thread 1 (holding 2 locks: Coord_multilock, java/lang/Object)
Coord_multilock.<init>:6:Write access to field Coord_multilock.lockX by thread 1 (holding 1 locks: Coord_multilock)
Coord_multilock.<init>:7:Write access to field Coord_multilock.lockY by thread 1 (holding 1 locks: Coord_multilock)
Coord_multilock.<init>:13:Write access to field Coord_multilock.x by thread 1 (holding 1 locks: Coord_multilock)
Coord_multilock.<init>:14:Write access to field Coord_multilock.y by thread 1 (holding 1 locks: Coord_multilock)
ViewX_Y_multilock.run:14:Read access to field ViewX_Y_multilock.coord by thread 2 (holding 0 locks)
Coord_multilock.setX:36:Read access to field Coord_multilock.lockX by thread 2 (holding 0 locks)
Coord_multilock.setX:36:monitorenter by thread 2
Coord_multilock.setX:37:Write access to field Coord_multilock.x by thread 2 (holding 1 locks: java/lang/Object)
ViewX_Y_multilock.run:15:Read access to field ViewX_Y_multilock.coord by thread 2 (holding 0 locks)
Coord_multilock.setY:42:Read access to field Coord_multilock.lockY by thread 2 (holding 0 locks)
Coord_multilock.setY:42:monitorenter by thread 2
Coord_multilock.setY:43:Write access to field Coord_multilock.y by thread 2 (holding 1 locks: java/lang/Object)
HIGH-LEVEL DATA RACE FOUND:
Conflict between thread 2 (ViewX_Y_multilock, "Thread-2")
and thread 1 (ViewXY_multilock, "Thread-1")
    Fields involved in conflict:
        1) Coord_multilock.y
        2) Coord_multilock.x
    Views of thread 2 (ViewX_Y_multilock, "Thread-2"): {
        1) Coord_multilock.setY:42: [1]
        2) Coord_multilock.setX:36: [2]}.
    Conflicting maxView of thread 1 (ViewXY_multilock, "Thread-1"):
        Coord_multilock.getXY:32: [1, 2].
