ViewXY_X_Y.<init>:10:Write access to field ViewXY_X_Y.coord by thread 0 (holding 0 locks)
ViewX_Y.<init>:10:Write access to field ViewX_Y.coord by thread 0 (holding 0 locks)
ViewXY_X_Y.run:14:Read access to field ViewXY_X_Y.coord by thread 1 (holding 0 locks)
Coord.getXY:24:monitorenter by thread 1
Coord.getXY:24:Read access to field Coord.x by thread 1 (holding 1 locks: Coord)
Coord.getXY:24:Read access to field Coord.y by thread 1 (holding 1 locks: Coord)
Coord.<init>:9:Write access to field Coord.x by thread 1 (holding 1 locks: Coord)
Coord.<init>:10:Write access to field Coord.y by thread 1 (holding 1 locks: Coord)
ViewXY_X_Y.run:15:Read access to field ViewXY_X_Y.coord by thread 1 (holding 0 locks)
Coord.setX:28:monitorenter by thread 1
Coord.setX:29:Write access to field Coord.x by thread 1 (holding 1 locks: Coord)
ViewXY_X_Y.run:16:Read access to field ViewXY_X_Y.coord by thread 1 (holding 0 locks)
Coord.setY:34:monitorenter by thread 1
Coord.setY:34:Write access to field Coord.y by thread 1 (holding 1 locks: Coord)
ViewX_Y.run:14:Read access to field ViewX_Y.coord by thread 2 (holding 0 locks)
Coord.setX:28:monitorenter by thread 2
Coord.setX:29:Write access to field Coord.x by thread 2 (holding 1 locks: Coord)
ViewX_Y.run:15:Read access to field ViewX_Y.coord by thread 2 (holding 0 locks)
Coord.setY:34:monitorenter by thread 2
Coord.setY:34:Write access to field Coord.y by thread 2 (holding 1 locks: Coord)
HIGH-LEVEL DATA RACE FOUND:
Conflict between thread 2 (ViewX_Y, "Thread-2")
and thread 1 (ViewXY_X_Y, "Thread-1")
    Fields involved in conflict:
        1) Coord.y
        2) Coord.x
    Views of thread 2 (ViewX_Y, "Thread-2"): {
        1) Coord.setY:34: [1]
        2) Coord.setX:28: [2]}.
    Conflicting maxView of thread 1 (ViewXY_X_Y, "Thread-1"):
        Coord.getXY:24: [1, 2].
