#FIG 3.2
Landscape
Center
Metric
A4      
100.00
Single
-2
1200 2
6 1350 855 3240 1485
4 0 0 50 0 16 20 0.0000 4 270 1875 1350 1080 Computational\001
4 0 0 50 0 16 20 0.0000 4 210 780 1350 1410 power\001
-6
6 5805 4455 7695 5445
6 6165 4680 7335 5310
4 1 0 50 0 16 20 0.0000 4 210 1125 6750 4905 Theorem\001
4 1 0 50 0 16 20 0.0000 4 270 975 6750 5235 Proving\001
-6
1 1 0 2 0 7 100 0 -1 0.000 1 0.0000 6750 4950 900 450 6750 4950 7650 5400
-6
6 7875 5805 9675 6435
4 0 0 50 0 16 20 0.0000 4 270 1770 7875 6030 Human power\001
4 0 0 50 0 16 20 0.0000 4 270 1455 7875 6360 (skills, time)\001
-6
6 2970 3510 4680 4140
4 1 0 50 0 16 20 0.0000 4 210 1080 3825 3735 Abstract\001
4 1 0 50 0 16 20 0.0000 4 270 1695 3825 4065 Interpretation\001
-6
6 3870 1800 5760 2790
6 4230 1980 5400 2610
6 4230 1980 5400 2610
4 1 0 50 0 16 20 0.0000 4 210 780 4815 2205 Model\001
4 1 0 50 0 16 20 0.0000 4 270 1170 4815 2535 Checking\001
-6
-6
1 1 0 2 0 7 80 0 20 0.000 1 0.0000 4815 2295 900 450 4815 2295 5715 2295
-6
1 1 0 2 0 7 80 0 20 0.000 1 0.0000 2475 4500 675 450 2475 4500 3150 4950
1 1 0 2 0 7 100 0 -1 0.000 1 0.0000 3757 3862 1573 2028 3757 3862 5330 5890
2 1 0 2 0 7 50 0 -1 0.000 0 0 -1 1 0 2
	1 1 2.00 180.00 240.00
	 1800 6075 1800 1620
2 1 0 2 0 7 50 0 -1 0.000 0 0 -1 1 0 2
	1 1 2.00 180.00 240.00
	 1800 6075 7650 6075
2 2 0 1 7 7 150 0 -1 0.000 0 0 -1 0 0 5
	 1170 675 9855 675 9855 6615 1170 6615 1170 675
4 0 0 50 0 16 20 0.0000 4 210 405 2295 4590 RV\001
