%!PS-Adobe-2.0 EPSF-2.0
%%Title: design-scheduler.dia
%%Creator: Dia v0.90
%%CreationDate: Sun Mar  9 18:21:45 2003
%%For: pascal
%%Magnification: 1.0000
%%Orientation: Portrait
%%BoundingBox: 0 0 812 470
%%Pages: 1
%%EndComments
%%BeginProlog
/cp {closepath} bind def
/c {curveto} bind def
/f {fill} bind def
/a {arc} bind def
/ef {eofill} bind def
/ex {exch} bind def
/gr {grestore} bind def
/gs {gsave} bind def
/sa {save} bind def
/rs {restore} bind def
/l {lineto} bind def
/m {moveto} bind def
/rm {rmoveto} bind def
/n {newpath} bind def
/s {stroke} bind def
/sh {show} bind def
/slc {setlinecap} bind def
/slj {setlinejoin} bind def
/slw {setlinewidth} bind def
/srgb {setrgbcolor} bind def
/rot {rotate} bind def
/sc {scale} bind def
/sd {setdash} bind def
/ff {findfont} bind def
/sf {setfont} bind def
/scf {scalefont} bind def
/sw {stringwidth pop} bind def
/tr {translate} bind def

/ellipsedict 8 dict def
ellipsedict /mtrx matrix put
/ellipse
{ ellipsedict begin
   /endangle exch def
   /startangle exch def
   /yrad exch def
   /xrad exch def
   /y exch def
   /x exch def   /savematrix mtrx currentmatrix def
   x y tr xrad yrad sc
   0 0 1 startangle endangle arc
   savematrix setmatrix
   end
} def

/mergeprocs {
dup length
3 -1 roll
dup
length
dup
5 1 roll
3 -1 roll
add
array cvx
dup
3 -1 roll
0 exch
putinterval
dup
4 2 roll
putinterval
} bind def
%%EndProlog

%%BeginSetup
%%EndSetup
28.346000 -28.346000 scale
6.272500 -18.420000 translate

1.000000 1.000000 1.000000 srgb
n 5.491600 1.900000 m 5.491600 3.800000 l 11.308400 3.800000 l 11.308400 1.900000 l f
0.100000 slw
[] 0 sd
[] 0 sd
0 slj
0.000000 0.000000 0.000000 srgb
n 5.491600 1.900000 m 5.491600 3.800000 l 11.308400 3.800000 l 11.308400 1.900000 l cp s
 [ /xi /xi /xi /xi /xi /xi /xi /xi /xi /xi /xi /xi /xi /xi /xi /xi
 /xi /xi /xi /xi /xi /xi /xi /xi /xi /xi /xi /xi /xi /xi /xi /xi
 /S /c /h /e /d /u /l /r /xi /xi /R /n /t /i /m /space
 /E /v /o /L /k /M /a /g /H /p /s /f /y /xi /xi /xi
 /xi /xi /xi /xi /xi /xi /xi /xi /xi /xi /xi /xi /xi /xi /xi /xi
 /xi /xi /xi /xi /xi /xi /xi /xi /xi /xi /xi /xi /xi /xi /xi /xi
 /xi /xi /xi /xi /xi /xi /xi /xi /xi /xi /xi /xi /xi /xi /xi /xi
 /xi /xi /xi /xi /xi /xi /xi /xi /xi /xi /xi /xi /xi /xi /xi /xi
 /xi /xi /xi /xi /xi /xi /xi /xi /xi /xi /xi /xi /xi /xi /xi /xi
 /xi /xi /xi /xi /xi /xi /xi /xi /xi /xi /xi /xi /xi /xi /xi /xi
 /xi /xi /xi /xi /xi /xi /xi /xi /xi /xi /xi /xi /xi /xi /xi /xi
 /xi /xi /xi /xi /xi /xi /xi /xi /xi /xi /xi /xi /xi /xi /xi /xi
 /xi /xi /xi /xi /xi /xi /xi /xi /xi /xi /xi /xi /xi /xi /xi /xi
 /xi /xi /xi /xi /xi /xi /xi /xi /xi /xi /xi /xi /xi /xi /xi /xi
 /xi /xi /xi /xi /xi /xi /xi /xi /xi /xi /xi /xi /xi /xi /xi /xi
 /xi /xi /xi /xi /xi /xi /xi /xi /xi /xi /xi /xi /xi /xi /xi /xi
] /e0 exch def
/Courier_e0 undefinefont
/Courier_e0
  /Courier findfont
  dup length dict begin
  {1 index /FID ne {def} {pop pop} ifelse} forall
  /Encoding e0 def
  currentdict end
definefont pop
/Courier_e0 ff 0.800000 scf sf
( !"#$%&#') sw
2 div 8.400000 ex sub 3.046491 m ( !"#$%&#')
 gs 1 -1 sc sh gr
1.000000 1.000000 1.000000 srgb
n 2.757200 9.350000 m 2.757200 11.250000 l 13.959600 11.250000 l 13.959600 9.350000 l f
0.100000 slw
[] 0 sd
[] 0 sd
0 slj
0.000000 0.000000 0.000000 srgb
n 2.757200 9.350000 m 2.757200 11.250000 l 13.959600 11.250000 l 13.959600 9.350000 l cp s
/Courier_e0 ff 0.800000 scf sf
(*%+,-.#/0+1-'2+.#+,) sw
2 div 8.358400 ex sub 10.496491 m (*%+,-.#/0+1-'2+.#+,)
 gs 1 -1 sc sh gr
1.000000 1.000000 1.000000 srgb
n 14.822800 9.250000 m 14.822800 11.150000 l 22.294000 11.150000 l 22.294000 9.250000 l f
0.100000 slw
[] 0 sd
[] 0 sd
0 slj
0.000000 0.000000 0.000000 srgb
n 14.822800 9.250000 m 14.822800 11.150000 l 22.294000 11.150000 l 22.294000 9.250000 l cp s
/Courier_e0 ff 0.800000 scf sf
(32!4/56+67#') sw
2 div 18.558400 ex sub 10.396491 m (32!4/56+67#')
 gs 1 -1 sc sh gr
1.000000 1.000000 1.000000 srgb
n -6.222500 9.470010 m -6.222500 11.370010 l 1.257500 11.370010 l 1.257500 9.470010 l f
0.100000 slw
[] 0 sd
[] 0 sd
0 slj
0.000000 0.000000 0.000000 srgb
n -6.222500 9.470010 m -6.222500 11.370010 l 1.257500 11.370010 l 1.257500 9.470010 l cp s
/Courier_e0 ff 0.800000 scf sf
(8#69/56+67#') sw
2 div -2.482500 ex sub 10.616501 m (8#69/56+67#')
 gs 1 -1 sc sh gr
0.100000 slw
[1.000000] 0 sd
[0.400000] 0 sd
0 slj
0 slc
n 8.400000 3.800000 m 8.400000 5.470020 l 18.558400 5.470020 l 18.558400 9.250000 l s
0.100000 slw
[] 0 sd
0 slj
0 slc
n 18.308400 8.450000 m 18.558400 9.250000 l 18.808400 8.450000 l s
0.100000 slw
[0.400000] 0 sd
[0.400000] 0 sd
0 slj
0 slc
n 8.400000 3.800000 m 8.400000 5.470020 l 8.358400 5.470020 l 8.358400 9.350000 l s
0.100000 slw
[] 0 sd
0 slj
0 slc
n 8.108400 8.550000 m 8.358400 9.350000 l 8.608400 8.550000 l s
0.100000 slw
[0.400000] 0 sd
[0.400000] 0 sd
0 slj
0 slc
n 8.400000 3.800000 m 8.400000 5.470020 l -2.482500 5.470020 l -2.482500 9.470010 l s
0.100000 slw
[] 0 sd
0 slj
0 slc
n -2.732500 8.670010 m -2.482500 9.470010 l -2.232500 8.670010 l s
0.100000 slw
[0.400000] 0 sd
[0.400000] 0 sd
0 slj
0 slc
n -3.705900 16.720000 m -3.705900 15.620000 l -3.705900 15.620000 l -3.705900 13.120000 l s
0.100000 slw
[] 0 sd
0 slj
0 slc
n -3.455900 13.920000 m -3.705900 13.120000 l -3.955900 13.920000 l s
0.100000 slw
[] 0 sd
0 slj
0 slc
n 1.227500 16.820000 m 1.227500 15.620000 l 1.235800 15.620000 l 1.235800 13.220000 l s
0.100000 slw
[] 0 sd
0 slj
0 slc
n 1.635800 14.020000 m 1.235800 13.220000 l 0.835800 14.020000 l s
0.100000 slw
[] 0 sd
[] 0 sd
0 slc
n 6.927500 9.300000 m 6.945800 3.800000 l s
0.100000 slw
[] 0 sd
0 slj
0 slc
n 7.343136 4.601326 m 6.945800 3.800000 l 6.543140 4.598665 l s
0.100000 slw
[] 0 sd
[] 0 sd
0 slj
0 slc
n -0.672500 9.250000 m -0.672500 6.550000 l 16.690600 6.550000 l 16.690600 9.250000 l s
/Courier_e0 ff 0.800000 scf sf
('#7-:,#') sw
2 div -3.472500 ex sub 17.450000 m ('#7-:,#')
 gs 1 -1 sc sh gr
/Courier_e0 ff 0.800000 scf sf
(+2,-;<) sw
2 div 1.327500 ex sub 17.450000 m (+2,-;<)
 gs 1 -1 sc sh gr
showpage
