#FIG 3.2
Landscape
Center
Metric
A4      
100.00
Single
-2
1200 2
6 630 3105 2295 4140
6 855 3330 2025 3960
6 855 3330 2025 3960
4 1 0 50 0 16 20 0.0000 4 210 615 1440 3555 Lock\001
4 1 0 50 0 16 20 0.0000 4 210 1125 1440 3885 manager\001
-6
-6
2 2 0 2 0 7 150 0 -1 0.000 0 0 7 0 0 5
	 675 3150 2250 3150 2250 4095 675 4095 675 3150
-6
6 2655 3105 4320 4140
6 2925 3330 4095 3960
4 1 0 50 0 16 20 0.0000 4 210 960 3510 3555 Waitset\001
4 1 0 50 0 16 20 0.0000 4 210 1125 3510 3885 manager\001
-6
2 2 0 2 0 7 150 0 -1 0.000 0 0 7 0 0 5
	 2700 3150 4275 3150 4275 4095 2700 4095 2700 3150
-6
6 4680 3105 6345 4140
6 4905 3330 6075 3960
4 1 0 50 0 16 20 0.0000 4 270 690 5490 3555 Heap\001
4 1 0 50 0 16 20 0.0000 4 210 1125 5490 3885 manager\001
-6
2 2 0 2 0 7 150 0 -1 0.000 0 0 7 0 0 5
	 4725 3150 6300 3150 6300 4095 4725 4095 4725 3150
-6
6 6705 3105 8370 4140
6 6930 3330 8100 3915
4 1 0 50 0 16 20 0.0000 4 270 1125 7515 3555 Garbage\001
4 1 0 50 0 16 20 0.0000 4 210 1080 7515 3885 collector\001
-6
2 2 0 2 0 7 150 0 -1 0.000 0 0 7 0 0 5
	 6750 3150 8325 3150 8325 4095 6750 4095 6750 3150
-6
6 2790 405 6210 1170
2 2 0 2 0 7 150 0 -1 0.000 0 0 -1 0 0 5
	 2835 450 6165 450 6165 1125 2835 1125 2835 450
4 1 0 50 0 16 20 0.0000 4 210 1260 4500 855 Scheduler\001
-6
6 2790 1755 6210 2520
2 2 0 2 0 7 150 0 -1 0.000 0 0 -1 0 0 5
	 2835 1800 6165 1800 6165 2475 2835 2475 2835 1800
4 1 0 50 0 16 20 0.0000 4 210 2760 4500 2205 Run-time environment\001
-6
2 1 0 2 0 7 50 0 -1 0.000 0 0 -1 1 1 2
	1 1 2.00 90.00 180.00
	1 1 2.00 90.00 180.00
	 4500 1125 4500 1800
2 1 0 2 0 7 50 0 -1 0.000 0 0 -1 1 0 4
	1 1 2.00 90.00 180.00
	 4500 2475 4500 2700 1485 2700 1485 3150
2 1 0 2 0 7 50 0 -1 0.000 0 0 -1 1 0 3
	1 1 2.00 90.00 180.00
	 4500 2700 7515 2700 7514 3163
2 1 0 2 0 7 50 0 -1 0.000 0 0 -1 1 0 2
	1 1 2.00 90.00 180.00
	 3465 2700 3465 3150
2 1 0 2 0 7 50 0 -1 0.000 0 0 -1 1 0 2
	1 1 2.00 90.00 180.00
	 5535 2700 5535 3150
2 1 0 2 0 7 50 0 -1 0.000 0 0 -1 1 1 2
	1 1 2.00 60.00 120.00
	1 1 2.00 60.00 120.00
	 6750 3600 6300 3600
2 2 2 2 0 7 150 0 -1 4.500 0 0 -1 0 0 5
	 450 225 8550 225 8550 4320 450 4320 450 225
4 0 0 150 0 16 20 0.0000 4 210 1305 720 720 JNuke VM\001
