%!PS-Adobe-2.0 EPSF-2.0
%%Title: 1d-arrays.dia
%%Creator: Dia v0.90
%%CreationDate: Mon Jan 27 23:26:09 2003
%%For: pascal
%%Magnification: 1.0000
%%Orientation: Portrait
%%BoundingBox: 0 0 544 346
%%Pages: 1
%%EndComments
%%BeginProlog
/cp {closepath} bind def
/c {curveto} bind def
/f {fill} bind def
/a {arc} bind def
/ef {eofill} bind def
/ex {exch} bind def
/gr {grestore} bind def
/gs {gsave} bind def
/sa {save} bind def
/rs {restore} bind def
/l {lineto} bind def
/m {moveto} bind def
/rm {rmoveto} bind def
/n {newpath} bind def
/s {stroke} bind def
/sh {show} bind def
/slc {setlinecap} bind def
/slj {setlinejoin} bind def
/slw {setlinewidth} bind def
/srgb {setrgbcolor} bind def
/rot {rotate} bind def
/sc {scale} bind def
/sd {setdash} bind def
/ff {findfont} bind def
/sf {setfont} bind def
/scf {scalefont} bind def
/sw {stringwidth pop} bind def
/tr {translate} bind def

/ellipsedict 8 dict def
ellipsedict /mtrx matrix put
/ellipse
{ ellipsedict begin
   /endangle exch def
   /startangle exch def
   /yrad exch def
   /xrad exch def
   /y exch def
   /x exch def   /savematrix mtrx currentmatrix def
   x y tr xrad yrad sc
   0 0 1 startangle endangle arc
   savematrix setmatrix
   end
} def

/mergeprocs {
dup length
3 -1 roll
dup
length
dup
5 1 roll
3 -1 roll
add
array cvx
dup
3 -1 roll
0 exch
putinterval
dup
4 2 roll
putinterval
} bind def
%%EndProlog

%%BeginSetup
%%EndSetup
28.346000 -28.346000 scale
-0.550099 -16.036500 translate

0.100000 slw
[] 0 sd
1.000000 1.000000 1.000000 srgb
n 1.950000 6.950000 m 1.950000 8.750000 l 4.815600 8.750000 l 4.815600 6.950000 l f
0.000000 0.000000 0.000000 srgb
n 1.950000 6.950000 m 1.950000 8.750000 l 4.815600 8.750000 l 4.815600 6.950000 l cp s
 [ /xi /xi /xi /xi /xi /xi /xi /xi /xi /xi /xi /xi /xi /xi /xi /xi
 /xi /xi /xi /xi /xi /xi /xi /xi /xi /xi /xi /xi /xi /xi /xi /xi
 /quotedbl /bracketleft /I /period /three /six /i /n /xi /xi /t /bracketright /M /y /C /l
 /a /s /xi /xi /xi /xi /xi /xi /xi /xi /xi /xi /xi /xi /xi /xi
 /xi /xi /xi /xi /xi /xi /xi /xi /xi /xi /xi /xi /xi /xi /xi /xi
 /xi /xi /xi /xi /xi /xi /xi /xi /xi /xi /xi /xi /xi /xi /xi /xi
 /xi /xi /xi /xi /xi /xi /xi /xi /xi /xi /xi /xi /xi /xi /xi /xi
 /xi /xi /xi /xi /xi /xi /xi /xi /xi /xi /xi /xi /xi /xi /xi /xi
 /xi /xi /xi /xi /xi /xi /xi /xi /xi /xi /xi /xi /xi /xi /xi /xi
 /xi /xi /xi /xi /xi /xi /xi /xi /xi /xi /xi /xi /xi /xi /xi /xi
 /xi /xi /xi /xi /xi /xi /xi /xi /xi /xi /xi /xi /xi /xi /xi /xi
 /xi /xi /xi /xi /xi /xi /xi /xi /xi /xi /xi /xi /xi /xi /xi /xi
 /xi /xi /xi /xi /xi /xi /xi /xi /xi /xi /xi /xi /xi /xi /xi /xi
 /xi /xi /xi /xi /xi /xi /xi /xi /xi /xi /xi /xi /xi /xi /xi /xi
 /xi /xi /xi /xi /xi /xi /xi /xi /xi /xi /xi /xi /xi /xi /xi /xi
 /xi /xi /xi /xi /xi /xi /xi /xi /xi /xi /xi /xi /xi /xi /xi /xi
] /e0 exch def
/Helvetica_e0 undefinefont
/Helvetica_e0
  /Helvetica findfont
  dup length dict begin
  {1 index /FID ne {def} {pop pop} ifelse} forall
  /Encoding e0 def
  currentdict end
definefont pop
/Helvetica_e0 ff 0.800000 scf sf
( !" ) sw
2 div 3.382800 ex sub 8.046491 m ( !" )
 gs 1 -1 sc sh gr
0.050000 slw
n 2.450000 8.250000 m 4.315600 8.250000 l s
0.717647 0.717647 0.717647 srgb
n 8.350000 4.750000 m 8.350000 6.650000 l 9.590800 6.650000 l 9.590800 4.750000 l f
0.100000 slw
[] 0 sd
[] 0 sd
0 slj
0.000000 0.000000 0.000000 srgb
n 8.350000 4.750000 m 8.350000 6.650000 l 9.590800 6.650000 l 9.590800 4.750000 l cp s
/Courier_e0 undefinefont
/Courier_e0
  /Courier findfont
  dup length dict begin
  {1 index /FID ne {def} {pop pop} ifelse} forall
  /Encoding e0 def
  currentdict end
definefont pop
/Courier_e0 ff 0.800000 scf sf
(#) sw
2 div 8.970400 ex sub 5.896491 m (#)
 gs 1 -1 sc sh gr
1.000000 1.000000 1.000000 srgb
n 11.020400 4.750000 m 11.020400 6.650000 l 12.481200 6.650000 l 12.481200 4.750000 l f
0.100000 slw
[] 0 sd
[] 0 sd
0 slj
0.000000 0.000000 0.000000 srgb
n 11.020400 4.750000 m 11.020400 6.650000 l 12.481200 6.650000 l 12.481200 4.750000 l cp s
/Courier_e0 ff 0.800000 scf sf
(") sw
2 div 11.750800 ex sub 5.896491 m (")
 gs 1 -1 sc sh gr
1.000000 1.000000 1.000000 srgb
n 12.457200 4.750000 m 12.457200 6.650000 l 13.918000 6.650000 l 13.918000 4.750000 l f
0.100000 slw
[] 0 sd
[] 0 sd
0 slj
0.000000 0.000000 0.000000 srgb
n 12.457200 4.750000 m 12.457200 6.650000 l 13.918000 6.650000 l 13.918000 4.750000 l cp s
/Courier_e0 ff 0.800000 scf sf
(") sw
2 div 13.187600 ex sub 5.896491 m (")
 gs 1 -1 sc sh gr
1.000000 1.000000 1.000000 srgb
n 13.874400 4.750000 m 13.874400 6.650000 l 15.335200 6.650000 l 15.335200 4.750000 l f
0.100000 slw
[] 0 sd
[] 0 sd
0 slj
0.000000 0.000000 0.000000 srgb
n 13.874400 4.750000 m 13.874400 6.650000 l 15.335200 6.650000 l 15.335200 4.750000 l cp s
/Courier_e0 ff 0.800000 scf sf
(") sw
2 div 14.604800 ex sub 5.896491 m (")
 gs 1 -1 sc sh gr
0.717647 0.717647 0.717647 srgb
n 9.598800 4.750000 m 9.598800 6.650000 l 11.042000 6.650000 l 11.042000 4.750000 l f
0.100000 slw
[] 0 sd
[] 0 sd
0 slj
0.000000 0.000000 0.000000 srgb
n 9.598800 4.750000 m 9.598800 6.650000 l 11.042000 6.650000 l 11.042000 4.750000 l cp s
/Courier_e0 ff 0.800000 scf sf
($) sw
2 div 10.320400 ex sub 5.896491 m ($)
 gs 1 -1 sc sh gr
0.717647 0.717647 0.717647 srgb
n 8.350000 9.350000 m 8.350000 11.250000 l 9.590800 11.250000 l 9.590800 9.350000 l f
0.100000 slw
[] 0 sd
[] 0 sd
0 slj
0.000000 0.000000 0.000000 srgb
n 8.350000 9.350000 m 8.350000 11.250000 l 9.590800 11.250000 l 9.590800 9.350000 l cp s
/Courier_e0 ff 0.800000 scf sf
(#) sw
2 div 8.970400 ex sub 10.496491 m (#)
 gs 1 -1 sc sh gr
1.000000 1.000000 1.000000 srgb
n 11.020400 9.350000 m 11.020400 11.250000 l 12.481200 11.250000 l 12.481200 9.350000 l f
0.100000 slw
[] 0 sd
[] 0 sd
0 slj
0.000000 0.000000 0.000000 srgb
n 11.020400 9.350000 m 11.020400 11.250000 l 12.481200 11.250000 l 12.481200 9.350000 l cp s
/Courier_e0 ff 0.800000 scf sf
(") sw
2 div 11.750800 ex sub 10.496491 m (")
 gs 1 -1 sc sh gr
1.000000 1.000000 1.000000 srgb
n 12.457200 9.350000 m 12.457200 11.250000 l 13.918000 11.250000 l 13.918000 9.350000 l f
0.100000 slw
[] 0 sd
[] 0 sd
0 slj
0.000000 0.000000 0.000000 srgb
n 12.457200 9.350000 m 12.457200 11.250000 l 13.918000 11.250000 l 13.918000 9.350000 l cp s
/Courier_e0 ff 0.800000 scf sf
(") sw
2 div 13.187600 ex sub 10.496491 m (")
 gs 1 -1 sc sh gr
1.000000 1.000000 1.000000 srgb
n 13.874400 9.350000 m 13.874400 11.250000 l 15.335200 11.250000 l 15.335200 9.350000 l f
0.100000 slw
[] 0 sd
[] 0 sd
0 slj
0.000000 0.000000 0.000000 srgb
n 13.874400 9.350000 m 13.874400 11.250000 l 15.335200 11.250000 l 15.335200 9.350000 l cp s
/Courier_e0 ff 0.800000 scf sf
(") sw
2 div 14.604800 ex sub 10.496491 m (")
 gs 1 -1 sc sh gr
0.717647 0.717647 0.717647 srgb
n 9.598800 9.350000 m 9.598800 11.250000 l 11.042000 11.250000 l 11.042000 9.350000 l f
0.100000 slw
[] 0 sd
[] 0 sd
0 slj
0.000000 0.000000 0.000000 srgb
n 9.598800 9.350000 m 9.598800 11.250000 l 11.042000 11.250000 l 11.042000 9.350000 l cp s
/Courier_e0 ff 0.800000 scf sf
(%) sw
2 div 10.320400 ex sub 10.496491 m (%)
 gs 1 -1 sc sh gr
1.000000 1.000000 1.000000 srgb
n 15.350000 9.350000 m 15.350000 11.250000 l 16.810800 11.250000 l 16.810800 9.350000 l f
0.100000 slw
[] 0 sd
[] 0 sd
0 slj
0.000000 0.000000 0.000000 srgb
n 15.350000 9.350000 m 15.350000 11.250000 l 16.810800 11.250000 l 16.810800 9.350000 l cp s
/Courier_e0 ff 0.800000 scf sf
(") sw
2 div 16.080400 ex sub 10.496491 m (")
 gs 1 -1 sc sh gr
1.000000 1.000000 1.000000 srgb
n 16.786800 9.350000 m 16.786800 11.250000 l 18.247600 11.250000 l 18.247600 9.350000 l f
0.100000 slw
[] 0 sd
[] 0 sd
0 slj
0.000000 0.000000 0.000000 srgb
n 16.786800 9.350000 m 16.786800 11.250000 l 18.247600 11.250000 l 18.247600 9.350000 l cp s
/Courier_e0 ff 0.800000 scf sf
(") sw
2 div 17.517200 ex sub 10.496491 m (")
 gs 1 -1 sc sh gr
1.000000 1.000000 1.000000 srgb
n 18.204000 9.350000 m 18.204000 11.250000 l 19.664800 11.250000 l 19.664800 9.350000 l f
0.100000 slw
[] 0 sd
[] 0 sd
0 slj
0.000000 0.000000 0.000000 srgb
n 18.204000 9.350000 m 18.204000 11.250000 l 19.664800 11.250000 l 19.664800 9.350000 l cp s
/Courier_e0 ff 0.800000 scf sf
(") sw
2 div 18.934400 ex sub 10.496491 m (")
 gs 1 -1 sc sh gr
0.100000 slw
[] 0 sd
[] 0 sd
0 slj
0 slc
n 8.350000 5.700000 m 8.350000 5.750000 l 3.382800 5.750000 l 3.382800 6.950000 l s
0.100000 slw
[] 0 sd
0 slj
0 slc
n 2.982800 6.150000 m 3.382800 6.950000 l 3.782800 6.150000 l s
0.100000 slw
[] 0 sd
[] 0 sd
0 slj
0 slc
n 8.350000 10.300000 m 8.350000 10.350000 l 3.382800 10.350000 l 3.382800 8.750000 l s
0.100000 slw
[] 0 sd
0 slj
0 slc
n 3.782800 9.550000 m 3.382800 8.750000 l 2.982800 9.550000 l s
/Courier_e0 ff 0.800000 scf sf
(&'*!$+) sw
2 div 9.750000 ex sub 4.450020 m (&'*!$+)
 gs 1 -1 sc sh gr
/Courier_e0 ff 0.800000 scf sf
(&'*!%+) sw
2 div 9.750000 ex sub 8.950020 m (&'*!%+)
 gs 1 -1 sc sh gr
0.717647 0.717647 0.717647 srgb
n 8.450100 14.086500 m 8.450100 15.986500 l 9.690900 15.986500 l 9.690900 14.086500 l f
0.100000 slw
[] 0 sd
[] 0 sd
0 slj
0.000000 0.000000 0.000000 srgb
n 8.450100 14.086500 m 8.450100 15.986500 l 9.690900 15.986500 l 9.690900 14.086500 l cp s
/Courier_e0 ff 0.800000 scf sf
(#) sw
2 div 9.070500 ex sub 15.232991 m (#)
 gs 1 -1 sc sh gr
1.000000 1.000000 1.000000 srgb
n 11.120500 14.086500 m 11.120500 15.986500 l 12.581300 15.986500 l 12.581300 14.086500 l f
0.100000 slw
[] 0 sd
[] 0 sd
0 slj
0.000000 0.000000 0.000000 srgb
n 11.120500 14.086500 m 11.120500 15.986500 l 12.581300 15.986500 l 12.581300 14.086500 l cp s
/Courier_e0 ff 0.800000 scf sf
(") sw
2 div 11.850900 ex sub 15.232991 m (")
 gs 1 -1 sc sh gr
1.000000 1.000000 1.000000 srgb
n 12.557300 14.086500 m 12.557300 15.986500 l 14.018100 15.986500 l 14.018100 14.086500 l f
0.100000 slw
[] 0 sd
[] 0 sd
0 slj
0.000000 0.000000 0.000000 srgb
n 12.557300 14.086500 m 12.557300 15.986500 l 14.018100 15.986500 l 14.018100 14.086500 l cp s
/Courier_e0 ff 0.800000 scf sf
(") sw
2 div 13.287700 ex sub 15.232991 m (")
 gs 1 -1 sc sh gr
1.000000 1.000000 1.000000 srgb
n 13.974500 14.086500 m 13.974500 15.986500 l 15.435300 15.986500 l 15.435300 14.086500 l f
0.100000 slw
[] 0 sd
[] 0 sd
0 slj
0.000000 0.000000 0.000000 srgb
n 13.974500 14.086500 m 13.974500 15.986500 l 15.435300 15.986500 l 15.435300 14.086500 l cp s
/Courier_e0 ff 0.800000 scf sf
(") sw
2 div 14.704900 ex sub 15.232991 m (")
 gs 1 -1 sc sh gr
0.717647 0.717647 0.717647 srgb
n 9.698900 14.086500 m 9.698900 15.986500 l 11.142100 15.986500 l 11.142100 14.086500 l f
0.100000 slw
[] 0 sd
[] 0 sd
0 slj
0.000000 0.000000 0.000000 srgb
n 9.698900 14.086500 m 9.698900 15.986500 l 11.142100 15.986500 l 11.142100 14.086500 l cp s
/Courier_e0 ff 0.800000 scf sf
($) sw
2 div 10.420500 ex sub 15.232991 m ($)
 gs 1 -1 sc sh gr
/Courier_e0 ff 0.800000 scf sf
(,-./011!$+) sw
2 div 10.850100 ex sub 13.786500 m (,-./011!$+)
 gs 1 -1 sc sh gr
0.100000 slw
[] 0 sd
1.000000 1.000000 1.000000 srgb
n 0.600099 14.140000 m 0.600099 15.940000 l 6.686499 15.940000 l 6.686499 14.140000 l f
0.000000 0.000000 0.000000 srgb
n 0.600099 14.140000 m 0.600099 15.940000 l 6.686499 15.940000 l 6.686499 14.140000 l cp s
/Helvetica_e0 ff 0.800000 scf sf
( !,-./011 ) sw
2 div 3.643299 ex sub 15.236491 m ( !,-./011 )
 gs 1 -1 sc sh gr
0.050000 slw
n 1.100099 15.440000 m 6.186499 15.440000 l s
0.100000 slw
[] 0 sd
[] 0 sd
0 slc
n 8.450100 15.036500 m 6.686500 15.040000 l s
0.100000 slw
[] 0 sd
0 slj
0 slc
n 7.485705 14.638413 m 6.686500 15.040000 l 7.487292 15.438412 l s
showpage
