(classPool
(JNukeClass "Dup2_0" "Dup2_0.java"
  (JNukeVar "D" "m00")
  (JNukeVar "D" "m11")
  (JNukeMethod "Dup2_0.<init>" (JNukeSignature "V" (JNukeVector))
  (JNukeByteCodes
    (JNukeRByteCode 0 "r0 = Get" l0 (line 3))
    (JNukeRByteCode 1 "     InvokeSpecial" (JNukeMethod "java/lang/Object.<init>" (JNukeSignature "V" (JNukeVector))) r0)
    (JNukeRByteCode 2 "<r0, r1> = Const" double 1 (line 4))
    (JNukeRByteCode 3 "<r2, r3> = Get" r0 r1)
    (JNukeRByteCode 4 "     PutStatic" "Dup2_0" (pair "m11" "D") r2 r3)
    (JNukeRByteCode 5 "     PutStatic" "Dup2_0" (pair "m00" "D") r0 r1)
    (JNukeRByteCode 6 "     Return" void (line 5))
))
)
)
