#FIG 3.2
Landscape
Center
Inches
Letter  
100.00
Single
-2
1200 2
6 9225 4650 11025 5325
4 0 0 50 0 18 18 0.0000 4 210 1740 9225 4875 Instrumented\001
4 0 0 50 0 18 18 0.0000 4 270 1245 9225 5220 bytecode\001
-6
6 8850 1200 10800 2400
6 9000 1425 10650 2250
4 1 4 45 -1 18 24 0.0000 4 285 1035 9825 1725 Static\001
4 1 4 45 -1 18 24 0.0000 4 360 1530 9825 2160 Analysis\001
-6
2 2 0 1 0 6 50 0 20 0.000 0 0 -1 0 0 5
	 8850 1200 10800 1200 10800 2400 8850 2400 8850 1200
-6
2 1 0 2 0 7 50 0 -1 0.000 0 0 -1 1 0 2
	1 1 2.00 180.00 240.00
	 4800 3450 6600 3450
2 1 0 2 0 7 50 0 -1 0.000 0 0 -1 1 0 2
	1 1 2.00 180.00 240.00
	 600 3450 2400 3450
2 1 0 2 0 7 50 0 -1 0.000 0 0 -1 1 0 2
	1 1 2.00 180.00 240.00
	 4800 6150 6600 6150
2 1 0 2 0 7 50 0 -1 0.000 0 0 -1 1 0 2
	1 1 2.00 180.00 240.00
	 9900 6150 11700 6150
2 2 0 1 0 6 50 0 20 0.000 0 0 -1 0 0 5
	 2400 5700 4800 5700 4800 6600 2400 6600 2400 5700
2 2 0 1 0 6 50 0 20 0.000 0 0 -1 0 0 5
	 2400 3000 4800 3000 4800 3900 2400 3900 2400 3000
2 2 0 1 0 6 50 0 20 0.000 0 0 -1 0 0 5
	 6600 3000 9900 3000 9900 3900 6600 3900 6600 3000
2 2 0 1 0 6 50 0 20 0.000 0 0 -1 0 0 5
	 6600 5700 9900 5700 9900 6600 6600 6600 6600 5700
2 1 0 2 4 7 50 -1 -1 0.000 0 0 -1 1 0 2
	1 1 2.00 180.00 240.00
	 7500 3000 8850 2400
2 1 0 2 4 7 50 -1 -1 0.000 0 0 -1 1 0 2
	1 1 2.00 180.00 240.00
	 10207 2414 8857 3014
3 0 0 2 0 7 50 0 -1 0.000 0 1 0 8
	1 1 2.00 180.00 240.00
	 9900 3675 10800 3825 11100 4125 10800 4425 1500 5400 1200 5700
	 1500 6000 2400 6150
	 0.000 1.000 1.000 1.000 1.000 1.000 1.000 0.000
4 1 0 50 0 18 18 0.0000 4 210 585 5625 3300 Java\001
4 1 0 50 0 18 18 0.0000 4 210 945 1425 3300 Source\001
4 1 0 50 0 18 18 0.0000 4 210 675 1425 3750 code\001
4 1 0 50 0 18 18 0.0000 4 270 1245 5625 3750 bytecode\001
4 1 0 50 0 18 18 0.0000 4 210 840 10725 6525 Result\001
4 1 0 50 0 18 18 0.0000 4 210 885 5625 6525 Events\001
4 1 0 45 0 18 24 0.0000 4 285 1740 3600 6300 Execution\001
4 1 1 45 0 18 24 0.0000 4 285 1635 8250 6300 Observer\001
4 1 0 45 0 18 24 0.0000 4 360 1590 3600 3600 Compiler\001
4 1 1 45 0 18 24 0.0000 4 285 2805 8250 3600 Instrumentation\001
