#FIG 3.2
Landscape
Center
Metric
A4      
100.00
Single
-2
1200 2
0 32 #96969e
0 33 #d0d0d0
2 1 0 3 0 7 50 0 -1 0.000 0 0 -1 1 0 2
	1 1 3.00 180.00 360.00
	 1575 4050 7875 4050
2 1 0 4 4 7 60 0 -1 0.000 0 0 -1 0 0 2
	 2025 2655 2025 3150
2 1 0 2 0 7 55 0 -1 0.000 0 0 -1 0 0 2
	 1575 3150 7200 3150
2 1 0 2 0 7 50 0 -1 0.000 0 0 -1 0 0 4
	 2700 3150 3600 2025 6075 2025 6750 3150
2 2 0 2 0 11 50 0 20 0.000 0 0 -1 0 0 5
	 1575 2925 3600 2925 3600 3375 1575 3375 1575 2925
2 1 0 4 4 7 60 0 -1 0.000 0 0 -1 0 0 2
	 5580 1575 5580 2025
2 1 0 4 4 7 60 0 -1 0.000 0 0 -1 0 0 2
	 4230 1575 4230 2025
2 2 0 2 0 3 50 0 20 0.000 0 0 -1 0 0 5
	 3600 2925 4050 2925 4050 3375 3600 3375 3600 2925
2 2 0 2 0 3 50 0 20 0.000 0 0 -1 0 0 5
	 5625 2925 6075 2925 6075 3375 5625 3375 5625 2925
2 2 0 2 0 3 50 0 20 0.000 0 0 -1 0 0 5
	 4635 2925 5085 2925 5085 3375 4635 3375 4635 2925
2 2 0 2 0 11 50 0 20 0.000 0 0 -1 0 0 5
	 4050 1800 4590 1800 4590 2250 4050 2250 4050 1800
2 2 0 2 0 11 50 0 20 0.000 0 0 -1 0 0 5
	 5085 1800 5625 1800 5625 2250 5085 2250 5085 1800
2 2 0 2 0 11 50 0 20 0.000 0 0 -1 0 0 5
	 6075 2925 7200 2925 7200 3375 6075 3375 6075 2925
4 0 0 50 0 18 24 0.0000 4 270 135 8100 4185 t\001
4 0 0 50 0 18 24 0.0000 4 285 855 7425 3240 main\001
4 0 0 50 0 18 24 0.0000 4 285 1215 7425 2115 worker\001
4 0 0 50 0 18 24 0.0000 4 270 615 1755 2520 v=1\001
4 0 0 50 0 18 24 0.0000 4 210 1200 3600 1440 res+=v\001
4 0 0 50 0 18 24 0.0000 4 210 975 5130 1440 v=res\001
