#FIG 3.2
Landscape
Center
Inches
Letter  
100.00
Single
-2
1200 2
0 32 #9c0000
0 33 #8c8c8c
0 34 #8c8c8c
0 35 #424242
0 36 #8c8c8c
0 37 #424242
0 38 #8c8c8c
0 39 #424242
0 40 #8c8c8c
0 41 #424242
0 42 #8c8c8c
0 43 #424242
0 44 #ffa00a
0 45 #cdcdcd
6 7997 2263 9654 4650
1 1 0 1 0 25 50 0 20 4.000 1 5.7596 8951 3031 681 691 8951 3031 9066 3711
1 1 0 1 0 11 45 0 20 4.000 1 5.7596 8951 3031 585 593 8951 3031 8915 3622
2 1 0 1 0 25 55 0 20 4.000 0 0 -1 0 0 5
	 8003 4518 8569 3522 8720 3611 8154 4606 8003 4518
-6
6 8520 2705 9392 3324
5 1 0 1 0 19 40 0 20 0.000 0 0 0 0 8825.500 3228.799 8520 3059 8782 2882 9131 3059
5 1 0 1 0 19 40 0 20 0.000 0 1 0 0 8825.500 2889.201 8520 3059 8782 3236 9131 3059
1 1 0 1 0 19 40 0 20 0.000 1 0.0000 9218 3059 87 88 9218 3059 9305 3059
2 1 0 1 0 19 40 0 20 0.000 0 0 -1 0 0 2
	 8520 3059 9131 3059
2 1 0 1 0 19 40 0 20 0.000 0 0 -1 0 0 2
	 8677 2913 8677 2824
2 1 0 1 0 19 40 0 20 0.000 0 0 -1 0 0 2
	 8677 3210 8677 3298
2 1 0 1 0 19 40 0 20 0.000 0 0 -1 0 0 2
	 8970 2900 8970 2811
2 1 0 1 0 19 40 0 20 0.000 0 0 -1 0 0 2
	 8953 3236 8953 3324
2 1 0 1 0 19 40 0 20 0.000 0 0 -1 0 0 2
	 8813 3236 8813 3324
2 1 0 1 0 19 40 0 20 0.000 0 0 -1 0 0 2
	 9284 2988 9342 2941
2 1 0 1 0 19 40 0 20 0.000 0 0 -1 0 0 2
	 9296 3118 9342 3165
2 1 0 1 0 19 40 0 20 0.000 0 0 -1 0 0 2
	 8825 2870 8825 2782
-6
6 7648 2263 8259 2617
5 1 0 1 0 19 40 0 20 0.000 0 0 0 0 7852.094 2511.725 7710 2369 7878 2312 8047 2461
5 1 0 1 0 19 40 0 20 0.000 0 1 0 0 7903.933 2321.838 7710 2369 7827 2506 8047 2461
1 1 0 1 0 19 40 0 20 0.000 1 6.0214 8094 2474 50 51 8094 2474 8142 2487
2 1 0 1 0 19 40 0 20 0.000 0 0 -1 0 0 2
	 7710 2369 8047 2461
2 1 0 1 0 19 40 0 20 0.000 0 0 -1 0 0 2
	 7817 2313 7830 2265
2 1 0 1 0 19 40 0 20 0.000 0 0 -1 0 0 2
	 7774 2478 7761 2525
2 1 0 1 0 19 40 0 20 0.000 0 0 -1 0 0 2
	 7981 2349 7994 2300
2 1 0 1 0 19 40 0 20 0.000 0 0 -1 0 0 2
	 7922 2532 7909 2582
2 1 0 1 0 19 40 0 20 0.000 0 0 -1 0 0 2
	 7846 2512 7832 2560
2 1 0 1 0 19 40 0 20 0.000 0 0 -1 0 0 2
	 8141 2445 8180 2427
2 1 0 1 0 19 40 0 20 0.000 0 0 -1 0 0 2
	 8128 2519 8147 2552
2 1 0 1 0 19 40 0 20 0.000 0 0 -1 0 0 2
	 7905 2312 7918 2263
-6
6 9567 3589 10090 4120
5 1 0 1 0 19 40 0 20 0.000 0 1 0 0 9734.490 3830.077 9684 4027 9860 3990 9931 3778
5 1 0 1 0 19 40 0 20 0.000 0 0 0 0 9877.705 3972.141 9684 4027 9720 3847 9931 3778
1 1 0 1 0 19 40 0 20 0.000 0 0.7854 9967 3741 50 51 9967 3741 10002 3706
2 1 0 1 0 19 40 0 20 0.000 0 0 -1 0 0 2
	 9684 4027 9931 3778
2 1 0 1 0 19 40 0 20 0.000 0 0 -1 0 0 2
	 9805 4021 9841 4056
2 1 0 1 0 19 40 0 20 0.000 0 0 -1 0 0 2
	 9687 3902 9653 3865
2 1 0 1 0 19 40 0 20 0.000 0 0 -1 0 0 2
	 9930 3906 9966 3943
2 1 0 1 0 19 40 0 20 0.000 0 0 -1 0 0 2
	 9788 3778 9754 3743
2 1 0 1 0 19 40 0 20 0.000 0 0 -1 0 0 2
	 9732 3836 9696 3799
2 1 0 1 0 19 40 0 20 0.000 0 0 -1 0 0 2
	 10020 3743 10063 3738
2 1 0 1 0 19 40 0 20 0.000 0 0 -1 0 0 2
	 9974 3686 9973 3648
2 1 0 1 0 19 40 0 20 0.000 0 0 -1 0 0 2
	 9883 3977 9918 4014
-6
6 7997 2263 9654 4650
1 1 0 1 0 25 50 0 20 4.000 1 5.7596 8951 3031 681 691 8951 3031 9066 3711
1 1 0 1 0 11 45 0 20 4.000 1 5.7596 8951 3031 585 593 8951 3031 8915 3622
2 1 0 1 0 25 55 0 20 4.000 0 0 -1 0 0 5
	 8003 4518 8569 3522 8720 3611 8154 4606 8003 4518
-6
6 8346 3766 8782 4208
5 1 0 1 0 19 100 0 20 0.000 0 0 0 0 8680.986 3980.596 8732 4177 8558 4142 8485 3928
5 1 0 1 0 19 100 0 20 0.000 0 1 0 0 8538.780 4121.660 8732 4177 8698 3999 8485 3928
1 1 0 1 0 19 100 0 20 0.000 1 5.4978 8452 3893 50 51 8452 3893 8416 3857
2 1 0 1 0 19 100 0 20 0.000 0 0 -1 0 0 2
	 8732 4177 8485 3928
2 1 0 1 0 19 100 0 20 0.000 0 0 -1 0 0 2
	 8612 4173 8576 4208
2 1 0 1 0 19 100 0 20 0.000 0 0 -1 0 0 2
	 8731 4052 8766 4016
2 1 0 1 0 19 100 0 20 0.000 0 0 -1 0 0 2
	 8488 4058 8453 4094
2 1 0 1 0 19 100 0 20 0.000 0 0 -1 0 0 2
	 8630 3930 8665 3895
2 1 0 1 0 19 100 0 20 0.000 0 0 -1 0 0 2
	 8685 3986 8720 3950
2 1 0 1 0 19 100 0 20 0.000 0 0 -1 0 0 2
	 8397 3893 8354 3889
2 1 0 1 0 19 100 0 20 0.000 0 0 -1 0 0 2
	 8444 3836 8444 3798
2 1 0 1 0 19 100 0 20 0.000 0 0 -1 0 0 2
	 8535 4129 8498 4163
-6
6 9131 2263 9654 2794
5 1 0 1 0 19 100 0 20 0.000 0 1 0 0 9298.490 2504.077 9248 2701 9424 2664 9495 2452
5 1 0 1 0 19 100 0 20 0.000 0 0 0 0 9441.705 2646.141 9248 2701 9284 2521 9495 2452
1 1 0 1 0 19 100 0 20 0.000 0 0.7854 9531 2415 50 51 9531 2415 9566 2380
2 1 0 1 0 19 100 0 20 0.000 0 0 -1 0 0 2
	 9248 2701 9495 2452
2 1 0 1 0 19 100 0 20 0.000 0 0 -1 0 0 2
	 9369 2695 9405 2730
2 1 0 1 0 19 100 0 20 0.000 0 0 -1 0 0 2
	 9251 2576 9217 2539
2 1 0 1 0 19 100 0 20 0.000 0 0 -1 0 0 2
	 9494 2580 9530 2617
2 1 0 1 0 19 100 0 20 0.000 0 0 -1 0 0 2
	 9352 2452 9318 2417
2 1 0 1 0 19 100 0 20 0.000 0 0 -1 0 0 2
	 9296 2510 9260 2473
2 1 0 1 0 19 100 0 20 0.000 0 0 -1 0 0 2
	 9584 2417 9627 2412
2 1 0 1 0 19 100 0 20 0.000 0 0 -1 0 0 2
	 9538 2360 9537 2322
2 1 0 1 0 19 100 0 20 0.000 0 0 -1 0 0 2
	 9447 2651 9482 2688
-6
6 7997 2263 9654 4650
1 1 0 1 0 25 50 0 20 4.000 1 5.7596 8951 3031 681 691 8951 3031 9066 3711
1 1 0 1 0 11 45 0 20 4.000 1 5.7596 8951 3031 585 593 8951 3031 8915 3622
2 1 0 1 0 25 55 0 20 4.000 0 0 -1 0 0 5
	 8003 4518 8569 3522 8720 3611 8154 4606 8003 4518
-6
6 7575 3356 8098 3798
5 1 0 1 0 19 40 0 20 0.000 0 1 0 0 7907.752 3690.718 8050 3548 7881 3491 7713 3639
5 1 0 1 0 19 40 0 20 0.000 0 0 0 0 7856.602 3501.295 8050 3548 7933 3685 7713 3639
1 1 0 1 0 19 40 0 20 0.000 0 0.2618 7667 3652 50 51 7667 3652 7618 3665
2 1 0 1 0 19 40 0 20 0.000 0 0 -1 0 0 2
	 8050 3548 7713 3639
2 1 0 1 0 19 40 0 20 0.000 0 0 -1 0 0 2
	 7943 3492 7929 3442
2 1 0 1 0 19 40 0 20 0.000 0 0 -1 0 0 2
	 7986 3656 7999 3704
2 1 0 1 0 19 40 0 20 0.000 0 0 -1 0 0 2
	 7779 3527 7767 3479
2 1 0 1 0 19 40 0 20 0.000 0 0 -1 0 0 2
	 7839 3710 7852 3759
2 1 0 1 0 19 40 0 20 0.000 0 0 -1 0 0 2
	 7914 3690 7927 3738
2 1 0 1 0 19 40 0 20 0.000 0 0 -1 0 0 2
	 7619 3624 7581 3606
2 1 0 1 0 19 40 0 20 0.000 0 0 -1 0 0 2
	 7632 3697 7613 3730
2 1 0 1 0 19 40 0 20 0.000 0 0 -1 0 0 2
	 7855 3489 7841 3441
-6
