%!PS-Adobe-2.0 EPSF-2.0
%%Title: execloop.dia
%%Creator: Dia v0.90
%%CreationDate: Tue Mar 11 09:19:51 2003
%%For: pascal
%%Magnification: 1.0000
%%Orientation: Portrait
%%BoundingBox: 0 0 764 1503
%%Pages: 1
%%EndComments
%%BeginProlog
/cp {closepath} bind def
/c {curveto} bind def
/f {fill} bind def
/a {arc} bind def
/ef {eofill} bind def
/ex {exch} bind def
/gr {grestore} bind def
/gs {gsave} bind def
/sa {save} bind def
/rs {restore} bind def
/l {lineto} bind def
/m {moveto} bind def
/rm {rmoveto} bind def
/n {newpath} bind def
/s {stroke} bind def
/sh {show} bind def
/slc {setlinecap} bind def
/slj {setlinejoin} bind def
/slw {setlinewidth} bind def
/srgb {setrgbcolor} bind def
/rot {rotate} bind def
/sc {scale} bind def
/sd {setdash} bind def
/ff {findfont} bind def
/sf {setfont} bind def
/scf {scalefont} bind def
/sw {stringwidth pop} bind def
/tr {translate} bind def

/ellipsedict 8 dict def
ellipsedict /mtrx matrix put
/ellipse
{ ellipsedict begin
   /endangle exch def
   /startangle exch def
   /yrad exch def
   /xrad exch def
   /y exch def
   /x exch def   /savematrix mtrx currentmatrix def
   x y tr xrad yrad sc
   0 0 1 startangle endangle arc
   savematrix setmatrix
   end
} def

/mergeprocs {
dup length
3 -1 roll
dup
length
dup
5 1 roll
3 -1 roll
add
array cvx
dup
3 -1 roll
0 exch
putinterval
dup
4 2 roll
putinterval
} bind def
%%EndProlog

%%BeginSetup
%%EndSetup
28.346000 -28.346000 scale
5.049873 -54.150000 translate

0.100000 slw
[] 0 sd
[] 0 sd
0 slc
0 slj
0 slc
0 slj
[] 0 sd
1.000000 1.000000 1.000000 srgb
n 2.978227 1.200000 m 6.328533 1.200000 l 6.791114 1.200000 7.166110 1.647715 7.166110 2.200000 c 7.166110 2.752285 6.791114 3.200000 6.328533 3.200000 c 2.978227 3.200000 l 2.515646 3.200000 2.140650 2.752285 2.140650 2.200000 c 2.140650 1.647715 2.515646 1.200000 2.978227 1.200000 c f
0.000000 0.000000 0.000000 srgb
n 2.978227 1.200000 m 6.328533 1.200000 l 6.791114 1.200000 7.166110 1.647715 7.166110 2.200000 c 7.166110 2.752285 6.791114 3.200000 6.328533 3.200000 c 2.978227 3.200000 l 2.515646 3.200000 2.140650 2.752285 2.140650 2.200000 c 2.140650 1.647715 2.515646 1.200000 2.978227 1.200000 c s
 [ /xi /xi /xi /xi /xi /xi /xi /xi /xi /xi /xi /xi /xi /xi /xi /xi
 /xi /xi /xi /xi /xi /xi /xi /xi /xi /xi /xi /xi /xi /xi /xi /xi
 /s /t /a /r /e /n /d /f /xi /xi /c /h /space /b /y /o
 /x /u /E /p /i /question /w /Y /l /L /T /S /C /g /N /xi
 /xi /xi /xi /xi /xi /xi /xi /xi /xi /xi /xi /xi /xi /xi /xi /xi
 /xi /xi /xi /xi /xi /xi /xi /xi /xi /xi /xi /xi /xi /xi /xi /xi
 /xi /xi /xi /xi /xi /xi /xi /xi /xi /xi /xi /xi /xi /xi /xi /xi
 /xi /xi /xi /xi /xi /xi /xi /xi /xi /xi /xi /xi /xi /xi /xi /xi
 /xi /xi /xi /xi /xi /xi /xi /xi /xi /xi /xi /xi /xi /xi /xi /xi
 /xi /xi /xi /xi /xi /xi /xi /xi /xi /xi /xi /xi /xi /xi /xi /xi
 /xi /xi /xi /xi /xi /xi /xi /xi /xi /xi /xi /xi /xi /xi /xi /xi
 /xi /xi /xi /xi /xi /xi /xi /xi /xi /xi /xi /xi /xi /xi /xi /xi
 /xi /xi /xi /xi /xi /xi /xi /xi /xi /xi /xi /xi /xi /xi /xi /xi
 /xi /xi /xi /xi /xi /xi /xi /xi /xi /xi /xi /xi /xi /xi /xi /xi
 /xi /xi /xi /xi /xi /xi /xi /xi /xi /xi /xi /xi /xi /xi /xi /xi
 /xi /xi /xi /xi /xi /xi /xi /xi /xi /xi /xi /xi /xi /xi /xi /xi
] /e0 exch def
/Courier_e0 undefinefont
/Courier_e0
  /Courier findfont
  dup length dict begin
  {1 index /FID ne {def} {pop pop} ifelse} forall
  /Encoding e0 def
  currentdict end
definefont pop
/Courier_e0 ff 0.800000 scf sf
( !"#!) sw
2 div 4.653380 ex sub 2.396491 m ( !"#!)
 gs 1 -1 sc sh gr
0.100000 slw
[] 0 sd
[] 0 sd
0 slc
0 slj
0 slc
0 slj
[] 0 sd
1.000000 1.000000 1.000000 srgb
n 2.978227 52.100000 m 6.328533 52.100000 l 6.791114 52.100000 7.166110 52.547715 7.166110 53.100000 c 7.166110 53.652285 6.791114 54.100000 6.328533 54.100000 c 2.978227 54.100000 l 2.515646 54.100000 2.140650 53.652285 2.140650 53.100000 c 2.140650 52.547715 2.515646 52.100000 2.978227 52.100000 c f
0.000000 0.000000 0.000000 srgb
n 2.978227 52.100000 m 6.328533 52.100000 l 6.791114 52.100000 7.166110 52.547715 7.166110 53.100000 c 7.166110 53.652285 6.791114 54.100000 6.328533 54.100000 c 2.978227 54.100000 l 2.515646 54.100000 2.140650 53.652285 2.140650 53.100000 c 2.140650 52.547715 2.515646 52.100000 2.978227 52.100000 c s
/Courier_e0 ff 0.800000 scf sf
($%&) sw
2 div 4.653380 ex sub 53.296491 m ($%&)
 gs 1 -1 sc sh gr
1.000000 1.000000 1.000000 srgb
n 0.402980 4.750000 m 0.402980 6.650000 l 8.903780 6.650000 l 8.903780 4.750000 l f
0.100000 slw
[] 0 sd
[] 0 sd
0 slj
0.000000 0.000000 0.000000 srgb
n 0.402980 4.750000 m 0.402980 6.650000 l 8.903780 6.650000 l 8.903780 4.750000 l cp s
/Courier_e0 ff 0.800000 scf sf
('$!*+,-.!$*/&$) sw
2 div 4.653380 ex sub 5.896491 m ('$!*+,-.!$*/&$)
 gs 1 -1 sc sh gr
0.100000 slw
[] 0 sd
[] 0 sd
0 slc
n 4.653380 3.200000 m 4.653380 4.750000 l s
0 slj
n 4.253380 3.950000 m 4.653380 4.750000 l 5.053380 3.950000 l f
0.100000 slw
[] 0 sd
[] 0 sd
0 slc
n 4.653380 6.650000 m 4.653380 8.500010 l s
0 slj
n 4.253380 7.700010 m 4.653380 8.500010 l 5.053380 7.700010 l f
1.000000 1.000000 1.000000 srgb
n -0.138220 21.080000 m -0.138220 22.980000 l 9.444980 22.980000 l 9.444980 21.080000 l f
0.100000 slw
[] 0 sd
[] 0 sd
0 slj
0.000000 0.000000 0.000000 srgb
n -0.138220 21.080000 m -0.138220 22.980000 l 9.444980 22.980000 l 9.444980 21.080000 l cp s
/Courier_e0 ff 0.800000 scf sf
($0$*1!$,-.!$*/&$) sw
2 div 4.653380 ex sub 22.226491 m ($0$*1!$,-.!$*/&$)
 gs 1 -1 sc sh gr
1.000000 1.000000 1.000000 srgb
n 4.653358 24.478997 m 10.028967 26.303720 l 4.653358 28.128443 l -0.722251 26.303720 l f
0.100000 slw
[] 0 sd
[] 0 sd
0 slj
0.000000 0.000000 0.000000 srgb
n 4.653358 24.478997 m 10.028967 26.303720 l 4.653358 28.128443 l -0.722251 26.303720 l cp s
/Courier_e0 ff 0.800000 scf sf
(20*$3!4/%5) sw
2 div 4.653358 ex sub 26.500211 m (20*$3!4/%5)
 gs 1 -1 sc sh gr
0.100000 slw
[] 0 sd
[] 0 sd
0 slc
n 4.653380 22.980000 m 4.653380 24.479000 l s
0 slj
n 4.253380 23.679000 m 4.653380 24.479000 l 5.053380 23.679000 l f
1.000000 1.000000 1.000000 srgb
n 13.349600 25.350000 m 13.349600 27.250000 l 21.850400 27.250000 l 21.850400 25.350000 l f
0.100000 slw
[] 0 sd
[] 0 sd
0 slj
0.000000 0.000000 0.000000 srgb
n 13.349600 25.350000 m 13.349600 27.250000 l 21.850400 27.250000 l 21.850400 25.350000 l cp s
/Courier_e0 ff 0.800000 scf sf
(!+#/620*$3!4/%) sw
2 div 17.600000 ex sub 26.496491 m (!+#/620*$3!4/%)
 gs 1 -1 sc sh gr
0.100000 slw
[] 0 sd
[] 0 sd
0 slc
n 10.029000 26.303700 m 13.349600 26.300000 l s
0 slj
n 12.550046 26.700891 m 13.349600 26.300000 l 12.549155 25.900892 l f
/Courier_e0 ff 0.800000 scf sf
(7$ ) sw
2 div 11.400000 ex sub 26.150000 m (7$ )
 gs 1 -1 sc sh gr
1.000000 1.000000 1.000000 srgb
n -0.424220 8.500010 m -0.424220 11.200010 l 9.730980 11.200010 l 9.730980 8.500010 l f
0.100000 slw
[] 0 sd
[] 0 sd
0 slj
0.000000 0.000000 0.000000 srgb
n -0.424220 8.500010 m -0.424220 11.200010 l 9.730980 11.200010 l 9.730980 8.500010 l cp s
/Courier_e0 ff 0.800000 scf sf
(*"88,) sw
2 div 4.653380 ex sub 9.646501 m (*"88,)
 gs 1 -1 sc sh gr
(/%20$*1!$94 !$%$#) sw
2 div 4.653380 ex sub 10.446501 m (/%20$*1!$94 !$%$#)
 gs 1 -1 sc sh gr
1.000000 1.000000 1.000000 srgb
n -3.376620 31.220000 m -3.376620 33.920000 l 12.683380 33.920000 l 12.683380 31.220000 l f
0.100000 slw
[] 0 sd
[] 0 sd
0 slj
0.000000 0.000000 0.000000 srgb
n -3.376620 31.220000 m -3.376620 33.920000 l 12.683380 33.920000 l 12.683380 31.220000 l cp s
/Courier_e0 ff 0.800000 scf sf
(*"88,) sw
2 div 4.653380 ex sub 32.366491 m (*"88,)
 gs 1 -1 sc sh gr
(/%:+#$"&;!"!$<+"%=$&94 !$%$#) sw
2 div 4.653380 ex sub 33.166491 m (/%:+#$"&;!"!$<+"%=$&94 !$%$#)
 gs 1 -1 sc sh gr
1.000000 1.000000 1.000000 srgb
n -0.692620 36.620000 m -0.692620 39.320000 l 9.999380 39.320000 l 9.999380 36.620000 l f
0.100000 slw
[] 0 sd
[] 0 sd
0 slj
0.000000 0.000000 0.000000 srgb
n -0.692620 36.620000 m -0.692620 39.320000 l 9.999380 39.320000 l 9.999380 36.620000 l cp s
/Courier_e0 ff 0.800000 scf sf
(*"88,) sw
2 div 4.653380 ex sub 37.766491 m (*"88,)
 gs 1 -1 sc sh gr
(/%20$*1!$&94 !$%$#) sw
2 div 4.653380 ex sub 38.566491 m (/%20$*1!$&94 !$%$#)
 gs 1 -1 sc sh gr
0.100000 slw
[] 0 sd
[] 0 sd
0 slc
n 4.653380 28.128400 m 4.653380 31.220000 l s
0 slj
n 4.253380 30.420000 m 4.653380 31.220000 l 5.053380 30.420000 l f
0.100000 slw
[] 0 sd
[] 0 sd
0 slc
n 4.653380 33.920000 m 4.653380 36.620000 l s
0 slj
n 4.253380 35.820000 m 4.653380 36.620000 l 5.053380 35.820000 l f
1.000000 1.000000 1.000000 srgb
n 4.653378 41.221299 m 8.632084 45.200005 l 4.653378 49.178711 l 0.674672 45.200005 l f
0.100000 slw
[] 0 sd
[] 0 sd
0 slj
0.000000 0.000000 0.000000 srgb
n 4.653378 41.221299 m 8.632084 45.200005 l 4.653378 49.178711 l 0.674672 45.200005 l cp s
/Courier_e0 ff 0.800000 scf sf
(-.!$*/&$ ) sw
2 div 4.653378 ex sub 44.996496 m (-.!$*/&$ )
 gs 1 -1 sc sh gr
(8$'!5) sw
2 div 4.653378 ex sub 45.796496 m (8$'!5)
 gs 1 -1 sc sh gr
0.100000 slw
[] 0 sd
[] 0 sd
0 slc
n 4.653380 39.320000 m 4.653380 41.221300 l s
0 slj
n 4.253380 40.421300 m 4.653380 41.221300 l 5.053380 40.421300 l f
0.100000 slw
[] 0 sd
[] 0 sd
0 slc
n 4.653380 49.178700 m 4.653380 52.100000 l s
0 slj
n 4.253380 51.300000 m 4.653380 52.100000 l 5.053380 51.300000 l f
1.000000 1.000000 1.000000 srgb
n 4.653375 12.893199 m 7.919681 16.159505 l 4.653375 19.425811 l 1.387069 16.159505 l f
0.100000 slw
[] 0 sd
[] 0 sd
0 slj
0.000000 0.000000 0.000000 srgb
n 4.653375 12.893199 m 7.919681 16.159505 l 4.653375 19.425811 l 1.387069 16.159505 l cp s
/Courier_e0 ff 0.800000 scf sf
(#$'$!*+5) sw
2 div 4.653375 ex sub 16.355996 m (#$'$!*+5)
 gs 1 -1 sc sh gr
0.100000 slw
[] 0 sd
[] 0 sd
0 slc
n 4.653380 11.200000 m 4.653380 12.893200 l s
0 slj
n 4.253380 12.093200 m 4.653380 12.893200 l 5.053380 12.093200 l f
0.100000 slw
[] 0 sd
[] 0 sd
0 slc
n 4.653380 19.425800 m 4.653380 21.080000 l s
0 slj
n 4.253380 20.280000 m 4.653380 21.080000 l 5.053380 20.280000 l f
0.100000 slw
[] 0 sd
[] 0 sd
0 slj
0 slc
n 0.674673 45.200000 m -4.999500 45.157500 l s
0.100000 slw
[] 0 sd
[] 0 sd
0 slj
0 slc
n -4.999500 45.157500 m -4.999500 5.700000 l s
0.100000 slw
[] 0 sd
[] 0 sd
0 slj
0 slc
n -4.999500 5.700000 m 0.402980 5.700000 l s
0 slj
n -0.397020 6.100000 m 0.402980 5.700000 l -0.397020 5.300000 l f
0.100000 slw
[] 0 sd
[] 0 sd
0 slj
0 slc
n 7.919690 16.159500 m 13.000500 16.200000 l s
0.100000 slw
[] 0 sd
[] 0 sd
0 slj
0 slc
n 13.000500 16.200000 m 13.000500 5.700000 l s
0.100000 slw
[] 0 sd
[] 0 sd
0 slj
0 slc
n 13.000500 5.700000 m 8.903780 5.700000 l s
0 slj
n 9.703780 5.300000 m 8.903780 5.700000 l 9.703780 6.100000 l f
0.100000 slw
[] 0 sd
[] 0 sd
0 slj
0 slc
n 17.600000 27.250000 m 17.600000 29.746600 l 4.653380 29.746600 l 4.653380 31.220000 l s
0 slj
n 4.253380 30.420000 m 4.653380 31.220000 l 5.053380 30.420000 l f
/Courier_e0 ff 0.800000 scf sf
(7$ ) sw
2 div 10.308500 ex sub 16.013100 m (7$ )
 gs 1 -1 sc sh gr
/Courier_e0 ff 0.800000 scf sf
(>/) sw
2 div 5.400500 ex sub 20.046600 m (>/)
 gs 1 -1 sc sh gr
/Courier_e0 ff 0.800000 scf sf
(>/) sw
2 div 5.400500 ex sub 29.146600 m (>/)
 gs 1 -1 sc sh gr
/Courier_e0 ff 0.800000 scf sf
(7$ ) sw
2 div -0.691873 ex sub 44.776491 m (7$ )
 gs 1 -1 sc sh gr
/Courier_e0 ff 0.800000 scf sf
(>/) sw
2 div 5.512327 ex sub 50.411491 m (>/)
 gs 1 -1 sc sh gr
showpage
