(classPool
(JNukeClass "TwoLocks" "TwoLocks.java"
  (JNukeVar "I" "i")
  (JNukeVar "Ljava/lang/Object;" "lock")
  (JNukeMethod "TwoLocks.<init>" (JNukeSignature "V" (JNukeVector))
  (JNukeByteCodes
    (JNukeRByteCode 0 "r0 = Get" l0 (line 3))
    (JNukeRByteCode 1 "     InvokeSpecial" (JNukeMethod "java/lang/Object.<init>" (JNukeSignature "V" (JNukeVector))) r0)
    (JNukeRByteCode 2 "r0 = Get" l0 (line 5))
    (JNukeRByteCode 3 "r1 = New" "java/lang/Object")
    (JNukeRByteCode 4 "r2 = Get" r1)
    (JNukeRByteCode 5 "     InvokeSpecial" (JNukeMethod "java/lang/Object.<init>" (JNukeSignature "V" (JNukeVector))) r2)
    (JNukeRByteCode 6 "     PutField" "TwoLocks" (pair "lock" "Ljava/lang/Object;") r0 r1)
    (JNukeRByteCode 7 "     Return" void)
))
  (JNukeMethod "TwoLocks.inc" (JNukeSignature "V" (JNukeVector))
  (JNukeEHandlers
    (JNukeEHandlerDesc (JNukeMethod "TwoLocks.inc" (JNukeSignature "V" (JNukeVector))) "<Any exception>" 9 13 15)
    (JNukeEHandlerDesc (JNukeMethod "TwoLocks.inc" (JNukeSignature "V" (JNukeVector))) "<Any exception>" 15 17 15)
    (JNukeEHandlerDesc (JNukeMethod "TwoLocks.inc" (JNukeSignature "V" (JNukeVector))) "<Any exception>" 25 29 31)
    (JNukeEHandlerDesc (JNukeMethod "TwoLocks.inc" (JNukeSignature "V" (JNukeVector))) "<Any exception>" 31 33 31)
    (JNukeEHandlerDesc (JNukeMethod "TwoLocks.inc" (JNukeSignature "V" (JNukeVector))) "<Any exception>" 5 37 39)
    (JNukeEHandlerDesc (JNukeMethod "TwoLocks.inc" (JNukeSignature "V" (JNukeVector))) "<Any exception>" 39 41 39)
  )
  (JNukeByteCodes
    (JNukeRByteCode 0 "r0 = Get" l0 (line 9))
    (JNukeRByteCode 1 "r0 = GetField" "TwoLocks" (pair "lock" "Ljava/lang/Object;") r0)
    (JNukeRByteCode 2 "r1 = Get" r0)
    (JNukeRByteCode 3 "l2 = Get" r1)
    (JNukeRByteCode 4 "     MonitorEnter" r0)
    (JNukeRByteCode 5 "r0 = Get" l0 (line 10))
    (JNukeRByteCode 6 "r1 = Get" r0)
    (JNukeRByteCode 7 "l3 = Get" r1)
    (JNukeRByteCode 8 "     MonitorEnter" r0)
    (JNukeRByteCode 9 "r0 = Get" l0 (line 11))
    (JNukeRByteCode 10 "r0 = GetField" "TwoLocks" (pair "i" "I") r0)
    (JNukeRByteCode 11 "l1 = Get" r0)
    (JNukeRByteCode 12 "r0 = Get" l3 (line 12))
    (JNukeRByteCode 13 "     MonitorExit" r0)
    (JNukeRByteCode 14 "     Goto" 20)
    (JNukeRByteCode 15 "l4 = Get" r0)
    (JNukeRByteCode 16 "r0 = Get" l3)
    (JNukeRByteCode 17 "     MonitorExit" r0)
    (JNukeRByteCode 18 "r0 = Get" l4)
    (JNukeRByteCode 19 "     Athrow" r0)
    (JNukeRByteCode 20 "     Inc" l1 0x1 (line 13))
    (JNukeRByteCode 21 "r0 = Get" l0 (line 14))
    (JNukeRByteCode 22 "r1 = Get" r0)
    (JNukeRByteCode 23 "l4 = Get" r1)
    (JNukeRByteCode 24 "     MonitorEnter" r0)
    (JNukeRByteCode 25 "r0 = Get" l0 (line 15))
    (JNukeRByteCode 26 "r1 = Get" l1)
    (JNukeRByteCode 27 "     PutField" "TwoLocks" (pair "i" "I") r0 r1)
    (JNukeRByteCode 28 "r0 = Get" l4 (line 16))
    (JNukeRByteCode 29 "     MonitorExit" r0)
    (JNukeRByteCode 30 "     Goto" 36)
    (JNukeRByteCode 31 "l5 = Get" r0)
    (JNukeRByteCode 32 "r0 = Get" l4)
    (JNukeRByteCode 33 "     MonitorExit" r0)
    (JNukeRByteCode 34 "r0 = Get" l5)
    (JNukeRByteCode 35 "     Athrow" r0)
    (JNukeRByteCode 36 "r0 = Get" l2 (line 17))
    (JNukeRByteCode 37 "     MonitorExit" r0)
    (JNukeRByteCode 38 "     Goto" 44)
    (JNukeRByteCode 39 "l6 = Get" r0)
    (JNukeRByteCode 40 "r0 = Get" l2)
    (JNukeRByteCode 41 "     MonitorExit" r0)
    (JNukeRByteCode 42 "r0 = Get" l6)
    (JNukeRByteCode 43 "     Athrow" r0)
    (JNukeRByteCode 44 "     Return" void (line 18))
))
)
)
