ViewXY_YZ_3D.<init>:10:Write access to field ViewXY_YZ_3D.coord by thread 0 (holding 0 locks)
ViewYZ_Y_Z_3D.<init>:10:Write access to field ViewYZ_Y_Z_3D.coord by thread 0 (holding 0 locks)
ViewXY_YZ_3D.run:14:Read access to field ViewXY_YZ_3D.coord by thread 1 (holding 0 locks)
Coord3D.setXY:45:monitorenter by thread 1
Coord3D.setXY:45:Write access to field Coord3D.x by thread 1 (holding 1 locks: Coord3D)
Coord3D.setXY:46:Write access to field Coord3D.y by thread 1 (holding 1 locks: Coord3D)
ViewXY_YZ_3D.run:15:Read access to field ViewXY_YZ_3D.coord by thread 1 (holding 0 locks)
Coord3D.setYZ:50:monitorenter by thread 1
Coord3D.setYZ:50:Write access to field Coord3D.y by thread 1 (holding 1 locks: Coord3D)
Coord3D.setYZ:51:Write access to field Coord3D.z by thread 1 (holding 1 locks: Coord3D)
ViewZX_Z_X_3D.<init>:10:Write access to field ViewZX_Z_X_3D.coord by thread 0 (holding 0 locks)
ViewYZ_Y_Z_3D.run:14:Read access to field ViewYZ_Y_Z_3D.coord by thread 2 (holding 0 locks)
Coord3D.setYZ:50:monitorenter by thread 2
Coord3D.setYZ:50:Write access to field Coord3D.y by thread 2 (holding 1 locks: Coord3D)
Coord3D.setYZ:51:Write access to field Coord3D.z by thread 2 (holding 1 locks: Coord3D)
ViewYZ_Y_Z_3D.run:15:Read access to field ViewYZ_Y_Z_3D.coord by thread 2 (holding 0 locks)
Coord3D.getY:23:monitorenter by thread 2
Coord3D.getY:23:Read access to field Coord3D.y by thread 2 (holding 1 locks: Coord3D)
ViewYZ_Y_Z_3D.run:16:Read access to field ViewYZ_Y_Z_3D.coord by thread 2 (holding 0 locks)
Coord3D.getZ:27:monitorenter by thread 2
Coord3D.getZ:27:Read access to field Coord3D.z by thread 2 (holding 1 locks: Coord3D)
ViewZX_Z_X_3D.run:14:Read access to field ViewZX_Z_X_3D.coord by thread 3 (holding 0 locks)
Coord3D.setZX:55:monitorenter by thread 3
Coord3D.setZX:55:Write access to field Coord3D.z by thread 3 (holding 1 locks: Coord3D)
Coord3D.setZX:56:Write access to field Coord3D.x by thread 3 (holding 1 locks: Coord3D)
ViewZX_Z_X_3D.run:15:Read access to field ViewZX_Z_X_3D.coord by thread 3 (holding 0 locks)
Coord3D.getZ:27:monitorenter by thread 3
Coord3D.getZ:27:Read access to field Coord3D.z by thread 3 (holding 1 locks: Coord3D)
ViewZX_Z_X_3D.run:16:Read access to field ViewZX_Z_X_3D.coord by thread 3 (holding 0 locks)
Coord3D.getX:17:monitorenter by thread 3
Coord3D.getX:18:Read access to field Coord3D.x by thread 3 (holding 1 locks: Coord3D)
HIGH-LEVEL DATA RACE FOUND:
Conflict between thread 2 (ViewYZ_Y_Z_3D, "Thread-2")
and thread 1 (ViewXY_YZ_3D, "Thread-1")
    Fields involved in conflict:
        1) Coord3D.z
        2) Coord3D.y
    Views of thread 2 (ViewYZ_Y_Z_3D, "Thread-2"): {
        1) Coord3D.getZ:27: [1]
        2) Coord3D.getY:23: [2]}.
    Conflicting maxView of thread 1 (ViewXY_YZ_3D, "Thread-1"):
        Coord3D.setYZ:50: [1, 2].
HIGH-LEVEL DATA RACE FOUND:
Conflict between thread 1 (ViewXY_YZ_3D, "Thread-1")
and thread 3 (ViewZX_Z_X_3D, "Thread-3")
    Fields involved in conflict:
        1) Coord3D.z
        2) Coord3D.x
    Views of thread 1 (ViewXY_YZ_3D, "Thread-1"): {
        1) Coord3D.setYZ:50: [1]
        2) Coord3D.setXY:45: [2]}.
    Conflicting maxView of thread 3 (ViewZX_Z_X_3D, "Thread-3"):
        Coord3D.setZX:55: [1, 2].
