%!PS-Adobe-3.0 EPSF-3.0
%%Creator: Tk Canvas Widget
%%For: Pascal Eugster
%%Title: Window .workspace3EC0F7CC-200.wsCanvas
%%CreationDate: Tue May 13 17:02:14 2003
%%BoundingBox: 8 158 604 634
%%Pages: 1
%%DocumentData: Clean7Bit
%%Orientation: Portrait
%%DocumentNeededResources: font Helvetica
%%+ font Helvetica-Bold
%%EndComments

%%BeginProlog
50 dict begin

% This is a standard prolog for Postscript generated by Tk's canvas
% widget.
% RCS: @(#) $Id: jnuke.ps,v 1.1 2003-05-13 15:12:32 pascal Exp $

% The definitions below just define all of the variables used in
% any of the procedures here.  This is needed for obscure reasons
% explained on p. 716 of the Postscript manual (Section H.2.7,
% "Initializing Variables," in the section on Encapsulated Postscript).

/baseline 0 def
/stipimage 0 def
/height 0 def
/justify 0 def
/lineLength 0 def
/spacing 0 def
/stipple 0 def
/strings 0 def
/xoffset 0 def
/yoffset 0 def
/tmpstip null def

% Define the array ISOLatin1Encoding (which specifies how characters are
% encoded for ISO-8859-1 fonts), if it isn't already present (Postscript
% level 2 is supposed to define it, but level 1 doesn't).

systemdict /ISOLatin1Encoding known not {
    /ISOLatin1Encoding [
	/space /space /space /space /space /space /space /space
	/space /space /space /space /space /space /space /space
	/space /space /space /space /space /space /space /space
	/space /space /space /space /space /space /space /space
	/space /exclam /quotedbl /numbersign /dollar /percent /ampersand
	    /quoteright
	/parenleft /parenright /asterisk /plus /comma /minus /period /slash
	/zero /one /two /three /four /five /six /seven
	/eight /nine /colon /semicolon /less /equal /greater /question
	/at /A /B /C /D /E /F /G
	/H /I /J /K /L /M /N /O
	/P /Q /R /S /T /U /V /W
	/X /Y /Z /bracketleft /backslash /bracketright /asciicircum /underscore
	/quoteleft /a /b /c /d /e /f /g
	/h /i /j /k /l /m /n /o
	/p /q /r /s /t /u /v /w
	/x /y /z /braceleft /bar /braceright /asciitilde /space
	/space /space /space /space /space /space /space /space
	/space /space /space /space /space /space /space /space
	/dotlessi /grave /acute /circumflex /tilde /macron /breve /dotaccent
	/dieresis /space /ring /cedilla /space /hungarumlaut /ogonek /caron
	/space /exclamdown /cent /sterling /currency /yen /brokenbar /section
	/dieresis /copyright /ordfeminine /guillemotleft /logicalnot /hyphen
	    /registered /macron
	/degree /plusminus /twosuperior /threesuperior /acute /mu /paragraph
	    /periodcentered
	/cedillar /onesuperior /ordmasculine /guillemotright /onequarter
	    /onehalf /threequarters /questiondown
	/Agrave /Aacute /Acircumflex /Atilde /Adieresis /Aring /AE /Ccedilla
	/Egrave /Eacute /Ecircumflex /Edieresis /Igrave /Iacute /Icircumflex
	    /Idieresis
	/Eth /Ntilde /Ograve /Oacute /Ocircumflex /Otilde /Odieresis /multiply
	/Oslash /Ugrave /Uacute /Ucircumflex /Udieresis /Yacute /Thorn
	    /germandbls
	/agrave /aacute /acircumflex /atilde /adieresis /aring /ae /ccedilla
	/egrave /eacute /ecircumflex /edieresis /igrave /iacute /icircumflex
	    /idieresis
	/eth /ntilde /ograve /oacute /ocircumflex /otilde /odieresis /divide
	/oslash /ugrave /uacute /ucircumflex /udieresis /yacute /thorn
	    /ydieresis
    ] def
} if

% font ISOEncode font
% This procedure changes the encoding of a font from the default
% Postscript encoding to ISOLatin1.  It's typically invoked just
% before invoking "setfont".  The body of this procedure comes from
% Section 5.6.1 of the Postscript book.

/ISOEncode {
    dup length dict begin
	{1 index /FID ne {def} {pop pop} ifelse} forall
	/Encoding ISOLatin1Encoding def
	currentdict
    end

    % I'm not sure why it's necessary to use "definefont" on this new
    % font, but it seems to be important; just use the name "Temporary"
    % for the font.

    /Temporary exch definefont
} bind def

% StrokeClip
%
% This procedure converts the current path into a clip area under
% the assumption of stroking.  It's a bit tricky because some Postscript
% interpreters get errors during strokepath for dashed lines.  If
% this happens then turn off dashes and try again.

/StrokeClip {
    {strokepath} stopped {
	(This Postscript printer gets limitcheck overflows when) =
	(stippling dashed lines;  lines will be printed solid instead.) =
	[] 0 setdash strokepath} if
    clip
} bind def

% desiredSize EvenPixels closestSize
%
% The procedure below is used for stippling.  Given the optimal size
% of a dot in a stipple pattern in the current user coordinate system,
% compute the closest size that is an exact multiple of the device's
% pixel size.  This allows stipple patterns to be displayed without
% aliasing effects.

/EvenPixels {
    % Compute exact number of device pixels per stipple dot.
    dup 0 matrix currentmatrix dtransform
    dup mul exch dup mul add sqrt

    % Round to an integer, make sure the number is at least 1, and compute
    % user coord distance corresponding to this.
    dup round dup 1 lt {pop 1} if
    exch div mul
} bind def

% width height string StippleFill --
%
% Given a path already set up and a clipping region generated from
% it, this procedure will fill the clipping region with a stipple
% pattern.  "String" contains a proper image description of the
% stipple pattern and "width" and "height" give its dimensions.  Each
% stipple dot is assumed to be about one unit across in the current
% user coordinate system.  This procedure trashes the graphics state.

/StippleFill {
    % The following code is needed to work around a NeWSprint bug.

    /tmpstip 1 index def

    % Change the scaling so that one user unit in user coordinates
    % corresponds to the size of one stipple dot.
    1 EvenPixels dup scale

    % Compute the bounding box occupied by the path (which is now
    % the clipping region), and round the lower coordinates down
    % to the nearest starting point for the stipple pattern.  Be
    % careful about negative numbers, since the rounding works
    % differently on them.

    pathbbox
    4 2 roll
    5 index div dup 0 lt {1 sub} if cvi 5 index mul 4 1 roll
    6 index div dup 0 lt {1 sub} if cvi 6 index mul 3 2 roll

    % Stack now: width height string y1 y2 x1 x2
    % Below is a doubly-nested for loop to iterate across this area
    % in units of the stipple pattern size, going up columns then
    % across rows, blasting out a stipple-pattern-sized rectangle at
    % each position

    6 index exch {
	2 index 5 index 3 index {
	    % Stack now: width height string y1 y2 x y

	    gsave
	    1 index exch translate
	    5 index 5 index true matrix tmpstip imagemask
	    grestore
	} for
	pop
    } for
    pop pop pop pop pop
} bind def

% -- AdjustColor --
% Given a color value already set for output by the caller, adjusts
% that value to a grayscale or mono value if requested by the CL
% variable.

/AdjustColor {
    CL 2 lt {
	currentgray
	CL 0 eq {
	    .5 lt {0} {1} ifelse
	} if
	setgray
    } if
} bind def

% x y strings spacing xoffset yoffset justify stipple DrawText --
% This procedure does all of the real work of drawing text.  The
% color and font must already have been set by the caller, and the
% following arguments must be on the stack:
%
% x, y -	Coordinates at which to draw text.
% strings -	An array of strings, one for each line of the text item,
%		in order from top to bottom.
% spacing -	Spacing between lines.
% xoffset -	Horizontal offset for text bbox relative to x and y: 0 for
%		nw/w/sw anchor, -0.5 for n/center/s, and -1.0 for ne/e/se.
% yoffset -	Vertical offset for text bbox relative to x and y: 0 for
%		nw/n/ne anchor, +0.5 for w/center/e, and +1.0 for sw/s/se.
% justify -	0 for left justification, 0.5 for center, 1 for right justify.
% stipple -	Boolean value indicating whether or not text is to be
%		drawn in stippled fashion.  If text is stippled,
%		procedure StippleText must have been defined to call
%		StippleFill in the right way.
%
% Also, when this procedure is invoked, the color and font must already
% have been set for the text.

/DrawText {
    /stipple exch def
    /justify exch def
    /yoffset exch def
    /xoffset exch def
    /spacing exch def
    /strings exch def

    % First scan through all of the text to find the widest line.

    /lineLength 0 def
    strings {
	stringwidth pop
	dup lineLength gt {/lineLength exch def} {pop} ifelse
	newpath
    } forall

    % Compute the baseline offset and the actual font height.

    0 0 moveto (TXygqPZ) false charpath
    pathbbox dup /baseline exch def
    exch pop exch sub /height exch def pop
    newpath

    % Translate coordinates first so that the origin is at the upper-left
    % corner of the text's bounding box. Remember that x and y for
    % positioning are still on the stack.

    translate
    lineLength xoffset mul
    strings length 1 sub spacing mul height add yoffset mul translate

    % Now use the baseline and justification information to translate so
    % that the origin is at the baseline and positioning point for the
    % first line of text.

    justify lineLength mul baseline neg translate

    % Iterate over each of the lines to output it.  For each line,
    % compute its width again so it can be properly justified, then
    % display it.

    strings {
	dup stringwidth pop
	justify neg mul 0 moveto
	stipple {

	    % The text is stippled, so turn it into a path and print
	    % by calling StippledText, which in turn calls StippleFill.
	    % Unfortunately, many Postscript interpreters will get
	    % overflow errors if we try to do the whole string at
	    % once, so do it a character at a time.

	    gsave
	    /char (X) def
	    {
		char 0 3 -1 roll put
		currentpoint
		gsave
		char true charpath clip StippleText
		grestore
		char stringwidth translate
		moveto
	    } forall
	    grestore
	} {show} ifelse
	0 spacing neg translate
    } forall
} bind def

%%EndProlog
%%BeginSetup
/CL 2 def
%%IncludeResource: font Helvetica
%%IncludeResource: font Helvetica-Bold
%%EndSetup

%%Page: 1 1
save
306.0 396.0 translate
0.5058 0.5058 scale
-588 -470 translate
0 940 moveto 1177 940 lineto 1177 0 lineto 0 0 lineto closepath clip newpath
gsave
510.41242933348 535.9593220296 moveto 453.1118644116 0 rlineto 0 -97.5050847468001 rlineto -453.1118644116 0 rlineto closepath
0.984 0.961 0.682 setrgbcolor AdjustColor
fill
510.41242933348 535.9593220296 moveto 453.1118644116 0 rlineto 0 -97.5050847468001 rlineto -453.1118644116 0 rlineto closepath
0 setlinejoin 2 setlinecap
1 setlinewidth
[] 0 setdash
0.000 0.000 0.000 setrgbcolor AdjustColor
stroke
grestore
gsave
510.41242933348 513.016949148 moveto
963.524293745081 513.016949148 lineto
0 setlinecap
1 setlinejoin
1 setlinewidth
[] 0 setdash
0.000 0.000 0.000 setrgbcolor AdjustColor
stroke
grestore
gsave
510.41242933348 490.0745762664 moveto
963.524293745081 490.0745762664 lineto
0 setlinecap
1 setlinejoin
1 setlinewidth
[] 0 setdash
0.000 0.000 0.000 setrgbcolor AdjustColor
stroke
grestore
gsave
grestore
gsave
/Helvetica-Bold findfont 8 scalefont ISOEncode setfont
0.000 0.000 0.000 setrgbcolor AdjustColor
736.96836154045 524.4881355888 [
(JNukeRuntimeEnvironment)
] 9 -0.5 0.5 0.5 false DrawText
grestore
gsave
grestore
gsave
grestore
gsave
grestore
gsave
grestore
gsave
/Helvetica findfont 8 scalefont ISOEncode setfont
0.000 0.000 0.000 setrgbcolor AdjustColor
512.96158187705 486.8881355884 [
(void addOnExecuteListener\050int bc, JNukeObj *listenerObj, JNukeExecutionListener\050l\051\051)
(void addOnExecutedListener\050int bc, JNukeObj *listenerOb, JNukeExecutionListener\050l\051j\051)
(void setThreadStateListener\050JNukeObj "listenerObj,  JNukeThreadStateChangedListener\050l\051\051)
()
] 9 -0 0 0 false DrawText
grestore
gsave
510.41242933348 535.9593220296 moveto 453.1118644116 0 rlineto 0 -97.5050847468001 rlineto -453.1118644116 0 rlineto closepath
0 setlinejoin 2 setlinecap
1 setlinewidth
[] 0 setdash
0.000 0.000 0.000 setrgbcolor AdjustColor
stroke
grestore
gsave
791.456497133081 157.4101694832 moveto 103.2406779672 0 rlineto 0 -68.8271186448 rlineto -103.2406779672 0 rlineto closepath
0.984 0.961 0.682 setrgbcolor AdjustColor
fill
791.456497133081 157.4101694832 moveto 103.2406779672 0 rlineto 0 -68.8271186448 rlineto -103.2406779672 0 rlineto closepath
0 setlinejoin 2 setlinecap
1 setlinewidth
[] 0 setdash
0.000 0.000 0.000 setrgbcolor AdjustColor
stroke
grestore
gsave
791.456497133081 134.4677966016 moveto
894.69717510028 134.4677966016 lineto
0 setlinecap
1 setlinejoin
1 setlinewidth
[] 0 setdash
0.000 0.000 0.000 setrgbcolor AdjustColor
stroke
grestore
gsave
791.456497133081 111.52542372 moveto
894.69717510028 111.52542372 lineto
0 setlinecap
1 setlinejoin
1 setlinewidth
[] 0 setdash
0.000 0.000 0.000 setrgbcolor AdjustColor
stroke
grestore
gsave
grestore
gsave
/Helvetica-Bold findfont 8 scalefont ISOEncode setfont
0.000 0.000 0.000 setrgbcolor AdjustColor
843.07683611785 145.9389830424 [
(JNukeThread)
] 9 -0.5 0.5 0.5 false DrawText
grestore
gsave
grestore
gsave
grestore
gsave
grestore
gsave
grestore
gsave
/Helvetica findfont 8 scalefont ISOEncode setfont
0.000 0.000 0.000 setrgbcolor AdjustColor
794.00564967665 108.338983042 [
(JNukeObj* getLocks\050\051;)
] 9 -0 0 0 false DrawText
grestore
gsave
791.456497133081 157.4101694832 moveto 103.2406779672 0 rlineto 0 -68.8271186448 rlineto -103.2406779672 0 rlineto closepath
0 setlinejoin 2 setlinecap
1 setlinewidth
[] 0 setdash
0.000 0.000 0.000 setrgbcolor AdjustColor
stroke
grestore
gsave
516.14802255388 168.881355924 moveto 177.8033898324 0 rlineto 0 -86.0338983059999 rlineto -177.8033898324 0 rlineto closepath
0.984 0.961 0.682 setrgbcolor AdjustColor
fill
516.14802255388 168.881355924 moveto 177.8033898324 0 rlineto 0 -86.0338983059999 rlineto -177.8033898324 0 rlineto closepath
0 setlinejoin 2 setlinecap
1 setlinewidth
[] 0 setdash
0.000 0.000 0.000 setrgbcolor AdjustColor
stroke
grestore
gsave
516.14802255388 145.9389830424 moveto
693.95141238628 145.9389830424 lineto
0 setlinecap
1 setlinejoin
1 setlinewidth
[] 0 setdash
0.000 0.000 0.000 setrgbcolor AdjustColor
stroke
grestore
gsave
516.14802255388 122.9966101608 moveto
693.95141238628 122.9966101608 lineto
0 setlinecap
1 setlinejoin
1 setlinewidth
[] 0 setdash
0.000 0.000 0.000 setrgbcolor AdjustColor
stroke
grestore
gsave
grestore
gsave
/Helvetica-Bold findfont 8 scalefont ISOEncode setfont
0.000 0.000 0.000 setrgbcolor AdjustColor
605.04971747125 157.4101694832 [
(JNukeLock)
] 9 -0.5 0.5 0.5 false DrawText
grestore
gsave
grestore
gsave
grestore
gsave
grestore
gsave
grestore
gsave
/Helvetica findfont 8 scalefont ISOEncode setfont
0.000 0.000 0.000 setrgbcolor AdjustColor
518.69717509745 119.8101694828 [
(int getN\050\051)
(JNukeObj* getOwner\050\051)
(JNukeJavaInstanceHeader getObject\050\051)
] 9 -0 0 0 false DrawText
grestore
gsave
516.14802255388 168.881355924 moveto 177.8033898324 0 rlineto 0 -86.0338983059999 rlineto -177.8033898324 0 rlineto closepath
0 setlinejoin 2 setlinecap
1 setlinewidth
[] 0 setdash
0.000 0.000 0.000 setrgbcolor AdjustColor
stroke
grestore
gsave
693.95141238628 140.203389822 moveto
791.456497133081 140.203389822 lineto
0 setlinecap
1 setlinejoin
1 setlinewidth
[] 0 setdash
0.000 0.000 0.000 setrgbcolor AdjustColor
stroke
grestore
gsave
grestore
gsave
/Helvetica findfont 7 scalefont ISOEncode setfont
0.000 0.000 0.000 setrgbcolor AdjustColor
697.77514120105 131.2813559236 [
(threads)
] 7 -0 0.5 0.5 false DrawText
grestore
gsave
grestore
gsave
/Helvetica findfont 7 scalefont ISOEncode setfont
0.000 0.000 0.000 setrgbcolor AdjustColor
697.77514120105 149.1254237204 [
(*)
] 7 -0 0.5 0.5 false DrawText
grestore
gsave
grestore
gsave
/Helvetica findfont 7 scalefont ISOEncode setfont
0.000 0.000 0.000 setrgbcolor AdjustColor
787.63276832065 131.2813559236 [
(owner)
] 7 -1 0.5 0.5 false DrawText
grestore
gsave
grestore
gsave
/Helvetica findfont 7 scalefont ISOEncode setfont
0.000 0.000 0.000 setrgbcolor AdjustColor
787.63276832065 149.1254237204 [
(1)
] 7 -1 0.5 0.5 false DrawText
grestore
gsave
539.09039543548 295.0644067728 moveto 131.9186440692 0 rlineto 0 -97.5050847468001 rlineto -131.9186440692 0 rlineto closepath
0.984 0.961 0.682 setrgbcolor AdjustColor
fill
539.09039543548 295.0644067728 moveto 131.9186440692 0 rlineto 0 -97.5050847468001 rlineto -131.9186440692 0 rlineto closepath
0 setlinejoin 2 setlinecap
1 setlinewidth
[] 0 setdash
0.000 0.000 0.000 setrgbcolor AdjustColor
stroke
grestore
gsave
539.09039543548 272.1220338912 moveto
671.00903950468 272.1220338912 lineto
0 setlinecap
1 setlinejoin
1 setlinewidth
[] 0 setdash
0.000 0.000 0.000 setrgbcolor AdjustColor
stroke
grestore
gsave
539.09039543548 220.5016949076 moveto
671.00903950468 220.5016949076 lineto
0 setlinecap
1 setlinejoin
1 setlinewidth
[] 0 setdash
0.000 0.000 0.000 setrgbcolor AdjustColor
stroke
grestore
gsave
grestore
gsave
/Helvetica-Bold findfont 8 scalefont ISOEncode setfont
0.000 0.000 0.000 setrgbcolor AdjustColor
605.04971747125 283.593220332 [
(JNukeJavaInstanceHeader)
] 9 -0.5 0.5 0.5 false DrawText
grestore
gsave
grestore
gsave
grestore
gsave
/Helvetica findfont 8 scalefont ISOEncode setfont
0.000 0.000 0.000 setrgbcolor AdjustColor
541.63954797905 268.9355932132 [
(instanceDesc: JNukeObj*)
(lock: JNukeObj*)
(arrayLength: int)
(waitSet : JNukeObj*)
] 9 -0 0 0 false DrawText
grestore
gsave
grestore
gsave
grestore
gsave
539.09039543548 295.0644067728 moveto 131.9186440692 0 rlineto 0 -97.5050847468001 rlineto -131.9186440692 0 rlineto closepath
0 setlinejoin 2 setlinecap
1 setlinewidth
[] 0 setdash
0.000 0.000 0.000 setrgbcolor AdjustColor
stroke
grestore
gsave
711.15819204748 283.593220332 moveto 103.2406779672 0 rlineto 0 -68.8271186448001 rlineto -103.2406779672 0 rlineto closepath
0.984 0.961 0.682 setrgbcolor AdjustColor
fill
711.15819204748 283.593220332 moveto 103.2406779672 0 rlineto 0 -68.8271186448001 rlineto -103.2406779672 0 rlineto closepath
0 setlinejoin 2 setlinecap
1 setlinewidth
[] 0 setdash
0.000 0.000 0.000 setrgbcolor AdjustColor
stroke
grestore
gsave
711.15819204748 260.6508474504 moveto
814.39887001468 260.6508474504 lineto
0 setlinecap
1 setlinejoin
1 setlinewidth
[] 0 setdash
0.000 0.000 0.000 setrgbcolor AdjustColor
stroke
grestore
gsave
711.15819204748 237.7084745688 moveto
814.39887001468 237.7084745688 lineto
0 setlinecap
1 setlinejoin
1 setlinewidth
[] 0 setdash
0.000 0.000 0.000 setrgbcolor AdjustColor
stroke
grestore
gsave
grestore
gsave
/Helvetica-Bold findfont 8 scalefont ISOEncode setfont
0.000 0.000 0.000 setrgbcolor AdjustColor
762.77853103225 272.1220338912 [
(JNukeInstanceDesc)
] 9 -0.5 0.5 0.5 false DrawText
grestore
gsave
grestore
gsave
grestore
gsave
grestore
gsave
grestore
gsave
/Helvetica findfont 8 scalefont ISOEncode setfont
0.000 0.000 0.000 setrgbcolor AdjustColor
713.70734459105 234.5220338908 [
(JNukeObj* getClass\050\051)
] 9 -0 0 0 false DrawText
grestore
gsave
711.15819204748 283.593220332 moveto 103.2406779672 0 rlineto 0 -68.8271186448001 rlineto -103.2406779672 0 rlineto closepath
0 setlinejoin 2 setlinecap
1 setlinewidth
[] 0 setdash
0.000 0.000 0.000 setrgbcolor AdjustColor
stroke
grestore
gsave
671.00903950468 249.1796610096 moveto
711.15819204748 249.1796610096 lineto
0 setlinecap
1 setlinejoin
1 setlinewidth
[] 0 setdash
0.000 0.000 0.000 setrgbcolor AdjustColor
stroke
grestore
gsave
grestore
gsave
grestore
gsave
grestore
gsave
grestore
gsave
grestore
gsave
grestore
gsave
grestore
gsave
grestore
gsave
871.75480221868 283.593220332 moveto 103.2406779672 0 rlineto 0 -68.8271186448001 rlineto -103.2406779672 0 rlineto closepath
0.984 0.961 0.682 setrgbcolor AdjustColor
fill
871.75480221868 283.593220332 moveto 103.2406779672 0 rlineto 0 -68.8271186448001 rlineto -103.2406779672 0 rlineto closepath
0 setlinejoin 2 setlinecap
1 setlinewidth
[] 0 setdash
0.000 0.000 0.000 setrgbcolor AdjustColor
stroke
grestore
gsave
871.75480221868 260.6508474504 moveto
974.99548018588 260.6508474504 lineto
0 setlinecap
1 setlinejoin
1 setlinewidth
[] 0 setdash
0.000 0.000 0.000 setrgbcolor AdjustColor
stroke
grestore
gsave
871.75480221868 237.7084745688 moveto
974.99548018588 237.7084745688 lineto
0 setlinecap
1 setlinejoin
1 setlinewidth
[] 0 setdash
0.000 0.000 0.000 setrgbcolor AdjustColor
stroke
grestore
gsave
grestore
gsave
/Helvetica-Bold findfont 8 scalefont ISOEncode setfont
0.000 0.000 0.000 setrgbcolor AdjustColor
923.37514120345 272.1220338912 [
(JNukeClass)
] 9 -0.5 0.5 0.5 false DrawText
grestore
gsave
grestore
gsave
grestore
gsave
grestore
gsave
grestore
gsave
grestore
gsave
871.75480221868 283.593220332 moveto 103.2406779672 0 rlineto 0 -68.8271186448001 rlineto -103.2406779672 0 rlineto closepath
0 setlinejoin 2 setlinecap
1 setlinewidth
[] 0 setdash
0.000 0.000 0.000 setrgbcolor AdjustColor
stroke
grestore
gsave
814.39887001468 249.1796610096 moveto
871.75480221868 249.1796610096 lineto
0 setlinecap
1 setlinejoin
1 setlinewidth
[] 0 setdash
0.000 0.000 0.000 setrgbcolor AdjustColor
stroke
grestore
gsave
grestore
gsave
grestore
gsave
grestore
gsave
grestore
gsave
grestore
gsave
grestore
gsave
grestore
gsave
grestore
gsave
345 496 moveto
345 496 lineto
0 setlinecap
1 setlinejoin
2 setlinewidth
[] 0 setdash
0.000 0.000 1.000 setrgbcolor AdjustColor
stroke
grestore
gsave
997 483 moveto
997 483 lineto
0 setlinecap
1 setlinejoin
2 setlinewidth
[] 0 setdash
0.000 0.000 1.000 setrgbcolor AdjustColor
stroke
grestore
gsave
217.89717509308 495.8101694868 moveto 177.8033898324 0 rlineto 0 -126.1830508488 rlineto -177.8033898324 0 rlineto closepath
0.984 0.961 0.682 setrgbcolor AdjustColor
fill
217.89717509308 495.8101694868 moveto 177.8033898324 0 rlineto 0 -126.1830508488 rlineto -177.8033898324 0 rlineto closepath
0 setlinejoin 2 setlinecap
1 setlinewidth
[] 0 setdash
0.000 0.000 0.000 setrgbcolor AdjustColor
stroke
grestore
gsave
217.89717509308 472.8677966052 moveto
395.70056492548 472.8677966052 lineto
0 setlinecap
1 setlinejoin
1 setlinewidth
[] 0 setdash
0.000 0.000 0.000 setrgbcolor AdjustColor
stroke
grestore
gsave
217.89717509308 392.5694915196 moveto
395.70056492548 392.5694915196 lineto
0 setlinecap
1 setlinejoin
1 setlinewidth
[] 0 setdash
0.000 0.000 0.000 setrgbcolor AdjustColor
stroke
grestore
gsave
grestore
gsave
/Helvetica-Bold findfont 8 scalefont ISOEncode setfont
0.000 0.000 0.000 setrgbcolor AdjustColor
306.79887001045 484.338983046 [
(JNukeHeapManagerActionEvent)
] 9 -0.5 0.5 0.5 false DrawText
grestore
gsave
grestore
gsave
grestore
gsave
/Helvetica findfont 8 scalefont ISOEncode setfont
0.000 0.000 0.000 setrgbcolor AdjustColor
220.44632763665 469.6813559272 [
(issuer: JNukeObj*)
(instance: JNukeJavaInstanceHeader*)
(offset: int)
(size: int)
(instanceDesc: JNukeObj*)
(class: JNukeObj* \050UCSString\051)
(field: JNukeObj* \050UCSString\051)
] 9 -0 0 0 false DrawText
grestore
gsave
grestore
gsave
grestore
gsave
217.89717509308 495.8101694868 moveto 177.8033898324 0 rlineto 0 -126.1830508488 rlineto -177.8033898324 0 rlineto closepath
0 setlinejoin 2 setlinecap
1 setlinewidth
[] 0 setdash
0.000 0.000 0.000 setrgbcolor AdjustColor
stroke
grestore
gsave
217.89717509308 358.1559321972 moveto
217.89717509308 329.4779660952 lineto
332.60903950108 329.4779660952 lineto
332.60903950108 345.4101694852 lineto
319.86327678908 358.1559321972 lineto
217.89717509308 358.1559321972 lineto
0.635 0.769 0.992 setrgbcolor AdjustColor
eofill
217.89717509308 358.1559321972 moveto
217.89717509308 329.4779660952 lineto
332.60903950108 329.4779660952 lineto
332.60903950108 345.4101694852 lineto
319.86327678908 358.1559321972 lineto
217.89717509308 358.1559321972 lineto
1 setlinejoin 1 setlinecap
1 setlinewidth
[] 0 setdash
0.000 0.000 0.000 setrgbcolor AdjustColor
stroke
grestore
gsave
319.86327678908 358.1559321972 moveto
319.86327678908 345.4101694852 lineto
332.60903950108 345.4101694852 lineto
319.86327678908 358.1559321972 lineto
0.635 0.769 0.992 setrgbcolor AdjustColor
eofill
319.86327678908 358.1559321972 moveto
319.86327678908 345.4101694852 lineto
332.60903950108 345.4101694852 lineto
319.86327678908 358.1559321972 lineto
1 setlinejoin 1 setlinecap
1 setlinewidth
[] 0 setdash
0.000 0.000 0.000 setrgbcolor AdjustColor
stroke
grestore
gsave
grestore
gsave
/Helvetica findfont 8 scalefont ISOEncode setfont
0.000 0.000 0.000 setrgbcolor AdjustColor
221.08361577225 354.9694915192 [
(class and field are NULL)
(for array instances)
] 9 -0 0 0 false DrawText
grestore
gsave
309.666666619481 358.1559321972 moveto
309.666666619481 369.627118638 lineto
0 setlinecap
1 setlinejoin
1 setlinewidth
[6 4] 0 setdash
0.000 0.000 0.000 setrgbcolor AdjustColor
stroke
grestore
gsave
286.72429373788 203.2949152464 moveto
286.72429373788 128.7322033812 lineto
516.14802255388 128.7322033812 lineto
0 setlinecap
1 setlinejoin
1 setlinewidth
[] 0 setdash
0.000 0.000 0.000 setrgbcolor AdjustColor
stroke
grestore
gsave
grestore
gsave
grestore
gsave
grestore
gsave
/Helvetica findfont 7 scalefont ISOEncode setfont
0.000 0.000 0.000 setrgbcolor AdjustColor
282.90056492545 194.372881348 [
(1)
] 7 -1 0.5 0.5 false DrawText
grestore
gsave
grestore
gsave
/Helvetica findfont 7 scalefont ISOEncode setfont
0.000 0.000 0.000 setrgbcolor AdjustColor
512.32429374145 119.8101694828 [
(1)
] 7 -1 0.5 0.5 false DrawText
grestore
gsave
grestore
gsave
/Helvetica findfont 7 scalefont ISOEncode setfont
0.000 0.000 0.000 setrgbcolor AdjustColor
512.32429374145 137.6542372796 [
(lock)
] 7 -1 0.5 0.5 false DrawText
grestore
gsave
217.89717509308 289.3288135524 moveto 177.8033898324 0 rlineto 0 -86.033898306 rlineto -177.8033898324 0 rlineto closepath
0.984 0.961 0.682 setrgbcolor AdjustColor
fill
217.89717509308 289.3288135524 moveto 177.8033898324 0 rlineto 0 -86.033898306 rlineto -177.8033898324 0 rlineto closepath
0 setlinejoin 2 setlinecap
1 setlinewidth
[] 0 setdash
0.000 0.000 0.000 setrgbcolor AdjustColor
stroke
grestore
gsave
217.89717509308 266.3864406708 moveto
395.70056492548 266.3864406708 lineto
0 setlinecap
1 setlinejoin
1 setlinewidth
[] 0 setdash
0.000 0.000 0.000 setrgbcolor AdjustColor
stroke
grestore
gsave
217.89717509308 226.237288128 moveto
395.70056492548 226.237288128 lineto
0 setlinecap
1 setlinejoin
1 setlinewidth
[] 0 setdash
0.000 0.000 0.000 setrgbcolor AdjustColor
stroke
grestore
gsave
grestore
gsave
/Helvetica-Bold findfont 8 scalefont ISOEncode setfont
0.000 0.000 0.000 setrgbcolor AdjustColor
306.79887001045 277.8576271116 [
(JNukeLockManagerActionEvent)
] 9 -0.5 0.5 0.5 false DrawText
grestore
gsave
grestore
gsave
grestore
gsave
/Helvetica findfont 8 scalefont ISOEncode setfont
0.000 0.000 0.000 setrgbcolor AdjustColor
220.44632763665 263.1999999928 [
(issuer: JNukeObj*)
(object: JNukeJavaInstanceHeader*)
(lock: JNukeObj*)
] 9 -0 0 0 false DrawText
grestore
gsave
grestore
gsave
grestore
gsave
217.89717509308 289.3288135524 moveto 177.8033898324 0 rlineto 0 -86.033898306 rlineto -177.8033898324 0 rlineto closepath
0 setlinejoin 2 setlinecap
1 setlinewidth
[] 0 setdash
0.000 0.000 0.000 setrgbcolor AdjustColor
stroke
grestore
gsave
286.72429373788 289.3288135524 moveto
286.72429373788 318.0067796544 lineto
584.97514119868 318.0067796544 lineto
584.97514119868 438.4542372828 lineto
0 setlinecap
1 setlinejoin
1 setlinewidth
[] 0 setdash
0.000 0.000 0.000 setrgbcolor AdjustColor
stroke
grestore
gsave
grestore
gsave
grestore
gsave
grestore
gsave
grestore
gsave
grestore
gsave
/Helvetica findfont 7 scalefont ISOEncode setfont
0.000 0.000 0.000 setrgbcolor AdjustColor
588.79887001345 429.5322033844 [
(issuer)
] 7 -0 0.5 0.5 false DrawText
grestore
gsave
grestore
gsave
grestore
gsave
395.70056492548 237.7084745688 moveto
539.09039543548 237.7084745688 lineto
0 setlinecap
1 setlinejoin
1 setlinewidth
[] 0 setdash
0.000 0.000 0.000 setrgbcolor AdjustColor
stroke
grestore
gsave
grestore
gsave
grestore
gsave
grestore
gsave
grestore
gsave
grestore
gsave
grestore
gsave
grestore
gsave
/Helvetica findfont 7 scalefont ISOEncode setfont
0.000 0.000 0.000 setrgbcolor AdjustColor
535.26666662305 246.6305084672 [
(object)
] 7 -1 0.5 0.5 false DrawText
grestore
gsave
607.91751408028 168.881355924 moveto
607.91751408028 197.559322026 lineto
0 setlinecap
1 setlinejoin
1 setlinewidth
[] 0 setdash
0.000 0.000 0.000 setrgbcolor AdjustColor
stroke
grestore
gsave
grestore
gsave
grestore
gsave
grestore
gsave
/Helvetica findfont 7 scalefont ISOEncode setfont
0.000 0.000 0.000 setrgbcolor AdjustColor
604.09378526785 177.8033898224 [
(0..1)
] 7 -1 0.5 0.5 false DrawText
grestore
gsave
grestore
gsave
grestore
gsave
grestore
gsave
/Helvetica findfont 7 scalefont ISOEncode setfont
0.000 0.000 0.000 setrgbcolor AdjustColor
604.09378526785 188.6372881276 [
(1)
] 7 -1 0.5 0.5 false DrawText
grestore
gsave
619.38870052108 358.1559321972 moveto
619.38870052108 318.0067796544 lineto
757.042937810681 318.0067796544 lineto
757.042937810681 345.4101694852 lineto
744.29717509868 358.1559321972 lineto
619.38870052108 358.1559321972 lineto
0.635 0.769 0.992 setrgbcolor AdjustColor
eofill
619.38870052108 358.1559321972 moveto
619.38870052108 318.0067796544 lineto
757.042937810681 318.0067796544 lineto
757.042937810681 345.4101694852 lineto
744.29717509868 358.1559321972 lineto
619.38870052108 358.1559321972 lineto
1 setlinejoin 1 setlinecap
1 setlinewidth
[] 0 setdash
0.000 0.000 0.000 setrgbcolor AdjustColor
stroke
grestore
gsave
744.29717509868 358.1559321972 moveto
744.29717509868 345.4101694852 lineto
757.042937810681 345.4101694852 lineto
744.29717509868 358.1559321972 lineto
0.635 0.769 0.992 setrgbcolor AdjustColor
eofill
744.29717509868 358.1559321972 moveto
744.29717509868 345.4101694852 lineto
757.042937810681 345.4101694852 lineto
744.29717509868 358.1559321972 lineto
1 setlinejoin 1 setlinecap
1 setlinewidth
[] 0 setdash
0.000 0.000 0.000 setrgbcolor AdjustColor
stroke
grestore
gsave
grestore
gsave
/Helvetica findfont 8 scalefont ISOEncode setfont
0.000 0.000 0.000 setrgbcolor AdjustColor
622.57514120025 354.9694915192 [
(instanceDesc either points to )
(a JNukeInstanceDesc or a)
(JNukeArrayInstanceDesc)
] 9 -0 0 0 false DrawText
grestore
gsave
636.59548018228 318.0067796544 moveto
636.59548018228 300.7999999932 lineto
607.91751408028 300.7999999932 lineto
607.91751408028 295.0644067728 lineto
0 setlinecap
1 setlinejoin
1 setlinewidth
[6 4] 0 setdash
0.000 0.000 0.000 setrgbcolor AdjustColor
stroke
grestore
gsave
395.70056492548 432.7186440624 moveto
453.05649712948 432.7186440624 lineto
453.05649712948 283.593220332 lineto
539.09039543548 283.593220332 lineto
0 setlinecap
1 setlinejoin
1 setlinewidth
[] 0 setdash
0.000 0.000 0.000 setrgbcolor AdjustColor
stroke
grestore
gsave
grestore
gsave
grestore
gsave
grestore
gsave
grestore
gsave
grestore
gsave
grestore
gsave
grestore
gsave
/Helvetica findfont 7 scalefont ISOEncode setfont
0.000 0.000 0.000 setrgbcolor AdjustColor
535.26666662305 292.5152542304 [
(instance)
] 7 -1 0.5 0.5 false DrawText
grestore
gsave
217.89717509308 587.5796610132 moveto 177.8033898324 0 rlineto 0 -68.8271186448001 rlineto -177.8033898324 0 rlineto closepath
0.984 0.961 0.682 setrgbcolor AdjustColor
fill
217.89717509308 587.5796610132 moveto 177.8033898324 0 rlineto 0 -68.8271186448001 rlineto -177.8033898324 0 rlineto closepath
0 setlinejoin 2 setlinecap
1 setlinewidth
[] 0 setdash
0.000 0.000 0.000 setrgbcolor AdjustColor
stroke
grestore
gsave
217.89717509308 564.6372881316 moveto
395.70056492548 564.6372881316 lineto
0 setlinecap
1 setlinejoin
1 setlinewidth
[] 0 setdash
0.000 0.000 0.000 setrgbcolor AdjustColor
stroke
grestore
gsave
217.89717509308 541.69491525 moveto
395.70056492548 541.69491525 lineto
0 setlinecap
1 setlinejoin
1 setlinewidth
[] 0 setdash
0.000 0.000 0.000 setrgbcolor AdjustColor
stroke
grestore
gsave
grestore
gsave
/Helvetica-Bold findfont 8 scalefont ISOEncode setfont
0.000 0.000 0.000 setrgbcolor AdjustColor
306.79887001045 576.1084745724 [
(JNukeThreadStateChangedEvent)
] 9 -0.5 0.5 0.5 false DrawText
grestore
gsave
grestore
gsave
grestore
gsave
/Helvetica findfont 8 scalefont ISOEncode setfont
0.000 0.000 0.000 setrgbcolor AdjustColor
220.44632763665 561.4508474536 [
(issuer: JNukeObj*)
] 9 -0 0 0 false DrawText
grestore
gsave
grestore
gsave
grestore
gsave
217.89717509308 587.5796610132 moveto 177.8033898324 0 rlineto 0 -68.8271186448001 rlineto -177.8033898324 0 rlineto closepath
0 setlinejoin 2 setlinecap
1 setlinewidth
[] 0 setdash
0.000 0.000 0.000 setrgbcolor AdjustColor
stroke
grestore
gsave
395.70056492548 553.1661016908 moveto
453.05649712948 553.1661016908 lineto
453.05649712948 501.5457627072 lineto
510.41242933348 501.5457627072 lineto
0 setlinecap
1 setlinejoin
1 setlinewidth
[] 0 setdash
0.000 0.000 0.000 setrgbcolor AdjustColor
stroke
grestore
gsave
grestore
gsave
grestore
gsave
grestore
gsave
grestore
gsave
grestore
gsave
grestore
gsave
grestore
gsave
/Helvetica findfont 7 scalefont ISOEncode setfont
0.000 0.000 0.000 setrgbcolor AdjustColor
506.58870052105 510.4677966056 [
(issuer)
] 7 -1 0.5 0.5 false DrawText
grestore
gsave
395.70056492548 467.1322033848 moveto
510.41242933348 467.1322033848 lineto
0 setlinecap
1 setlinejoin
1 setlinewidth
[] 0 setdash
0.000 0.000 0.000 setrgbcolor AdjustColor
stroke
grestore
gsave
grestore
gsave
grestore
gsave
grestore
gsave
grestore
gsave
grestore
gsave
grestore
gsave
grestore
gsave
/Helvetica findfont 7 scalefont ISOEncode setfont
0.000 0.000 0.000 setrgbcolor AdjustColor
506.58870052105 476.0542372832 [
(issuer)
] 7 -1 0.5 0.5 false DrawText
grestore
gsave
217.89717509308 685.08474576 moveto 177.8033898324 0 rlineto 0 -74.5627118652 rlineto -177.8033898324 0 rlineto closepath
0.984 0.961 0.682 setrgbcolor AdjustColor
fill
217.89717509308 685.08474576 moveto 177.8033898324 0 rlineto 0 -74.5627118652 rlineto -177.8033898324 0 rlineto closepath
0 setlinejoin 2 setlinecap
1 setlinewidth
[] 0 setdash
0.000 0.000 0.000 setrgbcolor AdjustColor
stroke
grestore
gsave
217.89717509308 662.1423728784 moveto
395.70056492548 662.1423728784 lineto
0 setlinecap
1 setlinejoin
1 setlinewidth
[] 0 setdash
0.000 0.000 0.000 setrgbcolor AdjustColor
stroke
grestore
gsave
217.89717509308 633.4644067764 moveto
395.70056492548 633.4644067764 lineto
0 setlinecap
1 setlinejoin
1 setlinewidth
[] 0 setdash
0.000 0.000 0.000 setrgbcolor AdjustColor
stroke
grestore
gsave
grestore
gsave
/Helvetica-Bold findfont 8 scalefont ISOEncode setfont
0.000 0.000 0.000 setrgbcolor AdjustColor
306.79887001045 673.6135593192 [
(JNukeExecutionEvent)
] 9 -0.5 0.5 0.5 false DrawText
grestore
gsave
grestore
gsave
grestore
gsave
/Helvetica findfont 8 scalefont ISOEncode setfont
0.000 0.000 0.000 setrgbcolor AdjustColor
220.44632763665 658.9559322004 [
(issuer: JNukeObj*)
(xbc: JNukeXByteCode*)
] 9 -0 0 0 false DrawText
grestore
gsave
grestore
gsave
grestore
gsave
217.89717509308 685.08474576 moveto 177.8033898324 0 rlineto 0 -74.5627118652 rlineto -177.8033898324 0 rlineto closepath
0 setlinejoin 2 setlinecap
1 setlinewidth
[] 0 setdash
0.000 0.000 0.000 setrgbcolor AdjustColor
stroke
grestore
gsave
395.70056492548 644.9355932172 moveto
453.05649712948 644.9355932172 lineto
453.05649712948 570.372881352 lineto
544.82598865588 570.372881352 lineto
544.82598865588 535.9593220296 lineto
0 setlinecap
1 setlinejoin
1 setlinewidth
[] 0 setdash
0.000 0.000 0.000 setrgbcolor AdjustColor
stroke
grestore
gsave
grestore
gsave
grestore
gsave
grestore
gsave
grestore
gsave
grestore
gsave
/Helvetica findfont 7 scalefont ISOEncode setfont
0.000 0.000 0.000 setrgbcolor AdjustColor
548.64971747065 544.881355928 [
(issuer)
] 7 -0 0.5 0.5 false DrawText
grestore
gsave
grestore
gsave
grestore
gsave
510.41242933348 662.1423728784 moveto 453.1118644116 0 rlineto 0 -74.5627118652 rlineto -453.1118644116 0 rlineto closepath
0.984 0.961 0.682 setrgbcolor AdjustColor
fill
510.41242933348 662.1423728784 moveto 453.1118644116 0 rlineto 0 -74.5627118652 rlineto -453.1118644116 0 rlineto closepath
0 setlinejoin 2 setlinecap
1 setlinewidth
[] 0 setdash
0.000 0.000 0.000 setrgbcolor AdjustColor
stroke
grestore
gsave
510.41242933348 639.1999999968 moveto
963.524293745081 639.1999999968 lineto
0 setlinecap
1 setlinejoin
1 setlinewidth
[] 0 setdash
0.000 0.000 0.000 setrgbcolor AdjustColor
stroke
grestore
gsave
510.41242933348 616.2576271152 moveto
963.524293745081 616.2576271152 lineto
0 setlinecap
1 setlinejoin
1 setlinewidth
[] 0 setdash
0.000 0.000 0.000 setrgbcolor AdjustColor
stroke
grestore
gsave
grestore
gsave
/Helvetica-Bold findfont 8 scalefont ISOEncode setfont
0.000 0.000 0.000 setrgbcolor AdjustColor
736.96836154045 650.6711864376 [
(JNukeHeapManager)
] 9 -0.5 0.5 0.5 false DrawText
grestore
gsave
grestore
gsave
grestore
gsave
grestore
gsave
grestore
gsave
/Helvetica findfont 8 scalefont ISOEncode setfont
0.000 0.000 0.000 setrgbcolor AdjustColor
512.96158187705 613.0711864372 [
(setReadAccessListener\050JNukeObj *listenerObj, JNukeHeapManagerActionListener \050l\051\051)
(setWriteAccessListener\050JNukeObj *listenerObj, JNukeHeapManagerActionListener \050l\051\051)
] 9 -0 0 0 false DrawText
grestore
gsave
510.41242933348 662.1423728784 moveto 453.1118644116 0 rlineto 0 -74.5627118652 rlineto -453.1118644116 0 rlineto closepath
0 setlinejoin 2 setlinecap
1 setlinewidth
[] 0 setdash
0.000 0.000 0.000 setrgbcolor AdjustColor
stroke
grestore
gsave
510.41242933348 776.8542372864 moveto 453.1118644116 0 rlineto 0 -86.033898306 rlineto -453.1118644116 0 rlineto closepath
0.984 0.961 0.682 setrgbcolor AdjustColor
fill
510.41242933348 776.8542372864 moveto 453.1118644116 0 rlineto 0 -86.033898306 rlineto -453.1118644116 0 rlineto closepath
0 setlinejoin 2 setlinecap
1 setlinewidth
[] 0 setdash
0.000 0.000 0.000 setrgbcolor AdjustColor
stroke
grestore
gsave
510.41242933348 753.9118644048 moveto
963.524293745081 753.9118644048 lineto
0 setlinecap
1 setlinejoin
1 setlinewidth
[] 0 setdash
0.000 0.000 0.000 setrgbcolor AdjustColor
stroke
grestore
gsave
510.41242933348 730.9694915232 moveto
963.524293745081 730.9694915232 lineto
0 setlinecap
1 setlinejoin
1 setlinewidth
[] 0 setdash
0.000 0.000 0.000 setrgbcolor AdjustColor
stroke
grestore
gsave
grestore
gsave
/Helvetica-Bold findfont 8 scalefont ISOEncode setfont
0.000 0.000 0.000 setrgbcolor AdjustColor
736.96836154045 765.3830508456 [
(JNukeLockManager)
] 9 -0.5 0.5 0.5 false DrawText
grestore
gsave
grestore
gsave
grestore
gsave
grestore
gsave
grestore
gsave
/Helvetica findfont 8 scalefont ISOEncode setfont
0.000 0.000 0.000 setrgbcolor AdjustColor
512.96158187705 727.7830508452 [
(setOnLockReleasedListener\050JNukeObj *listenerObj, JNukeLockManagerActionListener \050l\051\051)
(setOnLockAcquirementFailedListener\050JNukeObj *listenerObj, JNukeLockManagerActionListener \050l\051\051)
(setOnLockAcquirementSucceedListener\050JNukeObj *listenerObj, JNukeLockManagerActionListener \050l\051\051)
] 9 -0 0 0 false DrawText
grestore
gsave
510.41242933348 776.8542372864 moveto 453.1118644116 0 rlineto 0 -86.033898306 rlineto -453.1118644116 0 rlineto closepath
0 setlinejoin 2 setlinecap
1 setlinewidth
[] 0 setdash
0.000 0.000 0.000 setrgbcolor AdjustColor
stroke
grestore
gsave
877 323 moveto
877 323 lineto
0 setlinecap
1 setlinejoin
2 setlinewidth
[] 0 setdash
0.000 0.000 1.000 setrgbcolor AdjustColor
stroke
grestore
gsave
877 288 moveto
877 288 lineto
0 setlinecap
1 setlinejoin
2 setlinewidth
[] 0 setdash
0.000 0.000 1.000 setrgbcolor AdjustColor
stroke
grestore
gsave
963.524293745081 507.2813559276 moveto
1003.67344628788 507.2813559276 lineto
1003.67344628788 627.728813556 lineto
963.524293745081 627.728813556 lineto
0 setlinecap
1 setlinejoin
1 setlinewidth
[] 0 setdash
0.000 0.000 0.000 setrgbcolor AdjustColor
stroke
grestore
gsave
grestore
gsave
grestore
gsave
grestore
gsave
grestore
gsave
grestore
gsave
grestore
gsave
grestore
gsave
grestore
gsave
971.87686780483 513.12989125051 moveto
980.22944186458 507.2813559276 lineto
971.87686780483 501.43282060469 lineto
963.524293745081 507.2813559276 lineto
971.87686780483 513.12989125051 lineto
0.000 0.000 0.000 setrgbcolor AdjustColor
eofill
971.87686780483 513.12989125051 moveto
980.22944186458 507.2813559276 lineto
971.87686780483 501.43282060469 lineto
963.524293745081 507.2813559276 lineto
971.87686780483 513.12989125051 lineto
1 setlinejoin 1 setlinecap
1 setlinewidth
[] 0 setdash
0.000 0.000 0.000 setrgbcolor AdjustColor
stroke
grestore
gsave
963.524293745081 507.2813559276 moveto
1003.67344628788 507.2813559276 lineto
1003.67344628788 736.7050847436 lineto
963.524293745081 736.7050847436 lineto
0 setlinecap
1 setlinejoin
1 setlinewidth
[] 0 setdash
0.000 0.000 0.000 setrgbcolor AdjustColor
stroke
grestore
gsave
grestore
gsave
grestore
gsave
grestore
gsave
grestore
gsave
grestore
gsave
grestore
gsave
grestore
gsave
grestore
gsave
971.87686780483 513.12989125051 moveto
980.22944186458 507.2813559276 lineto
971.87686780483 501.43282060469 lineto
963.524293745081 507.2813559276 lineto
971.87686780483 513.12989125051 lineto
0.000 0.000 0.000 setrgbcolor AdjustColor
eofill
971.87686780483 513.12989125051 moveto
980.22944186458 507.2813559276 lineto
971.87686780483 501.43282060469 lineto
963.524293745081 507.2813559276 lineto
971.87686780483 513.12989125051 lineto
1 setlinejoin 1 setlinecap
1 setlinewidth
[] 0 setdash
0.000 0.000 0.000 setrgbcolor AdjustColor
stroke
grestore
restore showpage

%%Trailer
end
%%EOF
