#FIG 3.2
Landscape
Center
Metric
A4      
100.00
Single
-2
1200 2
6 3870 2925 4455 3510
1 3 0 2 4 7 50 0 20 0.000 1 0.0000 4005 3375 101 101 4005 3375 4050 3465
4 0 4 50 0 18 24 0.0000 4 285 345 4095 3240 P'\001
-6
6 2835 3105 5445 5490
2 1 0 2 0 7 80 0 -1 0.000 0 0 -1 1 0 2
	1 1 2.00 180.00 240.00
	 2925 5400 5400 5400
2 1 0 2 0 7 80 0 -1 0.000 0 0 -1 1 0 2
	1 1 2.00 180.00 240.00
	 2925 5400 2925 3150
4 0 0 80 0 18 24 0.0000 4 285 225 3195 3375 y\001
4 0 0 80 0 18 24 0.0000 4 210 195 5130 5130 x\001
-6
6 2790 4950 3375 5535
1 3 0 2 1 7 50 0 20 0.000 1 0.0000 2925 5400 101 101 2925 5400 2970 5490
4 0 1 50 0 18 24 0.0000 4 285 255 3015 5265 P\001
4 0 1 50 0 18 18 0.0000 4 195 150 3195 5400 0\001
-6
6 4815 3870 5310 4455
1 3 0 2 0 4 50 0 20 0.000 1 0.0000 4950 4320 101 101 4950 4320 4995 4410
4 0 0 50 0 18 24 0.0000 4 285 255 5040 4185 P\001
-6
4 0 0 50 0 14 24 0.0000 4 240 900 4815 3420 swap\001
4 0 0 50 0 14 24 0.0000 4 225 1125 3240 4860 reset\001
