%!PS-Adobe-2.0 EPSF-2.0
%%Title: exitblock-mp.dia
%%Creator: Dia v0.90
%%CreationDate: Tue Mar 11 23:03:35 2003
%%For: pascal
%%Magnification: 1.0000
%%Orientation: Portrait
%%BoundingBox: 0 0 781 941
%%Pages: 1
%%EndComments
%%BeginProlog
/cp {closepath} bind def
/c {curveto} bind def
/f {fill} bind def
/a {arc} bind def
/ef {eofill} bind def
/ex {exch} bind def
/gr {grestore} bind def
/gs {gsave} bind def
/sa {save} bind def
/rs {restore} bind def
/l {lineto} bind def
/m {moveto} bind def
/rm {rmoveto} bind def
/n {newpath} bind def
/s {stroke} bind def
/sh {show} bind def
/slc {setlinecap} bind def
/slj {setlinejoin} bind def
/slw {setlinewidth} bind def
/srgb {setrgbcolor} bind def
/rot {rotate} bind def
/sc {scale} bind def
/sd {setdash} bind def
/ff {findfont} bind def
/sf {setfont} bind def
/scf {scalefont} bind def
/sw {stringwidth pop} bind def
/tr {translate} bind def

/ellipsedict 8 dict def
ellipsedict /mtrx matrix put
/ellipse
{ ellipsedict begin
   /endangle exch def
   /startangle exch def
   /yrad exch def
   /xrad exch def
   /y exch def
   /x exch def   /savematrix mtrx currentmatrix def
   x y tr xrad yrad sc
   0 0 1 startangle endangle arc
   savematrix setmatrix
   end
} def

/mergeprocs {
dup length
3 -1 roll
dup
length
dup
5 1 roll
3 -1 roll
add
array cvx
dup
3 -1 roll
0 exch
putinterval
dup
4 2 roll
putinterval
} bind def
%%EndProlog

%%BeginSetup
%%EndSetup
28.346000 -28.346000 scale
8.800000 -27.800000 translate

0.551097 0.457807 0.901515 srgb
n 0.000000 9.550000 m 0.000000 18.150000 l 4.400000 18.150000 l 4.400000 9.550000 l f
0.100000 slw
[] 0 sd
[] 0 sd
0 slj
0.000000 0.000000 0.000000 srgb
n 0.000000 9.550000 m 0.000000 18.150000 l 4.400000 18.150000 l 4.400000 9.550000 l cp s
0.649330 0.650584 1.000000 srgb
n 6.000000 4.350000 m 6.000000 27.750000 l 18.700000 27.750000 l 18.700000 4.350000 l f
0.100000 slw
[] 0 sd
[] 0 sd
0 slj
0.000000 0.000000 0.000000 srgb
n 6.000000 4.350000 m 6.000000 27.750000 l 18.700000 27.750000 l 18.700000 4.350000 l cp s
0.333333 0.690196 0.968627 srgb
n -8.750000 -0.550000 m -8.750000 27.650000 l -1.050000 27.650000 l -1.050000 -0.550000 l f
0.100000 slw
[] 0 sd
[] 0 sd
0 slj
0.000000 0.000000 0.000000 srgb
n -8.750000 -0.550000 m -8.750000 27.650000 l -1.050000 27.650000 l -1.050000 -0.550000 l cp s
1.000000 1.000000 1.000000 srgb
n -7.250000 0.750000 m -7.250000 2.650000 l -3.043600 2.650000 l -3.043600 0.750000 l f
0.100000 slw
[] 0 sd
[] 0 sd
0 slj
0.000000 0.000000 0.000000 srgb
n -7.250000 0.750000 m -7.250000 2.650000 l -3.043600 2.650000 l -3.043600 0.750000 l cp s
 [ /xi /xi /xi /xi /xi /xi /xi /xi /xi /xi /xi /xi /xi /xi /xi /xi
 /xi /xi /xi /xi /xi /xi /xi /xi /xi /xi /xi /xi /xi /xi /xi /xi
 /T /zero /comma /space /one /braceleft /two /braceright /xi /xi /three /four /five /six /seven /eight
 /nine /parenleft /parenright /P /r /o /c /e /s /xi /xi /xi /xi /xi /xi /xi
 /xi /xi /xi /xi /xi /xi /xi /xi /xi /xi /xi /xi /xi /xi /xi /xi
 /xi /xi /xi /xi /xi /xi /xi /xi /xi /xi /xi /xi /xi /xi /xi /xi
 /xi /xi /xi /xi /xi /xi /xi /xi /xi /xi /xi /xi /xi /xi /xi /xi
 /xi /xi /xi /xi /xi /xi /xi /xi /xi /xi /xi /xi /xi /xi /xi /xi
 /xi /xi /xi /xi /xi /xi /xi /xi /xi /xi /xi /xi /xi /xi /xi /xi
 /xi /xi /xi /xi /xi /xi /xi /xi /xi /xi /xi /xi /xi /xi /xi /xi
 /xi /xi /xi /xi /xi /xi /xi /xi /xi /xi /xi /xi /xi /xi /xi /xi
 /xi /xi /xi /xi /xi /xi /xi /xi /xi /xi /xi /xi /xi /xi /xi /xi
 /xi /xi /xi /xi /xi /xi /xi /xi /xi /xi /xi /xi /xi /xi /xi /xi
 /xi /xi /xi /xi /xi /xi /xi /xi /xi /xi /xi /xi /xi /xi /xi /xi
 /xi /xi /xi /xi /xi /xi /xi /xi /xi /xi /xi /xi /xi /xi /xi /xi
 /xi /xi /xi /xi /xi /xi /xi /xi /xi /xi /xi /xi /xi /xi /xi /xi
] /e0 exch def
/Courier_e0 undefinefont
/Courier_e0
  /Courier findfont
  dup length dict begin
  {1 index /FID ne {def} {pop pop} ifelse} forall
  /Encoding e0 def
  currentdict end
definefont pop
/Courier_e0 ff 0.800000 scf sf
( !"# $) sw
2 div -5.146800 ex sub 1.896491 m ( !"# $)
 gs 1 -1 sc sh gr
1.000000 1.000000 1.000000 srgb
n -7.250000 5.500000 m -7.250000 7.400000 l -3.043600 7.400000 l -3.043600 5.500000 l f
0.100000 slw
[] 0 sd
[] 0 sd
0 slj
0.000000 0.000000 0.000000 srgb
n -7.250000 5.500000 m -7.250000 7.400000 l -3.043600 7.400000 l -3.043600 5.500000 l cp s
/Courier_e0 ff 0.800000 scf sf
( !"# $) sw
2 div -5.146800 ex sub 6.646491 m ( !"# $)
 gs 1 -1 sc sh gr
0.100000 slw
[] 0 sd
[0.400000] 0 sd
0 slc
n -5.146800 2.650000 m -5.146800 5.500000 l s
0.100000 slw
[] 0 sd
0 slj
0 slc
n -5.396800 4.700000 m -5.146800 5.500000 l -4.896800 4.700000 l s
-5.146800 4.075000 m /Courier_e0 ff 0.800000 scf sf
(%$"&')
 gs 1 -1 sc sh gr
1.000000 1.000000 1.000000 srgb
n -7.250000 10.200000 m -7.250000 12.100000 l -3.043600 12.100000 l -3.043600 10.200000 l f
0.100000 slw
[] 0 sd
[] 0 sd
0 slj
0.000000 0.000000 0.000000 srgb
n -7.250000 10.200000 m -7.250000 12.100000 l -3.043600 12.100000 l -3.043600 10.200000 l cp s
/Courier_e0 ff 0.800000 scf sf
( !"# $) sw
2 div -5.146800 ex sub 11.346491 m ( !"# $)
 gs 1 -1 sc sh gr
0.100000 slw
[] 0 sd
[0.400000] 0 sd
0 slc
n -5.146800 7.400000 m -5.146800 10.200000 l s
0.100000 slw
[] 0 sd
0 slj
0 slc
n -5.396800 9.400000 m -5.146800 10.200000 l -4.896800 9.400000 l s
-5.146800 8.800000 m /Courier_e0 ff 0.800000 scf sf
(%*"+",')
 gs 1 -1 sc sh gr
0.100000 slw
[] 0 sd
[0.400000] 0 sd
0 slc
n -5.146800 12.100000 m -5.146800 14.930000 l s
0.100000 slw
[] 0 sd
0 slj
0 slc
n -5.396800 14.130000 m -5.146800 14.930000 l -4.896800 14.130000 l s
-5.146800 13.515000 m /Courier_e0 ff 0.800000 scf sf
(%-')
 gs 1 -1 sc sh gr
1.000000 1.000000 1.000000 srgb
n -6.176400 14.930000 m -6.176400 16.830000 l -4.117200 16.830000 l -4.117200 14.930000 l f
0.100000 slw
[] 0 sd
[] 0 sd
0 slj
0.000000 0.000000 0.000000 srgb
n -6.176400 14.930000 m -6.176400 16.830000 l -4.117200 16.830000 l -4.117200 14.930000 l cp s
/Courier_e0 ff 0.800000 scf sf
( $) sw
2 div -5.146800 ex sub 16.076491 m ( $)
 gs 1 -1 sc sh gr
1.000000 1.000000 1.000000 srgb
n -6.176400 19.730000 m -6.176400 21.630000 l -4.117200 21.630000 l -4.117200 19.730000 l f
0.100000 slw
[] 0 sd
[] 0 sd
0 slj
0.000000 0.000000 0.000000 srgb
n -6.176400 19.730000 m -6.176400 21.630000 l -4.117200 21.630000 l -4.117200 19.730000 l cp s
/Courier_e0 ff 0.800000 scf sf
( $) sw
2 div -5.146800 ex sub 20.876491 m ( $)
 gs 1 -1 sc sh gr
0.100000 slw
[] 0 sd
[0.400000] 0 sd
0 slc
n -5.146800 16.830000 m -5.146800 19.730000 l s
0.100000 slw
[] 0 sd
0 slj
0 slc
n -5.396800 18.930000 m -5.146800 19.730000 l -4.896800 18.930000 l s
-5.146800 18.280000 m /Courier_e0 ff 0.800000 scf sf
(%."/"0')
 gs 1 -1 sc sh gr
1.000000 1.000000 1.000000 srgb
n -5.978400 24.430000 m -5.978400 26.330000 l -4.315200 26.330000 l -4.315200 24.430000 l f
0.100000 slw
[] 0 sd
[] 0 sd
0 slj
0.000000 0.000000 0.000000 srgb
n -5.978400 24.430000 m -5.978400 26.330000 l -4.315200 26.330000 l -4.315200 24.430000 l cp s
/Courier_e0 ff 0.800000 scf sf
(12) sw
2 div -5.146800 ex sub 25.576491 m (12)
 gs 1 -1 sc sh gr
0.100000 slw
[] 0 sd
[0.400000] 0 sd
0 slc
n -5.146800 21.630000 m -5.146800 24.430000 l s
0.100000 slw
[] 0 sd
0 slj
0 slc
n -5.396800 23.630000 m -5.146800 24.430000 l -4.896800 23.630000 l s
-5.146800 23.030000 m /Courier_e0 ff 0.800000 scf sf
(%$!')
 gs 1 -1 sc sh gr
1.000000 1.000000 1.000000 srgb
n 8.010000 5.530000 m 8.010000 7.430000 l 10.069200 7.430000 l 10.069200 5.530000 l f
0.100000 slw
[] 0 sd
[] 0 sd
0 slj
0.000000 0.000000 0.000000 srgb
n 8.010000 5.530000 m 8.010000 7.430000 l 10.069200 7.430000 l 10.069200 5.530000 l cp s
/Courier_e0 ff 0.800000 scf sf
( $) sw
2 div 9.039600 ex sub 6.676491 m ( $)
 gs 1 -1 sc sh gr
1.000000 1.000000 1.000000 srgb
n 6.949600 10.330000 m 6.949600 12.230000 l 11.129600 12.230000 l 11.129600 10.330000 l f
0.100000 slw
[] 0 sd
[] 0 sd
0 slj
0.000000 0.000000 0.000000 srgb
n 6.949600 10.330000 m 6.949600 12.230000 l 11.129600 12.230000 l 11.129600 10.330000 l cp s
/Courier_e0 ff 0.800000 scf sf
( $"# !) sw
2 div 9.039600 ex sub 11.476491 m ( $"# !)
 gs 1 -1 sc sh gr
0.100000 slw
[] 0 sd
[0.400000] 0 sd
0 slc
n 9.039600 7.430000 m 9.039600 10.330000 l s
0.100000 slw
[] 0 sd
0 slj
0 slc
n 8.789600 9.530000 m 9.039600 10.330000 l 9.289600 9.530000 l s
9.039600 8.880000 m /Courier_e0 ff 0.800000 scf sf
(%."/"0')
 gs 1 -1 sc sh gr
0.100000 slw
[] 0 sd
[0.400000] 0 sd
0 slc
n 9.039600 12.230000 m 9.039600 15.130000 l s
0.100000 slw
[] 0 sd
0 slj
0 slc
n 8.789600 14.330000 m 9.039600 15.130000 l 9.289600 14.330000 l s
9.039600 13.680000 m /Courier_e0 ff 0.800000 scf sf
(%$!')
 gs 1 -1 sc sh gr
0.100000 slw
[] 0 sd
[] 0 sd
0 slj
0 slc
n -3.043600 6.450000 m -3.043600 6.550000 l 8.010000 6.550000 l 8.010000 6.480000 l s
1.000000 1.000000 1.000000 srgb
n 8.023200 15.130000 m 8.023200 17.030000 l 10.056000 17.030000 l 10.056000 15.130000 l f
0.100000 slw
[] 0 sd
[] 0 sd
0 slj
0.000000 0.000000 0.000000 srgb
n 8.023200 15.130000 m 8.023200 17.030000 l 10.056000 17.030000 l 10.056000 15.130000 l cp s
/Courier_e0 ff 0.800000 scf sf
( !) sw
2 div 9.039600 ex sub 16.276491 m ( !)
 gs 1 -1 sc sh gr
1.000000 1.000000 1.000000 srgb
n 8.023200 19.830000 m 8.023200 21.730000 l 10.056000 21.730000 l 10.056000 19.830000 l f
0.100000 slw
[] 0 sd
[] 0 sd
0 slj
0.000000 0.000000 0.000000 srgb
n 8.023200 19.830000 m 8.023200 21.730000 l 10.056000 21.730000 l 10.056000 19.830000 l cp s
/Courier_e0 ff 0.800000 scf sf
( !) sw
2 div 9.039600 ex sub 20.976491 m ( !)
 gs 1 -1 sc sh gr
0.100000 slw
[] 0 sd
[0.400000] 0 sd
0 slc
n 9.039600 17.030000 m 9.039600 19.830000 l s
0.100000 slw
[] 0 sd
0 slj
0 slc
n 8.789600 19.030000 m 9.039600 19.830000 l 9.289600 19.030000 l s
9.039600 18.430000 m /Courier_e0 ff 0.800000 scf sf
(%*"+",')
 gs 1 -1 sc sh gr
0.100000 slw
[] 0 sd
[0.400000] 0 sd
0 slc
n 9.039600 21.730000 m 9.039600 24.630000 l s
0.100000 slw
[] 0 sd
0 slj
0 slc
n 8.789600 23.830000 m 9.039600 24.630000 l 9.289600 23.830000 l s
9.039600 23.180000 m /Courier_e0 ff 0.800000 scf sf
(%-')
 gs 1 -1 sc sh gr
1.000000 1.000000 1.000000 srgb
n 8.208000 24.630000 m 8.208000 26.530000 l 9.871200 26.530000 l 9.871200 24.630000 l f
0.100000 slw
[] 0 sd
[] 0 sd
0 slj
0.000000 0.000000 0.000000 srgb
n 8.208000 24.630000 m 8.208000 26.530000 l 9.871200 26.530000 l 9.871200 24.630000 l cp s
/Courier_e0 ff 0.800000 scf sf
(12) sw
2 div 9.039600 ex sub 25.776491 m (12)
 gs 1 -1 sc sh gr
1.000000 1.000000 1.000000 srgb
n 1.064000 10.200000 m 1.064000 12.100000 l 3.123200 12.100000 l 3.123200 10.200000 l f
0.100000 slw
[] 0 sd
[] 0 sd
0 slj
0.000000 0.000000 0.000000 srgb
n 1.064000 10.200000 m 1.064000 12.100000 l 3.123200 12.100000 l 3.123200 10.200000 l cp s
/Courier_e0 ff 0.800000 scf sf
( $) sw
2 div 2.093600 ex sub 11.346491 m ( $)
 gs 1 -1 sc sh gr
0.100000 slw
[] 0 sd
[] 0 sd
0 slj
0 slc
n -3.043600 11.150000 m -3.043600 11.230000 l 1.064000 11.230000 l 1.064000 11.150000 l s
0.756863 0.756863 0.756863 srgb
n 2.093604 14.992899 m 3.300710 16.200005 l 2.093604 17.407111 l 0.886498 16.200005 l f
0.100000 slw
[] 0 sd
[] 0 sd
0 slj
0.000000 0.000000 0.000000 srgb
n 2.093604 14.992899 m 3.300710 16.200005 l 2.093604 17.407111 l 0.886498 16.200005 l cp s
0.100000 slw
[] 0 sd
[0.400000] 0 sd
0 slc
n 2.093600 12.100000 m 2.093600 14.992900 l s
0.100000 slw
[] 0 sd
0 slj
0 slc
n 1.843600 14.192900 m 2.093600 14.992900 l 2.343600 14.192900 l s
2.093600 13.546400 m /Courier_e0 ff 0.800000 scf sf
(%.')
 gs 1 -1 sc sh gr
1.000000 1.000000 1.000000 srgb
n 15.430800 10.330000 m 15.430800 12.230000 l 17.463600 12.230000 l 17.463600 10.330000 l f
0.100000 slw
[] 0 sd
[] 0 sd
0 slj
0.000000 0.000000 0.000000 srgb
n 15.430800 10.330000 m 15.430800 12.230000 l 17.463600 12.230000 l 17.463600 10.330000 l cp s
/Courier_e0 ff 0.800000 scf sf
( !) sw
2 div 16.447200 ex sub 11.476491 m ( !)
 gs 1 -1 sc sh gr
0.100000 slw
[] 0 sd
[] 0 sd
0 slj
0 slc
n 11.129600 11.280000 m 11.129600 11.360000 l 15.430800 11.360000 l 15.430800 11.280000 l s
0.756863 0.756863 0.756863 srgb
n 16.447205 15.122899 m 17.654311 16.330005 l 16.447205 17.537111 l 15.240099 16.330005 l f
0.100000 slw
[] 0 sd
[] 0 sd
0 slj
0.000000 0.000000 0.000000 srgb
n 16.447205 15.122899 m 17.654311 16.330005 l 16.447205 17.537111 l 15.240099 16.330005 l cp s
0.100000 slw
[] 0 sd
[0.400000] 0 sd
0 slc
n 16.447200 12.230000 m 16.447200 15.122900 l s
0.100000 slw
[] 0 sd
0 slj
0 slc
n 16.197200 14.322900 m 16.447200 15.122900 l 16.697200 14.322900 l s
16.500000 13.500000 m /Courier_e0 ff 0.800000 scf sf
(%*')
 gs 1 -1 sc sh gr
0.550000 0.460000 0.910000 srgb
n -7.910000 -2.420000 m -7.910000 -1.450000 l -6.900000 -1.450000 l -6.900000 -2.420000 l f
0.100000 slw
[] 0 sd
[] 0 sd
0 slj
0.000000 0.000000 0.000000 srgb
n -7.910000 -2.420000 m -7.910000 -1.450000 l -6.900000 -1.450000 l -6.900000 -2.420000 l cp s
0.333333 0.690196 0.968627 srgb
n -7.910000 -5.320000 m -7.910000 -4.350000 l -6.900000 -4.350000 l -6.900000 -5.320000 l f
0.100000 slw
[] 0 sd
[] 0 sd
0 slj
0.000000 0.000000 0.000000 srgb
n -7.910000 -5.320000 m -7.910000 -4.350000 l -6.900000 -4.350000 l -6.900000 -5.320000 l cp s
0.650000 0.650000 1.000000 srgb
n -7.910000 -3.850000 m -7.910000 -2.950000 l -6.900000 -2.950000 l -6.900000 -3.850000 l f
0.100000 slw
[] 0 sd
[] 0 sd
0 slj
0.000000 0.000000 0.000000 srgb
n -7.910000 -3.850000 m -7.910000 -2.950000 l -6.900000 -2.950000 l -6.900000 -3.850000 l cp s
/Courier_e0 ff 0.800000 scf sf
(3456788#!) sw
2 div -4.000000 ex sub -4.650000 m (3456788#!)
 gs 1 -1 sc sh gr
/Courier_e0 ff 0.800000 scf sf
(3456788#$) sw
2 div -4.023600 ex sub -3.173510 m (3456788#$)
 gs 1 -1 sc sh gr
/Courier_e0 ff 0.800000 scf sf
(3456788#&) sw
2 div -4.023600 ex sub -1.673510 m (3456788#&)
 gs 1 -1 sc sh gr
showpage
