(classPool
(JNukeClass "Figure16_7a" "Figure16_7a.java"
  (JNukeMethod "Figure16_7a.<init>" (JNukeSignature "V" (JNukeVector))
  (JNukeByteCodes
    (JNukeRByteCode 0 "r0 = Get" l0 (line 1))
    (JNukeRByteCode 1 "     InvokeSpecial" (JNukeMethod "java/lang/Object.<init>" (JNukeSignature "V" (JNukeVector))) r0)
    (JNukeRByteCode 2 "     Return" void)
))
  (JNukeMethod "Figure16_7a.m" (JNukeSignature "V" (JNukeVector "Z"))
  (JNukeEHandlers
    (JNukeEHandlerDesc (JNukeMethod "Figure16_7a.m" (JNukeSignature "V" (JNukeVector "Z"))) "<Any exception>" 0 1 67)
    (JNukeEHandlerDesc (JNukeMethod "Figure16_7a.m" (JNukeSignature "V" (JNukeVector "Z"))) "<Any exception>" 35 35 67)
    (JNukeEHandlerDesc (JNukeMethod "Figure16_7a.m" (JNukeSignature "V" (JNukeVector "Z"))) "<Any exception>" 66 66 67)
    (JNukeEHandlerDesc (JNukeMethod "Figure16_7a.m" (JNukeSignature "V" (JNukeVector "Z"))) "<Any exception>" 2 3 21)
    (JNukeEHandlerDesc (JNukeMethod "Figure16_7a.m" (JNukeSignature "V" (JNukeVector "Z"))) "<Any exception>" 13 13 21)
    (JNukeEHandlerDesc (JNukeMethod "Figure16_7a.m" (JNukeSignature "V" (JNukeVector "Z"))) "<Any exception>" 20 20 21)
    (JNukeEHandlerDesc (JNukeMethod "Figure16_7a.m" (JNukeSignature "V" (JNukeVector "Z"))) "<Any exception>" 36 37 55)
    (JNukeEHandlerDesc (JNukeMethod "Figure16_7a.m" (JNukeSignature "V" (JNukeVector "Z"))) "<Any exception>" 47 47 55)
    (JNukeEHandlerDesc (JNukeMethod "Figure16_7a.m" (JNukeSignature "V" (JNukeVector "Z"))) "<Any exception>" 54 54 55)
    (JNukeEHandlerDesc (JNukeMethod "Figure16_7a.m" (JNukeSignature "V" (JNukeVector "Z"))) "<Any exception>" 68 69 87)
    (JNukeEHandlerDesc (JNukeMethod "Figure16_7a.m" (JNukeSignature "V" (JNukeVector "Z"))) "<Any exception>" 79 79 87)
    (JNukeEHandlerDesc (JNukeMethod "Figure16_7a.m" (JNukeSignature "V" (JNukeVector "Z"))) "<Any exception>" 86 86 87)
    (JNukeEHandlerDesc (JNukeMethod "Figure16_7a.m" (JNukeSignature "V" (JNukeVector "Z"))) "java/lang/Throwable" 2 5 31)
    (JNukeEHandlerDesc (JNukeMethod "Figure16_7a.m" (JNukeSignature "V" (JNukeVector "Z"))) "java/lang/Throwable" 9 9 31)
    (JNukeEHandlerDesc (JNukeMethod "Figure16_7a.m" (JNukeSignature "V" (JNukeVector "Z"))) "java/lang/Throwable" 13 15 31)
    (JNukeEHandlerDesc (JNukeMethod "Figure16_7a.m" (JNukeSignature "V" (JNukeVector "Z"))) "java/lang/Throwable" 19 23 31)
    (JNukeEHandlerDesc (JNukeMethod "Figure16_7a.m" (JNukeSignature "V" (JNukeVector "Z"))) "java/lang/Throwable" 27 29 31)
    (JNukeEHandlerDesc (JNukeMethod "Figure16_7a.m" (JNukeSignature "V" (JNukeVector "Z"))) "java/lang/Throwable" 36 39 65)
    (JNukeEHandlerDesc (JNukeMethod "Figure16_7a.m" (JNukeSignature "V" (JNukeVector "Z"))) "java/lang/Throwable" 43 43 65)
    (JNukeEHandlerDesc (JNukeMethod "Figure16_7a.m" (JNukeSignature "V" (JNukeVector "Z"))) "java/lang/Throwable" 47 49 65)
    (JNukeEHandlerDesc (JNukeMethod "Figure16_7a.m" (JNukeSignature "V" (JNukeVector "Z"))) "java/lang/Throwable" 53 57 65)
    (JNukeEHandlerDesc (JNukeMethod "Figure16_7a.m" (JNukeSignature "V" (JNukeVector "Z"))) "java/lang/Throwable" 61 63 65)
    (JNukeEHandlerDesc (JNukeMethod "Figure16_7a.m" (JNukeSignature "V" (JNukeVector "Z"))) "java/lang/Throwable" 68 71 97)
    (JNukeEHandlerDesc (JNukeMethod "Figure16_7a.m" (JNukeSignature "V" (JNukeVector "Z"))) "java/lang/Throwable" 75 75 97)
    (JNukeEHandlerDesc (JNukeMethod "Figure16_7a.m" (JNukeSignature "V" (JNukeVector "Z"))) "java/lang/Throwable" 79 81 97)
    (JNukeEHandlerDesc (JNukeMethod "Figure16_7a.m" (JNukeSignature "V" (JNukeVector "Z"))) "java/lang/Throwable" 85 89 97)
    (JNukeEHandlerDesc (JNukeMethod "Figure16_7a.m" (JNukeSignature "V" (JNukeVector "Z"))) "java/lang/Throwable" 93 95 97)
    (JNukeEHandlerDesc (JNukeMethod "Figure16_7a.m" (JNukeSignature "V" (JNukeVector "Z"))) "<Any exception>" 0 5 104)
    (JNukeEHandlerDesc (JNukeMethod "Figure16_7a.m" (JNukeSignature "V" (JNukeVector "Z"))) "<Any exception>" 9 9 104)
    (JNukeEHandlerDesc (JNukeMethod "Figure16_7a.m" (JNukeSignature "V" (JNukeVector "Z"))) "<Any exception>" 13 15 104)
    (JNukeEHandlerDesc (JNukeMethod "Figure16_7a.m" (JNukeSignature "V" (JNukeVector "Z"))) "<Any exception>" 19 23 104)
    (JNukeEHandlerDesc (JNukeMethod "Figure16_7a.m" (JNukeSignature "V" (JNukeVector "Z"))) "<Any exception>" 27 31 104)
    (JNukeEHandlerDesc (JNukeMethod "Figure16_7a.m" (JNukeSignature "V" (JNukeVector "Z"))) "<Any exception>" 35 39 104)
    (JNukeEHandlerDesc (JNukeMethod "Figure16_7a.m" (JNukeSignature "V" (JNukeVector "Z"))) "<Any exception>" 43 43 104)
    (JNukeEHandlerDesc (JNukeMethod "Figure16_7a.m" (JNukeSignature "V" (JNukeVector "Z"))) "<Any exception>" 47 49 104)
    (JNukeEHandlerDesc (JNukeMethod "Figure16_7a.m" (JNukeSignature "V" (JNukeVector "Z"))) "<Any exception>" 53 57 104)
    (JNukeEHandlerDesc (JNukeMethod "Figure16_7a.m" (JNukeSignature "V" (JNukeVector "Z"))) "<Any exception>" 61 71 104)
    (JNukeEHandlerDesc (JNukeMethod "Figure16_7a.m" (JNukeSignature "V" (JNukeVector "Z"))) "<Any exception>" 75 75 104)
    (JNukeEHandlerDesc (JNukeMethod "Figure16_7a.m" (JNukeSignature "V" (JNukeVector "Z"))) "<Any exception>" 79 81 104)
    (JNukeEHandlerDesc (JNukeMethod "Figure16_7a.m" (JNukeSignature "V" (JNukeVector "Z"))) "<Any exception>" 85 89 104)
    (JNukeEHandlerDesc (JNukeMethod "Figure16_7a.m" (JNukeSignature "V" (JNukeVector "Z"))) "<Any exception>" 93 99 104)
    (JNukeEHandlerDesc (JNukeMethod "Figure16_7a.m" (JNukeSignature "V" (JNukeVector "Z"))) "<Any exception>" 103 103 104)
  )
  (JNukeByteCodes
    (JNukeRByteCode 0 "r0 = Get" l0 (line 4))
    (JNukeRByteCode 1 "     Cond" ifeq 36 r0)
      (JNukeRByteCode 2 "r0 = Get" l0 (line 7))
      (JNukeRByteCode 3 "     Cond" ifeq 14 r0)
        (JNukeRByteCode 4 "r0 = Get" l0 (line 8))
        (JNukeRByteCode 5 "     Cond" ifeq 10 r0)
          (JNukeRByteCode 6 "r0 = Get" l0 (line 12))
          (JNukeRByteCode 7 "     Cond" ifeq 9 r0)
          (JNukeRByteCode 8 "     Return" void)
        (JNukeRByteCode 9 "     Return" void (line 8))
          (JNukeRByteCode 10 "r0 = Get" l0 (line 12))
          (JNukeRByteCode 11 "     Cond" ifeq 13 r0)
          (JNukeRByteCode 12 "     Return" void)
      (JNukeRByteCode 13 "     Return" void (line 8))
        (JNukeRByteCode 14 "r0 = Get" l0)
        (JNukeRByteCode 15 "     Cond" ifeq 20 r0)
          (JNukeRByteCode 16 "r0 = Get" l0 (line 12))
          (JNukeRByteCode 17 "     Cond" ifeq 19 r0)
          (JNukeRByteCode 18 "     Return" void)
        (JNukeRByteCode 19 "     Return" void (line 8))
      (JNukeRByteCode 20 "     Goto" 30)
      (JNukeRByteCode 21 "l3 = Get" r0 (line 8))
        (JNukeRByteCode 22 "r0 = Get" l0)
        (JNukeRByteCode 23 "     Cond" ifeq 28 r0)
          (JNukeRByteCode 24 "r0 = Get" l0 (line 12))
          (JNukeRByteCode 25 "     Cond" ifeq 27 r0)
          (JNukeRByteCode 26 "     Return" void)
        (JNukeRByteCode 27 "     Return" void (line 8))
      (JNukeRByteCode 28 "r0 = Get" l3)
      (JNukeRByteCode 29 "     Athrow" r0)
      (JNukeRByteCode 30 "     Goto" 32)
      (JNukeRByteCode 31 "l3 = Get" r0 (line 10))
          (JNukeRByteCode 32 "r0 = Get" l0 (line 12))
          (JNukeRByteCode 33 "     Cond" ifeq 35 r0)
          (JNukeRByteCode 34 "     Return" void)
    (JNukeRByteCode 35 "     Return" void (line 10))
      (JNukeRByteCode 36 "r0 = Get" l0 (line 7))
      (JNukeRByteCode 37 "     Cond" ifeq 48 r0)
        (JNukeRByteCode 38 "r0 = Get" l0 (line 8))
        (JNukeRByteCode 39 "     Cond" ifeq 44 r0)
          (JNukeRByteCode 40 "r0 = Get" l0 (line 12))
          (JNukeRByteCode 41 "     Cond" ifeq 43 r0)
          (JNukeRByteCode 42 "     Return" void)
        (JNukeRByteCode 43 "     Return" void (line 8))
          (JNukeRByteCode 44 "r0 = Get" l0 (line 12))
          (JNukeRByteCode 45 "     Cond" ifeq 47 r0)
          (JNukeRByteCode 46 "     Return" void)
      (JNukeRByteCode 47 "     Return" void (line 8))
        (JNukeRByteCode 48 "r0 = Get" l0)
        (JNukeRByteCode 49 "     Cond" ifeq 54 r0)
          (JNukeRByteCode 50 "r0 = Get" l0 (line 12))
          (JNukeRByteCode 51 "     Cond" ifeq 53 r0)
          (JNukeRByteCode 52 "     Return" void)
        (JNukeRByteCode 53 "     Return" void (line 8))
      (JNukeRByteCode 54 "     Goto" 64)
      (JNukeRByteCode 55 "l3 = Get" r0 (line 8))
        (JNukeRByteCode 56 "r0 = Get" l0)
        (JNukeRByteCode 57 "     Cond" ifeq 62 r0)
          (JNukeRByteCode 58 "r0 = Get" l0 (line 12))
          (JNukeRByteCode 59 "     Cond" ifeq 61 r0)
          (JNukeRByteCode 60 "     Return" void)
        (JNukeRByteCode 61 "     Return" void (line 8))
      (JNukeRByteCode 62 "r0 = Get" l3)
      (JNukeRByteCode 63 "     Athrow" r0)
      (JNukeRByteCode 64 "     Goto" 66)
      (JNukeRByteCode 65 "l3 = Get" r0 (line 10))
    (JNukeRByteCode 66 "     Goto" 100 (line 7))
    (JNukeRByteCode 67 "l1 = Get" r0 (line 6))
      (JNukeRByteCode 68 "r0 = Get" l0 (line 7))
      (JNukeRByteCode 69 "     Cond" ifeq 80 r0)
        (JNukeRByteCode 70 "r0 = Get" l0 (line 8))
        (JNukeRByteCode 71 "     Cond" ifeq 76 r0)
          (JNukeRByteCode 72 "r0 = Get" l0 (line 12))
          (JNukeRByteCode 73 "     Cond" ifeq 75 r0)
          (JNukeRByteCode 74 "     Return" void)
        (JNukeRByteCode 75 "     Return" void (line 8))
          (JNukeRByteCode 76 "r0 = Get" l0 (line 12))
          (JNukeRByteCode 77 "     Cond" ifeq 79 r0)
          (JNukeRByteCode 78 "     Return" void)
      (JNukeRByteCode 79 "     Return" void (line 8))
        (JNukeRByteCode 80 "r0 = Get" l0)
        (JNukeRByteCode 81 "     Cond" ifeq 86 r0)
          (JNukeRByteCode 82 "r0 = Get" l0 (line 12))
          (JNukeRByteCode 83 "     Cond" ifeq 85 r0)
          (JNukeRByteCode 84 "     Return" void)
        (JNukeRByteCode 85 "     Return" void (line 8))
      (JNukeRByteCode 86 "     Goto" 96)
      (JNukeRByteCode 87 "l3 = Get" r0 (line 8))
        (JNukeRByteCode 88 "r0 = Get" l0)
        (JNukeRByteCode 89 "     Cond" ifeq 94 r0)
          (JNukeRByteCode 90 "r0 = Get" l0 (line 12))
          (JNukeRByteCode 91 "     Cond" ifeq 93 r0)
          (JNukeRByteCode 92 "     Return" void)
        (JNukeRByteCode 93 "     Return" void (line 8))
      (JNukeRByteCode 94 "r0 = Get" l3)
      (JNukeRByteCode 95 "     Athrow" r0)
      (JNukeRByteCode 96 "     Goto" 98)
      (JNukeRByteCode 97 "l3 = Get" r0 (line 10))
    (JNukeRByteCode 98 "r0 = Get" l1 (line 7))
    (JNukeRByteCode 99 "     Athrow" r0)
          (JNukeRByteCode 100 "r0 = Get" l0 (line 12))
          (JNukeRByteCode 101 "     Cond" ifeq 103 r0)
          (JNukeRByteCode 102 "     Return" void)
    (JNukeRByteCode 103 "     Goto" 110 (line 7))
    (JNukeRByteCode 104 "l5 = Get" r0 (line 12))
          (JNukeRByteCode 105 "r0 = Get" l0)
          (JNukeRByteCode 106 "     Cond" ifeq 108 r0)
          (JNukeRByteCode 107 "     Return" void)
    (JNukeRByteCode 108 "r0 = Get" l5)
    (JNukeRByteCode 109 "     Athrow" r0)
    (JNukeRByteCode 110 "     Return" void (line 13))
))
)
)
