%!PS-Adobe-2.0 EPSF-2.0
%%Title: rtenv.dia
%%Creator: Dia v0.90
%%CreationDate: Thu Jan 30 19:37:51 2003
%%For: pascal
%%Magnification: 1.0000
%%Orientation: Portrait
%%BoundingBox: 0 0 1019 227
%%Pages: 1
%%EndComments
%%BeginProlog
/cp {closepath} bind def
/c {curveto} bind def
/f {fill} bind def
/a {arc} bind def
/ef {eofill} bind def
/ex {exch} bind def
/gr {grestore} bind def
/gs {gsave} bind def
/sa {save} bind def
/rs {restore} bind def
/l {lineto} bind def
/m {moveto} bind def
/rm {rmoveto} bind def
/n {newpath} bind def
/s {stroke} bind def
/sh {show} bind def
/slc {setlinecap} bind def
/slj {setlinejoin} bind def
/slw {setlinewidth} bind def
/srgb {setrgbcolor} bind def
/rot {rotate} bind def
/sc {scale} bind def
/sd {setdash} bind def
/ff {findfont} bind def
/sf {setfont} bind def
/scf {scalefont} bind def
/sw {stringwidth pop} bind def
/tr {translate} bind def

/ellipsedict 8 dict def
ellipsedict /mtrx matrix put
/ellipse
{ ellipsedict begin
   /endangle exch def
   /startangle exch def
   /yrad exch def
   /xrad exch def
   /y exch def
   /x exch def   /savematrix mtrx currentmatrix def
   x y tr xrad yrad sc
   0 0 1 startangle endangle arc
   savematrix setmatrix
   end
} def

/mergeprocs {
dup length
3 -1 roll
dup
length
dup
5 1 roll
3 -1 roll
add
array cvx
dup
3 -1 roll
0 exch
putinterval
dup
4 2 roll
putinterval
} bind def
%%EndProlog

%%BeginSetup
%%EndSetup
28.346000 -28.346000 scale
1.764400 -14.150000 translate

1.000000 1.000000 1.000000 srgb
n 8.729600 6.200000 m 8.729600 8.100000 l 22.070400 8.100000 l 22.070400 6.200000 l f
0.100000 slw
[] 0 sd
[] 0 sd
0 slj
0.000000 0.000000 0.000000 srgb
n 8.729600 6.200000 m 8.729600 8.100000 l 22.070400 8.100000 l 22.070400 6.200000 l cp s
 [ /xi /xi /xi /xi /xi /xi /xi /xi /xi /xi /xi /xi /xi /xi /xi /xi
 /xi /xi /xi /xi /xi /xi /xi /xi /xi /xi /xi /xi /xi /xi /xi /xi
 /J /N /u /k /e /R /n /t /xi /xi /i /m /E /v /r /o
 /T /h /a /d /H /p /M /g /L /c /W /s /one /xi /xi /xi
 /xi /xi /xi /xi /xi /xi /xi /xi /xi /xi /xi /xi /xi /xi /xi /xi
 /xi /xi /xi /xi /xi /xi /xi /xi /xi /xi /xi /xi /xi /xi /xi /xi
 /xi /xi /xi /xi /xi /xi /xi /xi /xi /xi /xi /xi /xi /xi /xi /xi
 /xi /xi /xi /xi /xi /xi /xi /xi /xi /xi /xi /xi /xi /xi /xi /xi
 /xi /xi /xi /xi /xi /xi /xi /xi /xi /xi /xi /xi /xi /xi /xi /xi
 /xi /xi /xi /xi /xi /xi /xi /xi /xi /xi /xi /xi /xi /xi /xi /xi
 /xi /xi /xi /xi /xi /xi /xi /xi /xi /xi /xi /xi /xi /xi /xi /xi
 /xi /xi /xi /xi /xi /xi /xi /xi /xi /xi /xi /xi /xi /xi /xi /xi
 /xi /xi /xi /xi /xi /xi /xi /xi /xi /xi /xi /xi /xi /xi /xi /xi
 /xi /xi /xi /xi /xi /xi /xi /xi /xi /xi /xi /xi /xi /xi /xi /xi
 /xi /xi /xi /xi /xi /xi /xi /xi /xi /xi /xi /xi /xi /xi /xi /xi
 /xi /xi /xi /xi /xi /xi /xi /xi /xi /xi /xi /xi /xi /xi /xi /xi
] /e0 exch def
/Courier_e0 undefinefont
/Courier_e0
  /Courier findfont
  dup length dict begin
  {1 index /FID ne {def} {pop pop} ifelse} forall
  /Encoding e0 def
  currentdict end
definefont pop
/Courier_e0 ff 0.800000 scf sf
( !"#$%"&'*+$,&-*./&+$&') sw
2 div 15.400000 ex sub 7.346491 m ( !"#$%"&'*+$,&-*./&+$&')
 gs 1 -1 sc sh gr
1.000000 1.000000 1.000000 srgb
n 21.528400 12.200000 m 21.528400 14.100000 l 28.471600 14.100000 l 28.471600 12.200000 l f
0.100000 slw
[] 0 sd
[] 0 sd
0 slj
0.000000 0.000000 0.000000 srgb
n 21.528400 12.200000 m 21.528400 14.100000 l 28.471600 14.100000 l 28.471600 12.200000 l cp s
/Courier_e0 ff 0.800000 scf sf
( !"#$01.$23) sw
2 div 25.000000 ex sub 13.346491 m ( !"#$01.$23)
 gs 1 -1 sc sh gr
1.000000 1.000000 1.000000 srgb
n 24.490800 6.200000 m 24.490800 8.100000 l 34.109200 8.100000 l 34.109200 6.200000 l f
0.100000 slw
[] 0 sd
[] 0 sd
0 slj
0.000000 0.000000 0.000000 srgb
n 24.490800 6.200000 m 24.490800 8.100000 l 34.109200 8.100000 l 34.109200 6.200000 l cp s
/Courier_e0 ff 0.800000 scf sf
( !"#$4$2562&27$.) sw
2 div 29.300000 ex sub 7.346491 m ( !"#$4$2562&27$.)
 gs 1 -1 sc sh gr
1.000000 1.000000 1.000000 srgb
n 10.590800 12.200000 m 10.590800 14.100000 l 20.209200 14.100000 l 20.209200 12.200000 l f
0.100000 slw
[] 0 sd
[] 0 sd
0 slj
0.000000 0.000000 0.000000 srgb
n 10.590800 12.200000 m 10.590800 14.100000 l 20.209200 14.100000 l 20.209200 12.200000 l cp s
/Courier_e0 ff 0.800000 scf sf
( !"#$8/9#62&27$.) sw
2 div 15.400000 ex sub 13.346491 m ( !"#$8/9#62&27$.)
 gs 1 -1 sc sh gr
1.000000 1.000000 1.000000 srgb
n -1.714400 12.200000 m -1.714400 14.100000 l 9.514400 14.100000 l 9.514400 12.200000 l f
0.100000 slw
[] 0 sd
[] 0 sd
0 slj
0.000000 0.000000 0.000000 srgb
n -1.714400 12.200000 m -1.714400 14.100000 l 9.514400 14.100000 l 9.514400 12.200000 l cp s
/Courier_e0 ff 0.800000 scf sf
( !"#$:2*';$'62&27$.) sw
2 div 3.900000 ex sub 13.346491 m ( !"#$:2*';$'62&27$.)
 gs 1 -1 sc sh gr
0.100000 slw
[] 0 sd
0 slj
0 slc
n 25.000000 12.200000 m 25.000000 9.850000 l 15.400000 9.850000 l 15.400000 8.100000 l s
[] 0 sd
0 slj
0 slc
n 15.400000 8.100000 m 15.640000 8.800000 l 15.400000 9.500000 l 15.160000 8.800000 l f
25.000000 12.796491 m /Courier_e0 ff 0.800000 scf sf
(&)
 gs 1 -1 sc sh gr
15.400000 8.696491 m (<)
 gs 1 -1 sc sh gr
0.100000 slw
[] 0 sd
0 slj
0 slc
n 15.400000 12.200000 m 15.400000 9.850000 l 15.400000 9.850000 l 15.400000 8.100000 l s
[] 0 sd
0 slj
0 slc
n 15.400000 8.100000 m 15.640000 8.800000 l 15.400000 9.500000 l 15.160000 8.800000 l f
0.100000 slw
[] 0 sd
0 slj
0 slc
n 0.112616 12.250000 m 0.112616 9.850000 l 15.400000 9.850000 l 15.400000 8.100000 l s
[] 0 sd
0 slj
0 slc
n 15.400000 8.100000 m 15.640000 8.800000 l 15.400000 9.500000 l 15.160000 8.800000 l f
0.100000 slw
[] 0 sd
0 slj
0 slc
n 22.070400 7.150000 m 22.070400 7.250000 l 24.490800 7.250000 l 24.490800 7.150000 l s
showpage
