X.<init>:5:Write access to field X.coord by thread 0 (holding 0 locks)
X.<init>:5:Write access to field X.coord by thread 0 (holding 0 locks)
X.run:9:Read access to field X.coord by thread 1 (holding 0 locks)
Coord.setX:26:Write access to field Coord.x by thread 1 (holding 0 locks)
X.run:10:Read access to field X.coord by thread 1 (holding 0 locks)
Coord.getX:16: by thread 1: Monitorenter Coord
Coord.getX:17:Read access to field Coord.x by thread 1 (holding 1 locks: Coord.getX:16:Coord)
X.run:9:Read access to field X.coord by thread 2 (holding 0 locks)
Coord.setX:26:Write access to field Coord.x by thread 2 (holding 0 locks)
NEW ACCESS CONFLICT FOUND:
Concurrent access with insufficient lock protection: Access history:
1) Coord.setX:26:Write access to field Coord.x by thread 1 (holding 0 locks)
2) Coord.getX:17:Read access to field Coord.x by thread 1 (holding 1 locks: Coord.getX:16:Coord)
3) Coord.setX:26:Write access to field Coord.x by thread 2 (holding 0 locks)
(JNukeEraserInfo (JNukeAccessHistory (JNukeFieldAccess (JNukeField "Coord.x") (lockSet 0) (vmState "Coord.setX (D)V" (line 26) (pc 2) (thread 1))) (JNukeFieldAccess (JNukeField "Coord.x") (lockSet 1 (JNukeLockInfo "Coord")) (vmState "Coord.getX ()D" (line 17) (pc 5) (thread 1))) (JNukeFieldAccess (JNukeField "Coord.x") (lockSet 0) (vmState "Coord.setX (D)V" (line 26) (pc 2) (thread 2)))))
X.run:10:Read access to field X.coord by thread 2 (holding 0 locks)
Coord.getX:16: by thread 2: Monitorenter Coord
Coord.getX:17:Read access to field Coord.x by thread 2 (holding 1 locks: Coord.getX:16:Coord)
