#FIG 3.2
Landscape
Center
Metric
A4      
100.00
Single
-2
1200 2
0 32 #dfe3ef
0 33 #96969e
0 34 #d7dbd7
0 35 #9ea2b6
0 36 #9e0000
0 37 #efefef
0 38 #dfe3df
0 39 #86aeff
0 40 #7171ff
0 41 #c7b696
0 42 #effbff
0 43 #dfcba6
0 44 #414141
0 45 #868286
0 46 #bec3be
0 47 #dfe3df
0 48 #8e8e8e
0 49 #aeaaae
0 50 #414141
0 51 #868286
0 52 #bec3be
0 53 #868286
0 54 #bec3be
0 55 #dfe3df
0 56 #8e8e8e
0 57 #8e8e8e
0 58 #414141
0 59 #868286
0 60 #bec3be
0 61 #dfe3df
0 62 #414141
0 63 #868286
0 64 #bec3be
0 65 #dfe3df
0 66 #868286
0 67 #bec3be
0 68 #dfe3df
0 69 #c7b696
0 70 #effbff
0 71 #dfcba6
0 72 #c7b696
0 73 #effbff
0 74 #dfcba6
0 75 #aeaaae
0 76 #595559
0 77 #8e8e8e
0 78 #414141
0 79 #868286
0 80 #bec3be
0 81 #dfe3df
0 82 #414141
0 83 #868286
0 84 #bec3be
0 85 #dfe3df
0 86 #868286
0 87 #bec3be
0 88 #dfe3df
0 89 #414141
0 90 #868286
0 91 #bec3be
0 92 #414141
0 93 #bec3be
0 94 #dfe3df
0 95 #414141
0 96 #868286
0 97 #bec3be
0 98 #8e8e8e
0 99 #414141
0 100 #868286
0 101 #bec3be
0 102 #dfe3df
0 103 #414141
0 104 #868286
0 105 #bec3be
0 106 #dfe3df
0 107 #bebebe
0 108 #515151
0 109 #e7e3e7
0 110 #000049
0 111 #797979
0 112 #303430
0 113 #414541
0 114 #414141
0 115 #868286
0 116 #bec3be
0 117 #dfe3df
0 118 #8e928e
0 119 #e7e7cf
0 120 #9e9a9e
0 121 #cf9200
0 122 #f761ae
0 123 #7171ff
0 124 #595d59
0 125 #000079
0 126 #ff8200
0 127 #007d00
0 128 #0000be
0 129 #414141
0 130 #868286
0 131 #bec3be
0 132 #dfe3df
0 133 #868286
0 134 #bec3be
0 135 #dfe3df
0 136 #494549
0 137 #494549
0 138 #8e8e8e
0 139 #cfcfcf
6 1305 1755 2520 3195
2 2 0 2 0 7 100 0 -1 0.000 0 0 -1 0 0 5
	 1350 1800 2475 1800 2475 2250 1350 2250 1350 1800
2 2 0 2 0 7 100 0 -1 0.000 0 0 -1 0 0 5
	 2475 2250 1350 2250 1350 2700 2475 2700 2475 2250
2 2 0 2 0 7 100 0 -1 0.000 0 0 -1 0 0 5
	 1350 2700 2475 2700 2475 3150 1350 3150 1350 2700
4 0 0 50 0 14 18 0.0000 4 180 660 1620 2115 main\001
4 0 0 50 0 14 18 0.0000 4 180 660 1575 2565 init\001
4 0 0 50 0 14 18 0.0000 4 180 660 1575 3015 read\001
-6
6 2880 3105 4095 4095
6 2880 3555 4095 4095
2 2 0 2 0 7 100 0 -1 0.000 0 0 -1 0 0 5
	 2925 3600 4050 3600 4050 4050 2925 4050 2925 3600
4 0 0 50 0 14 18 0.0000 4 180 825 3060 3915 start\001
-6
6 2880 3105 4095 3645
2 2 0 2 0 7 100 0 -1 0.000 0 0 -1 0 0 5
	 2925 3150 4050 3150 4050 3600 2925 3600 2925 3150
4 0 0 50 0 14 18 0.0000 4 180 660 3105 3465 work\001
-6
-6
6 5355 3555 6795 4545
6 5355 4005 6795 4545
2 2 0 2 0 7 100 0 -1 0.000 0 0 -1 0 0 5
	 5400 4050 6750 4050 6750 4500 5400 4500 5400 4050
4 0 0 50 0 14 18 0.0000 4 195 1155 5535 4365 process\001
-6
6 5355 3555 6795 4095
6 5805 3780 6300 3915
4 0 0 50 0 14 18 0.0000 4 135 495 5805 3915 run\001
-6
2 2 0 2 0 7 100 0 -1 0.000 0 0 -1 0 0 5
	 5400 3600 6750 3600 6750 4050 5400 4050 5400 3600
-6
-6
6 1575 5310 5625 6300
6 4815 5310 5621 6210
5 1 0 1 0 1 60 0 20 0.000 0 0 0 0 5225.000 5613.000 4930 5614 5226 5318 5520 5614
5 1 0 1 0 33 50 0 40 0.000 0 0 0 0 5225.500 5613.500 5029 5614 5226 5417 5422 5614
6 5127 5713 5324 6107
1 3 0 1 0 0 25 0 20 0.000 1 0.0000 5226 5791 79 79 5226 5791 5304 5791
2 1 0 1 0 0 25 0 20 0.000 0 0 -1 0 0 5
	 5186 5841 5127 6087 5324 6087 5270 5845 5176 5841
-6
2 2 0 1 0 1 50 0 20 0.000 0 0 -1 0 0 5
	 4832 5614 5619 5614 5619 6205 4832 6205 4832 5614
-6
6 1575 5355 2385 6255
5 1 0 1 0 14 60 0 20 0.000 0 0 0 0 1989.000 5658.000 1694 5659 1990 5363 2284 5659
5 1 0 1 0 33 50 0 40 0.000 0 0 0 0 1989.500 5658.500 1793 5659 1990 5462 2186 5659
6 1891 5758 2088 6152
1 3 0 1 0 0 25 0 20 0.000 1 0.0000 1990 5836 79 79 1990 5836 2068 5836
2 1 0 1 0 0 25 0 20 0.000 0 0 -1 0 0 5
	 1950 5886 1891 6132 2088 6132 2034 5890 1940 5886
-6
2 2 0 1 0 14 50 0 20 0.000 0 0 -1 0 0 5
	 1596 5659 2383 5659 2383 6250 1596 6250 1596 5659
-6
6 2790 5310 4410 6300
2 3 0 1 0 7 100 0 -1 0.000 0 0 -1 0 0 4
	 4169 5332 4169 5546 4383 5546 4169 5332
2 3 0 1 0 7 101 0 20 4.000 0 0 7 0 0 6
	 2811 5332 2811 6261 4383 6261 4383 5546 4169 5332 2811 5332
-6
4 0 0 50 0 14 18 0.0000 4 180 660 3285 5895 data\001
-6
2 1 0 2 0 7 100 0 -1 0.000 0 0 -1 1 0 2
	1 1 2.00 120.00 240.00
	 2475 2025 3465 3105
2 1 1 2 0 7 100 0 -1 6.000 0 0 -1 1 0 2
	1 1 2.00 120.00 240.00
	 4050 3825 5400 3825
2 1 0 2 4 7 100 0 -1 6.000 0 0 -1 1 0 2
	1 1 2.00 120.00 240.00
	 1935 3150 1935 5085
2 1 0 2 4 7 100 0 -1 6.000 0 0 -1 1 0 2
	1 1 2.00 120.00 240.00
	 6075 4500 5265 5085
2 2 0 1 7 7 50 0 -1 0.000 0 0 -1 0 0 5
	 1170 990 7875 990 7875 6390 1170 6390 1170 990
4 0 0 100 0 14 20 0.0000 4 180 1815 1935 1395 Thread main\001
4 0 0 100 0 14 20 0.0000 4 180 2475 4950 1395 Thread Worker-1\001
