#FIG 3.2
Landscape
Center
Metric
A4      
100.00
Single
-2
1200 2
0 32 #e1e1e1
0 33 #acacac
6 5085 3870 7740 5923
6 6433 3870 7740 4762
2 3 0 1 0 11 120 0 62 0.000 0 0 -1 0 0 5
	 7408 3953 7740 3870 7512 4056 7180 4139 7408 3953
2 3 0 1 0 11 120 0 62 0.000 0 0 -1 0 0 5
	 7159 4161 7491 4078 7263 4264 6931 4347 7159 4161
2 3 0 1 0 11 120 0 62 0.000 0 0 -1 0 0 5
	 6910 4368 7242 4285 7014 4472 6682 4555 6910 4368
2 3 0 1 0 11 120 0 62 0.000 0 0 -1 0 0 5
	 6661 4575 6994 4492 6765 4679 6433 4762 6661 4575
-6
6 5094 5011 6400 5902
2 3 0 1 0 11 50 0 62 0.000 0 0 -1 0 0 5
	 6068 5094 6400 5011 6173 5198 5840 5281 6068 5094
2 3 0 1 0 11 50 0 62 0.000 0 0 -1 0 0 5
	 5820 5301 6151 5218 5923 5405 5591 5488 5820 5301
2 3 0 1 0 11 50 0 62 0.000 0 0 -1 0 0 5
	 5571 5509 5902 5426 5674 5613 5342 5696 5571 5509
2 3 0 1 0 11 50 0 62 0.000 0 0 -1 0 0 5
	 5322 5716 5654 5633 5425 5820 5094 5902 5322 5716
-6
6 6053 4580 6883 5267
1 2 0 1 0 31 40 0 20 0.000 1 5.9341 6775 5019 52 208 6728 5001 6824 5037
1 2 0 0 0 31 70 0 20 0.000 1 5.9341 6581 4948 52 208 6533 4930 6630 4965
1 2 0 0 0 32 80 0 20 0.000 1 5.9341 6563 4941 52 208 6514 4924 6610 4959
1 2 0 0 0 32 60 0 20 0.000 1 5.9341 6738 5005 52 208 6688 4988 6786 5023
1 2 0 1 0 31 100 0 20 0.000 1 5.9341 6229 4824 52 208 6178 4824 6280 4824
2 1 0 1 33 32 120 0 20 0.000 0 0 -1 0 0 2
	 6765 4679 6620 4762
2 1 0 1 33 32 40 0 20 0.000 0 0 -1 0 0 2
	 6227 5031 6060 5094
2 3 0 0 33 33 55 0 20 0.000 0 0 -1 0 0 5
	 6591 5194 6590 5260 6609 5267 6610 5201 6591 5194
2 3 0 0 33 7 45 0 20 0.000 0 0 -1 0 0 5
	 6765 4839 6710 4929 6749 4943 6804 4852 6765 4839
2 3 0 0 33 7 45 0 20 0.000 0 0 -1 0 0 5
	 6590 4775 6534 4865 6554 4872 6609 4782 6590 4775
2 3 0 0 33 18 55 0 20 0.000 0 0 -1 0 0 5
	 6554 4872 6710 4929 6668 5046 6511 4989 6554 4872
2 3 0 0 33 18 55 0 20 0.000 0 0 -1 0 0 5
	 6825 4794 6883 4816 6858 4829 6799 4806 6825 4794
2 1 0 0 33 33 55 0 20 0.000 0 0 -1 0 0 4
	 6657 4711 6628 4789 6687 4810 6716 4732
2 3 0 0 33 32 60 0 20 0.000 0 0 -1 0 0 5
	 6799 4806 6838 4821 6696 5211 6657 5196 6799 4806
2 3 0 0 33 31 70 0 20 0.000 0 0 -1 0 0 5
	 6642 4750 6799 4806 6657 5196 6521 5147 6642 4750
2 3 0 0 33 31 100 0 20 0.000 0 0 -1 0 0 5
	 6292 4622 6663 4757 6521 5147 6170 5019 6292 4622
2 3 0 0 33 33 90 0 20 0.000 0 0 -1 0 0 5
	 6154 4882 6485 5001 6463 5125 6150 5012 6154 4882
2 1 0 1 0 31 80 0 20 0.000 0 0 -1 0 0 2
	 6288 4996 6463 5060
2 1 0 1 0 31 80 0 20 0.000 0 0 -1 0 0 2
	 6366 5024 6443 5118
2 1 0 1 7 31 80 0 20 0.000 0 0 -1 0 0 2
	 6288 4996 6349 4952
2 3 0 0 17 17 80 0 20 0.000 0 0 -1 0 0 5
	 6489 4870 6508 4877 6480 4955 6460 4948 6489 4870
2 3 0 0 32 32 80 0 20 0.000 0 0 -1 0 0 5
	 6384 4854 6423 4869 6409 4908 6369 4894 6384 4854
2 3 0 0 32 19 80 0 61 0.000 0 0 -1 0 0 5
	 6255 4785 6333 4814 6303 4892 6227 4863 6255 4785
2 3 0 1 0 33 70 0 20 0.000 0 0 -1 0 0 5
	 6197 4764 6157 4750 6143 4789 6182 4804 6197 4764
2 3 0 0 32 32 65 0 20 0.000 0 0 -1 0 0 5
	 6361 4736 6497 4785 6564 4722 6428 4672 6361 4736
2 1 0 1 18 31 70 0 20 0.000 0 0 -1 0 0 2
	 6237 4713 6549 4826
2 3 0 0 32 33 60 0 20 0.000 0 0 -1 0 0 5
	 6387 4723 6524 4773 6591 4710 6455 4659 6387 4723
2 3 0 0 32 32 55 0 20 0.000 0 0 -1 0 0 5
	 6395 4704 6531 4753 6598 4690 6463 4640 6395 4704
2 3 0 0 32 32 65 0 20 0.000 0 0 -1 0 0 5
	 6224 4686 6322 4722 6356 4690 6258 4654 6224 4686
2 1 0 1 0 32 50 0 20 0.000 0 0 -1 0 0 2
	 6224 4686 6245 4628
2 1 0 1 0 32 65 0 20 0.000 0 0 -1 0 0 2
	 6356 4690 6377 4631
2 3 0 0 32 32 55 0 20 0.000 0 0 -1 0 0 5
	 6245 4628 6344 4663 6377 4631 6280 4596 6245 4628
2 3 0 0 32 33 65 0 20 0.000 0 0 -1 0 0 5
	 6232 4667 6329 4702 6362 4670 6266 4634 6232 4667
2 1 0 1 18 32 60 0 20 0.000 0 0 -1 0 0 2
	 6497 5028 6653 5085
2 3 0 0 32 32 55 0 20 0.000 0 0 -1 0 0 5
	 6632 5143 6591 5194 6610 5201 6651 5150 6632 5143
2 1 0 1 18 32 60 0 20 0.000 0 0 -1 0 0 2
	 6497 5028 6657 5196
2 1 0 1 18 32 60 0 20 0.000 0 0 -1 0 0 2
	 6653 5085 6501 5139
2 3 0 1 0 31 70 0 20 0.000 0 0 -1 0 0 5
	 6237 4713 6100 4663 6175 4580 6312 4630 6237 4713
2 3 0 1 0 33 70 0 20 0.000 0 0 -1 0 0 5
	 6161 4861 6121 4847 6111 4998 6150 5012 6161 4861
2 1 0 1 0 32 55 0 20 0.000 0 0 -1 0 0 2
	 6706 5214 6111 4998
2 1 0 1 0 32 60 0 20 0.000 0 0 -1 0 0 2
	 6841 4823 6175 4580
-6
6 6744 4948 7014 5135
2 1 0 0 11 11 35 0 20 0.000 0 0 -1 0 0 11
	 6786 4948 6910 4989 6972 5031 6994 5072 7014 5114 6952 5135
	 6910 5135 6848 5114 6744 5072 6744 5031 6765 4969
2 1 0 0 11 15 34 0 20 0.000 0 0 -1 0 0 11
	 6786 4956 6905 4996 6966 5037 6995 5092 7004 5112 6953 5129
	 6910 5127 6869 5114 6749 5071 6750 5035 6763 4990
2 1 0 0 11 16 33 0 20 0.000 0 0 -1 0 0 11
	 6789 4963 6908 5003 6963 5043 6991 5099 6994 5109 6958 5123
	 6918 5122 6870 5110 6754 5067 6754 5037 6765 4998
2 1 0 0 11 17 32 0 20 0.000 0 0 -1 0 0 10
	 6788 4976 6904 5016 6953 5051 6987 5103 6957 5112 6918 5107
	 6876 5098 6760 5055 6762 5032 6768 5005
2 1 0 0 11 11 31 0 20 0.000 0 0 -1 0 0 8
	 6789 4988 6895 5027 6947 5061 6974 5097 6958 5099 6876 5087
	 6767 5045 6773 5012
2 1 0 0 11 3 31 0 20 0.000 0 0 -1 0 0 8
	 6788 5000 6894 5037 6947 5072 6964 5093 6945 5090 6881 5077
	 6771 5039 6779 5016
2 1 0 0 11 3 30 0 20 0.000 0 0 -1 0 0 8
	 6786 4998 6893 5036 6945 5071 6962 5092 6942 5088 6878 5076
	 6769 5037 6776 5016
2 1 0 0 11 32 29 0 20 0.000 0 0 -1 0 0 5
	 6786 5008 6892 5046 6952 5085 6883 5067 6776 5029
2 1 0 0 11 7 28 0 20 0.000 0 0 -1 0 0 5
	 6789 5018 6895 5056 6926 5072 6893 5061 6787 5024
-6
-6
2 5 0 1 0 -1 150 0 -1 0.000 0 0 -1 0 0 5
	0 BH1m.jpg
	 450 180 11700 180 11700 9179 450 9179 450 180
