%!PS-Adobe-2.0 EPSF-2.0
%%Title: heapmgr.dia
%%Creator: Dia v0.90
%%CreationDate: Thu Jan 30 19:53:48 2003
%%For: pascal
%%Magnification: 1.0000
%%Orientation: Portrait
%%BoundingBox: 0 0 696 213
%%Pages: 1
%%EndComments
%%BeginProlog
/cp {closepath} bind def
/c {curveto} bind def
/f {fill} bind def
/a {arc} bind def
/ef {eofill} bind def
/ex {exch} bind def
/gr {grestore} bind def
/gs {gsave} bind def
/sa {save} bind def
/rs {restore} bind def
/l {lineto} bind def
/m {moveto} bind def
/rm {rmoveto} bind def
/n {newpath} bind def
/s {stroke} bind def
/sh {show} bind def
/slc {setlinecap} bind def
/slj {setlinejoin} bind def
/slw {setlinewidth} bind def
/srgb {setrgbcolor} bind def
/rot {rotate} bind def
/sc {scale} bind def
/sd {setdash} bind def
/ff {findfont} bind def
/sf {setfont} bind def
/scf {scalefont} bind def
/sw {stringwidth pop} bind def
/tr {translate} bind def

/ellipsedict 8 dict def
ellipsedict /mtrx matrix put
/ellipse
{ ellipsedict begin
   /endangle exch def
   /startangle exch def
   /yrad exch def
   /xrad exch def
   /y exch def
   /x exch def   /savematrix mtrx currentmatrix def
   x y tr xrad yrad sc
   0 0 1 startangle endangle arc
   savematrix setmatrix
   end
} def

/mergeprocs {
dup length
3 -1 roll
dup
length
dup
5 1 roll
3 -1 roll
add
array cvx
dup
3 -1 roll
0 exch
putinterval
dup
4 2 roll
putinterval
} bind def
%%EndProlog

%%BeginSetup
%%EndSetup
28.346000 -28.346000 scale
4.460800 -12.550000 translate

1.000000 1.000000 1.000000 srgb
n 4.640800 5.100000 m 4.640800 7.000000 l 14.259200 7.000000 l 14.259200 5.100000 l f
0.100000 slw
[] 0 sd
[] 0 sd
0 slj
0.000000 0.000000 0.000000 srgb
n 4.640800 5.100000 m 4.640800 7.000000 l 14.259200 7.000000 l 14.259200 5.100000 l cp s
 [ /xi /xi /xi /xi /xi /xi /xi /xi /xi /xi /xi /xi /xi /xi /xi /xi
 /xi /xi /xi /xi /xi /xi /xi /xi /xi /xi /xi /xi /xi /xi /xi /xi
 /J /N /u /k /e /H /a /p /xi /xi /M /n /g /r /I /s
 /t /c /D /A /y /one /xi /xi /xi /xi /xi /xi /xi /xi /xi /xi
 /xi /xi /xi /xi /xi /xi /xi /xi /xi /xi /xi /xi /xi /xi /xi /xi
 /xi /xi /xi /xi /xi /xi /xi /xi /xi /xi /xi /xi /xi /xi /xi /xi
 /xi /xi /xi /xi /xi /xi /xi /xi /xi /xi /xi /xi /xi /xi /xi /xi
 /xi /xi /xi /xi /xi /xi /xi /xi /xi /xi /xi /xi /xi /xi /xi /xi
 /xi /xi /xi /xi /xi /xi /xi /xi /xi /xi /xi /xi /xi /xi /xi /xi
 /xi /xi /xi /xi /xi /xi /xi /xi /xi /xi /xi /xi /xi /xi /xi /xi
 /xi /xi /xi /xi /xi /xi /xi /xi /xi /xi /xi /xi /xi /xi /xi /xi
 /xi /xi /xi /xi /xi /xi /xi /xi /xi /xi /xi /xi /xi /xi /xi /xi
 /xi /xi /xi /xi /xi /xi /xi /xi /xi /xi /xi /xi /xi /xi /xi /xi
 /xi /xi /xi /xi /xi /xi /xi /xi /xi /xi /xi /xi /xi /xi /xi /xi
 /xi /xi /xi /xi /xi /xi /xi /xi /xi /xi /xi /xi /xi /xi /xi /xi
 /xi /xi /xi /xi /xi /xi /xi /xi /xi /xi /xi /xi /xi /xi /xi /xi
] /e0 exch def
/Courier_e0 undefinefont
/Courier_e0
  /Courier findfont
  dup length dict begin
  {1 index /FID ne {def} {pop pop} ifelse} forall
  /Encoding e0 def
  currentdict end
definefont pop
/Courier_e0 ff 0.800000 scf sf
( !"#$%$&'*&+&,$-) sw
2 div 9.450000 ex sub 6.246491 m ( !"#$%$&'*&+&,$-)
 gs 1 -1 sc sh gr
1.000000 1.000000 1.000000 srgb
n 9.881200 10.600000 m 9.881200 12.500000 l 20.018800 12.500000 l 20.018800 10.600000 l f
0.100000 slw
[] 0 sd
[] 0 sd
0 slj
0.000000 0.000000 0.000000 srgb
n 9.881200 10.600000 m 9.881200 12.500000 l 20.018800 12.500000 l 20.018800 10.600000 l cp s
/Courier_e0 ff 0.800000 scf sf
( !"#$.+/0&+1$2$/1) sw
2 div 14.950000 ex sub 11.746491 m ( !"#$.+/0&+1$2$/1)
 gs 1 -1 sc sh gr
1.000000 1.000000 1.000000 srgb
n -4.410800 10.600000 m -4.410800 12.500000 l 8.410800 12.500000 l 8.410800 10.600000 l f
0.100000 slw
[] 0 sd
[] 0 sd
0 slj
0.000000 0.000000 0.000000 srgb
n -4.410800 10.600000 m -4.410800 12.500000 l 8.410800 12.500000 l 8.410800 10.600000 l cp s
/Courier_e0 ff 0.800000 scf sf
( !"#$3--&4.+/0&+1$2$/1) sw
2 div 2.000000 ex sub 11.746491 m ( !"#$3--&4.+/0&+1$2$/1)
 gs 1 -1 sc sh gr
0.100000 slw
[] 0 sd
0 slj
0 slc
n 14.950000 10.600000 m 14.950000 9.250000 l 11.854600 9.250000 l 11.854600 7.000000 l s
[] 0 sd
0 slj
0 slc
n 11.854600 7.000000 m 12.094600 7.700000 l 11.854600 8.400000 l 11.614600 7.700000 l f
14.950000 11.196491 m /Courier_e0 ff 0.800000 scf sf
(+)
 gs 1 -1 sc sh gr
11.854600 7.596491 m (5)
 gs 1 -1 sc sh gr
0.100000 slw
[] 0 sd
0 slj
0 slc
n 2.000000 10.600000 m 2.000000 9.250000 l 7.045400 9.250000 l 7.045400 7.000000 l s
[] 0 sd
0 slj
0 slc
n 7.045400 7.000000 m 7.285400 7.700000 l 7.045400 8.400000 l 6.805400 7.700000 l f
2.000000 11.196491 m /Courier_e0 ff 0.800000 scf sf
(+)
 gs 1 -1 sc sh gr
7.045400 7.596491 m (5)
 gs 1 -1 sc sh gr
showpage
