%!PS-Adobe-2.0 EPSF-2.0
%%Title: vtable.dia
%%Creator: Dia v0.90
%%CreationDate: Thu Feb 27 21:05:49 2003
%%For: pascal
%%Magnification: 1.0000
%%Orientation: Portrait
%%BoundingBox: 0 0 710 363
%%Pages: 1
%%EndComments
%%BeginProlog
/cp {closepath} bind def
/c {curveto} bind def
/f {fill} bind def
/a {arc} bind def
/ef {eofill} bind def
/ex {exch} bind def
/gr {grestore} bind def
/gs {gsave} bind def
/sa {save} bind def
/rs {restore} bind def
/l {lineto} bind def
/m {moveto} bind def
/rm {rmoveto} bind def
/n {newpath} bind def
/s {stroke} bind def
/sh {show} bind def
/slc {setlinecap} bind def
/slj {setlinejoin} bind def
/slw {setlinewidth} bind def
/srgb {setrgbcolor} bind def
/rot {rotate} bind def
/sc {scale} bind def
/sd {setdash} bind def
/ff {findfont} bind def
/sf {setfont} bind def
/scf {scalefont} bind def
/sw {stringwidth pop} bind def
/tr {translate} bind def

/ellipsedict 8 dict def
ellipsedict /mtrx matrix put
/ellipse
{ ellipsedict begin
   /endangle exch def
   /startangle exch def
   /yrad exch def
   /xrad exch def
   /y exch def
   /x exch def   /savematrix mtrx currentmatrix def
   x y tr xrad yrad sc
   0 0 1 startangle endangle arc
   savematrix setmatrix
   end
} def

/mergeprocs {
dup length
3 -1 roll
dup
length
dup
5 1 roll
3 -1 roll
add
array cvx
dup
3 -1 roll
0 exch
putinterval
dup
4 2 roll
putinterval
} bind def
%%EndProlog

%%BeginSetup
%%EndSetup
28.346000 -28.346000 scale
2.000000 -16.450000 translate

1.000000 1.000000 1.000000 srgb
n 12.890000 10.600000 m 12.890000 16.400000 l 22.990000 16.400000 l 22.990000 10.600000 l f
0.100000 slw
[] 0 sd
[] 0 sd
0 slj
0.000000 0.000000 0.000000 srgb
n 12.890000 10.600000 m 12.890000 16.400000 l 22.990000 16.400000 l 22.990000 10.600000 l cp s
1.000000 1.000000 1.000000 srgb
n 14.550000 12.100000 m 14.550000 13.200000 l 22.350000 13.200000 l 22.350000 12.100000 l f
0.100000 slw
[] 0 sd
[] 0 sd
0 slj
0.000000 0.000000 0.000000 srgb
n 14.550000 12.100000 m 14.550000 13.200000 l 22.350000 13.200000 l 22.350000 12.100000 l cp s
1.000000 1.000000 1.000000 srgb
n 13.290000 12.120000 m 13.290000 13.220000 l 14.550000 13.220000 l 14.550000 12.120000 l f
0.100000 slw
[] 0 sd
[] 0 sd
0 slj
0.000000 0.000000 0.000000 srgb
n 13.290000 12.120000 m 13.290000 13.220000 l 14.550000 13.220000 l 14.550000 12.120000 l cp s
14.950000 12.900000 m  [ /xi /xi /xi /xi /xi /xi /xi /xi /xi /xi /xi /xi /xi /xi /xi /xi
 /xi /xi /xi /xi /xi /xi /xi /xi /xi /xi /xi /xi /xi /xi /xi /xi
 /i /n /t /space /f /o /parenleft /a /xi /xi /parenright /b /r /v /l /e
 /colon /B /A /c /s /xi /xi /xi /xi /xi /xi /xi /xi /xi /xi /xi
 /xi /xi /xi /xi /xi /xi /xi /xi /xi /xi /xi /xi /xi /xi /xi /xi
 /xi /xi /xi /xi /xi /xi /xi /xi /xi /xi /xi /xi /xi /xi /xi /xi
 /xi /xi /xi /xi /xi /xi /xi /xi /xi /xi /xi /xi /xi /xi /xi /xi
 /xi /xi /xi /xi /xi /xi /xi /xi /xi /xi /xi /xi /xi /xi /xi /xi
 /xi /xi /xi /xi /xi /xi /xi /xi /xi /xi /xi /xi /xi /xi /xi /xi
 /xi /xi /xi /xi /xi /xi /xi /xi /xi /xi /xi /xi /xi /xi /xi /xi
 /xi /xi /xi /xi /xi /xi /xi /xi /xi /xi /xi /xi /xi /xi /xi /xi
 /xi /xi /xi /xi /xi /xi /xi /xi /xi /xi /xi /xi /xi /xi /xi /xi
 /xi /xi /xi /xi /xi /xi /xi /xi /xi /xi /xi /xi /xi /xi /xi /xi
 /xi /xi /xi /xi /xi /xi /xi /xi /xi /xi /xi /xi /xi /xi /xi /xi
 /xi /xi /xi /xi /xi /xi /xi /xi /xi /xi /xi /xi /xi /xi /xi /xi
 /xi /xi /xi /xi /xi /xi /xi /xi /xi /xi /xi /xi /xi /xi /xi /xi
] /e0 exch def
/Courier_e0 undefinefont
/Courier_e0
  /Courier findfont
  dup length dict begin
  {1 index /FID ne {def} {pop pop} ifelse} forall
  /Encoding e0 def
  currentdict end
definefont pop
/Courier_e0 ff 0.800000 scf sf
( !"#$%%& !"#'*#)
 gs 1 -1 sc sh gr
1.000000 1.000000 1.000000 srgb
n 14.550000 13.420000 m 14.550000 14.520000 l 22.350000 14.520000 l 22.350000 13.420000 l f
0.100000 slw
[] 0 sd
[] 0 sd
0 slj
0.000000 0.000000 0.000000 srgb
n 14.550000 13.420000 m 14.550000 14.520000 l 22.350000 14.520000 l 22.350000 13.420000 l cp s
1.000000 1.000000 1.000000 srgb
n 13.290000 13.420000 m 13.290000 14.520000 l 14.550000 14.520000 l 14.550000 13.420000 l f
0.100000 slw
[] 0 sd
[] 0 sd
0 slj
0.000000 0.000000 0.000000 srgb
n 13.290000 13.420000 m 13.290000 14.520000 l 14.550000 14.520000 l 14.550000 13.420000 l cp s
14.950000 14.220000 m /Courier_e0 ff 0.800000 scf sf
( !"#+',&*)
 gs 1 -1 sc sh gr
1.000000 1.000000 1.000000 srgb
n 14.550000 14.720000 m 14.550000 15.820000 l 22.350000 15.820000 l 22.350000 14.720000 l f
0.100000 slw
[] 0 sd
[] 0 sd
0 slj
0.000000 0.000000 0.000000 srgb
n 14.550000 14.720000 m 14.550000 15.820000 l 22.350000 15.820000 l 22.350000 14.720000 l cp s
1.000000 1.000000 1.000000 srgb
n 13.290000 14.720000 m 13.290000 15.820000 l 14.550000 15.820000 l 14.550000 14.720000 l f
0.100000 slw
[] 0 sd
[] 0 sd
0 slj
0.000000 0.000000 0.000000 srgb
n 13.290000 14.720000 m 13.290000 15.820000 l 14.550000 15.820000 l 14.550000 14.720000 l cp s
14.950000 15.520000 m /Courier_e0 ff 0.800000 scf sf
( !"#$%%&*)
 gs 1 -1 sc sh gr
1.000000 1.000000 1.000000 srgb
n 12.890000 10.620000 m 12.890000 11.700000 l 22.990000 11.700000 l 22.990000 10.620000 l f
0.100000 slw
[] 0 sd
[] 0 sd
0 slj
0.000000 0.000000 0.000000 srgb
n 12.890000 10.620000 m 12.890000 11.700000 l 22.990000 11.700000 l 22.990000 10.620000 l cp s
/Courier_e0 ff 0.800000 scf sf
(-"'+./0#1) sw
2 div 15.650000 ex sub 11.300000 m (-"'+./0#1)
 gs 1 -1 sc sh gr
1.000000 1.000000 1.000000 srgb
n 12.890000 3.720000 m 12.890000 8.150000 l 22.990000 8.150000 l 22.990000 3.720000 l f
0.100000 slw
[] 0 sd
[] 0 sd
0 slj
0.000000 0.000000 0.000000 srgb
n 12.890000 3.720000 m 12.890000 8.150000 l 22.990000 8.150000 l 22.990000 3.720000 l cp s
1.000000 1.000000 1.000000 srgb
n 14.550000 5.220000 m 14.550000 6.320000 l 22.350000 6.320000 l 22.350000 5.220000 l f
0.100000 slw
[] 0 sd
[] 0 sd
0 slj
0.000000 0.000000 0.000000 srgb
n 14.550000 5.220000 m 14.550000 6.320000 l 22.350000 6.320000 l 22.350000 5.220000 l cp s
1.000000 1.000000 1.000000 srgb
n 13.290000 5.220000 m 13.290000 6.320000 l 14.550000 6.320000 l 14.550000 5.220000 l f
0.100000 slw
[] 0 sd
[] 0 sd
0 slj
0.000000 0.000000 0.000000 srgb
n 13.290000 5.220000 m 13.290000 6.320000 l 14.550000 6.320000 l 14.550000 5.220000 l cp s
14.950000 6.020000 m /Courier_e0 ff 0.800000 scf sf
( !"#$%%& !"#'*#)
 gs 1 -1 sc sh gr
1.000000 1.000000 1.000000 srgb
n 14.550000 6.540000 m 14.550000 7.640000 l 22.350000 7.640000 l 22.350000 6.540000 l f
0.100000 slw
[] 0 sd
[] 0 sd
0 slj
0.000000 0.000000 0.000000 srgb
n 14.550000 6.540000 m 14.550000 7.640000 l 22.350000 7.640000 l 22.350000 6.540000 l cp s
1.000000 1.000000 1.000000 srgb
n 13.290000 6.540000 m 13.290000 7.640000 l 14.550000 7.640000 l 14.550000 6.540000 l f
0.100000 slw
[] 0 sd
[] 0 sd
0 slj
0.000000 0.000000 0.000000 srgb
n 13.290000 6.540000 m 13.290000 7.640000 l 14.550000 7.640000 l 14.550000 6.540000 l cp s
14.950000 7.340000 m /Courier_e0 ff 0.800000 scf sf
( !"#$%%&*)
 gs 1 -1 sc sh gr
1.000000 1.000000 1.000000 srgb
n 12.890000 3.720000 m 12.890000 4.800000 l 22.990000 4.800000 l 22.990000 3.720000 l f
0.100000 slw
[] 0 sd
[] 0 sd
0 slj
0.000000 0.000000 0.000000 srgb
n 12.890000 3.720000 m 12.890000 4.800000 l 22.990000 4.800000 l 22.990000 3.720000 l cp s
/Courier_e0 ff 0.800000 scf sf
(-"'+./0#2) sw
2 div 15.650000 ex sub 4.420000 m (-"'+./0#2)
 gs 1 -1 sc sh gr
1.000000 1.000000 1.000000 srgb
n -1.930000 3.720000 m -1.930000 8.150000 l 7.210000 8.150000 l 7.210000 3.720000 l f
0.100000 slw
[] 0 sd
[] 0 sd
0 slj
0.000000 0.000000 0.000000 srgb
n -1.930000 3.720000 m -1.930000 8.150000 l 7.210000 8.150000 l 7.210000 3.720000 l cp s
1.000000 1.000000 1.000000 srgb
n -1.250000 5.220000 m -1.250000 6.320000 l 6.550000 6.320000 l 6.550000 5.220000 l f
0.100000 slw
[] 0 sd
[] 0 sd
0 slj
0.000000 0.000000 0.000000 srgb
n -1.250000 5.220000 m -1.250000 6.320000 l 6.550000 6.320000 l 6.550000 5.220000 l cp s
-0.850000 6.020000 m /Courier_e0 ff 0.800000 scf sf
( !"#$%%& !"#'*#)
 gs 1 -1 sc sh gr
1.000000 1.000000 1.000000 srgb
n -1.250000 6.540000 m -1.250000 7.640000 l 6.550000 7.640000 l 6.550000 6.540000 l f
0.100000 slw
[] 0 sd
[] 0 sd
0 slj
0.000000 0.000000 0.000000 srgb
n -1.250000 6.540000 m -1.250000 7.640000 l 6.550000 7.640000 l 6.550000 6.540000 l cp s
-0.850000 7.340000 m /Courier_e0 ff 0.800000 scf sf
( !"#$%%&*)
 gs 1 -1 sc sh gr
1.000000 1.000000 1.000000 srgb
n -1.950000 3.720000 m -1.950000 4.800000 l 7.190000 4.800000 l 7.190000 3.720000 l f
0.100000 slw
[] 0 sd
[] 0 sd
0 slj
0.000000 0.000000 0.000000 srgb
n -1.950000 3.720000 m -1.950000 4.800000 l 7.190000 4.800000 l 7.190000 3.720000 l cp s
/Courier_e0 ff 0.800000 scf sf
(3.'44#2) sw
2 div 0.150000 ex sub 4.450000 m (3.'44#2)
 gs 1 -1 sc sh gr
0.100000 slw
[] 0 sd
[] 0 sd
0 slc
n 13.290000 5.770000 m 6.550000 5.770000 l s
0 slj
n 7.350000 5.370000 m 6.550000 5.770000 l 7.350000 6.170000 l f
0.100000 slw
[] 0 sd
[] 0 sd
0 slc
n 13.290000 7.090000 m 6.550000 7.090000 l s
0 slj
n 7.350000 6.690000 m 6.550000 7.090000 l 7.350000 7.490000 l f
1.000000 1.000000 1.000000 srgb
n -1.930000 11.920000 m -1.930000 16.350000 l 7.210000 16.350000 l 7.210000 11.920000 l f
0.100000 slw
[] 0 sd
[] 0 sd
0 slj
0.000000 0.000000 0.000000 srgb
n -1.930000 11.920000 m -1.930000 16.350000 l 7.210000 16.350000 l 7.210000 11.920000 l cp s
1.000000 1.000000 1.000000 srgb
n -1.210000 13.420000 m -1.210000 14.520000 l 6.590000 14.520000 l 6.590000 13.420000 l f
0.100000 slw
[] 0 sd
[] 0 sd
0 slj
0.000000 0.000000 0.000000 srgb
n -1.210000 13.420000 m -1.210000 14.520000 l 6.590000 14.520000 l 6.590000 13.420000 l cp s
-0.810000 14.220000 m /Courier_e0 ff 0.800000 scf sf
( !"#+',&*)
 gs 1 -1 sc sh gr
1.000000 1.000000 1.000000 srgb
n -1.210000 14.740000 m -1.210000 15.840000 l 6.590000 15.840000 l 6.590000 14.740000 l f
0.100000 slw
[] 0 sd
[] 0 sd
0 slj
0.000000 0.000000 0.000000 srgb
n -1.210000 14.740000 m -1.210000 15.840000 l 6.590000 15.840000 l 6.590000 14.740000 l cp s
-0.810000 15.540000 m /Courier_e0 ff 0.800000 scf sf
( !"#$%%&*)
 gs 1 -1 sc sh gr
1.000000 1.000000 1.000000 srgb
n -1.930000 11.920000 m -1.930000 13.000000 l 7.210000 13.000000 l 7.210000 11.920000 l f
0.100000 slw
[] 0 sd
[] 0 sd
0 slj
0.000000 0.000000 0.000000 srgb
n -1.930000 11.920000 m -1.930000 13.000000 l 7.210000 13.000000 l 7.210000 11.920000 l cp s
/Courier_e0 ff 0.800000 scf sf
(3.'44#1) sw
2 div 0.190000 ex sub 12.650000 m (3.'44#1)
 gs 1 -1 sc sh gr
0.100000 slw
[] 0 sd
[] 0 sd
0 slc
n 13.290000 13.970000 m 6.590000 13.970000 l s
0 slj
n 7.390000 13.570000 m 6.590000 13.970000 l 7.390000 14.370000 l f
0.100000 slw
[] 0 sd
[] 0 sd
0 slc
n 13.290000 15.270000 m 6.590000 15.290000 l s
0 slj
n 7.388802 14.887614 m 6.590000 15.290000 l 7.391190 15.687610 l f
0.100000 slw
[] 0 sd
[] 0 sd
0 slc
n 26.840970 -22.125018 37.340622 37.340622 111.278497 130.379389 ellipse s
0 slj
n 3.518556 6.533568 m 2.650000 6.320000 l 3.000279 7.142985 l f
0.100000 slw
[] 0 sd
0 slj
0 slc
n 2.640000 8.150000 m 2.640000 9.250000 l 2.640000 9.250000 l 2.640000 11.920000 l s
0 slj
1.000000 1.000000 1.000000 srgb
n 3.040000 8.950000 m 2.640000 8.150000 l 2.240000 8.950000 l f
0.100000 slw
[] 0 sd
0 slj
0.000000 0.000000 0.000000 srgb
n 3.040000 8.950000 m 2.640000 8.150000 l 2.240000 8.950000 l cp s
showpage
