#FIG 3.2
Landscape
Center
Metric
A4      
100.00
Single
-2
1200 2
6 2430 2880 3420 3870
1 3 0 2 0 7 50 0 -1 0.000 1 0.0000 2925 3375 450 450 2925 3375 3375 3375
4 1 0 50 0 16 24 0.0000 4 270 195 2925 3510 1\001
-6
6 4230 2880 5220 3870
1 3 0 2 0 7 50 0 -1 0.000 1 0.0000 4725 3375 450 450 4725 3375 5175 3375
4 1 0 50 0 16 24 0.0000 4 270 195 4725 3510 2\001
-6
6 6030 2880 7020 3870
1 3 0 2 0 7 50 0 -1 0.000 1 0.0000 6525 3375 450 450 6525 3375 6975 3375
4 1 0 50 0 16 24 0.0000 4 270 195 6525 3510 3\001
-6
2 1 0 2 0 7 50 0 -1 0.000 0 0 -1 1 0 2
	1 1 2.00 180.00 240.00
	 3375 3375 4275 3375
2 1 0 2 0 7 50 0 -1 0.000 0 0 -1 1 0 2
	1 1 2.00 180.00 240.00
	 5175 3375 6075 3375
