%!PS-Adobe-3.0 EPSF-3.0 
%%BoundingBox: 0 0 805 558
%%Pages: 0
%%Creator: Sun Microsystems, Inc.
%%Title: none
%%CreationDate: none
%%LanguageLevel: 2
%%EndComments
%%BeginProlog
%%BeginResource: SDRes
/b4_inc_state save def
/dict_count countdictstack def
/op_count count 1 sub def
userdict begin
0 setgray 0 setlinecap 1 setlinewidth 0 setlinejoin 10 setmiterlimit[] 0 setdash newpath
/languagelevel where {pop languagelevel 1 ne {false setstrokeadjust false setoverprint} if} if
/bdef {bind def} bind def
/c {setrgbcolor} bdef
/l {neg lineto} bdef
/rl {neg rlineto} bdef
/cl {currentlinewidth currentdash currentlinecap 2 setlinecap} bdef
/lc {setlinecap} bdef
/lw {setlinewidth} bdef
/ld {setdash} bdef
/m {neg moveto} bdef
/ct {6 2 roll neg 6 2 roll neg 6 2 roll neg curveto} bdef
/r {rotate} bdef
/t {neg translate} bdef
/s {scale} bdef
/sw {show} bdef
/gs {gsave} bdef
/gr {grestore} bdef
/f {findfont dup length dict begin
{1 index /FID ne {def} {pop pop} ifelse} forall /Encoding ISOLatin1Encoding def
currentdict end /NFont exch definefont pop /NFont findfont} bdef
/p {closepath} bdef
/sf {scalefont setfont} bdef
/ef {eofill}bdef
/pc {closepath stroke}bdef
/ps {stroke}bdef
/pum {matrix currentmatrix}bdef
/pom {setmatrix}bdef
/bs {/aString exch def /nXOfs exch def /nWidth exch def currentpoint nXOfs 0 rmoveto pum nWidth aString stringwidth pop div 1 scale aString show pom moveto} bdef
%%EndResource
%%EndProlog
%%BeginSetup
%%EndSetup
%%Page: 1 1
%%BeginPageSetup
%%EndPageSetup
pum
0.28345 0.28339 s 
0 -1969 t 
gs
-63.5 -63.5 t 
63.5 63.5 m 2903.4 63.5 l 2903.4 2032.4 l 63.5 2032.4 l 63.5 63.5 l
eoclip newpath
gs
63.5 63.5 m 2903.4 63.5 l 2903.4 2032.4 l 63.5 2032.4 l 63.5 63.5 l
eoclip newpath
gs
63.5 63.5 t 
0 0 m 2839.9 0 l 2839.9 1968.9 l 0 1968.9 l 0 0 l eoclip newpath
gs
gr
0.003 0.003 0.003 c 191.8 1735.1 m  2812 1735.1 l  ps
191.8 1564.3 m  2812 1564.3 l  ps
191.8 1393.5 m  2812 1393.5 l  ps
191.8 1222.7 m  2812 1222.7 l  ps
191.8 1051.9 m  2812 1051.9 l  ps
191.8 881 m  2812 881 l  ps
191.8 710.2 m  2812 710.2 l  ps
191.8 539.39999 m  2812 539.39999 l  ps
191.8 368.6 m  2812 368.6 l  ps
191.8 197.7 m  2812 197.7 l  ps
191.8 1735.1 m  2812 1735.1 l  ps
191.8 1735.1 m  2812 1735.1 l  ps
191.8 1750.1 m  191.8 1735.1 l  ps
gs
pum
230.2 1759.5 t 
3.3 41.4 m  3.3 8.7 l  9.8 8.7 l  17.6 31.8 l 
18.3 34 18.8 35.6 19.2 36.7 ct 19.6 35.5 20.1 33.8 20.9 31.5 ct 
28.7 8.7 l  34.6 8.7 l  34.6 41.4 l  30.5 41.4 l 
30.5 14 l  20.9 41.4 l  17 41.4 l  7.5 13.5 l 
7.5 41.4 l  p ef
pom
pum
267.5 1759.5 t 
19.2 33.8 m  23.3 34.3 l  22.7 36.7 21.5 38.6 19.7 39.9 ct 
17.9 41.3 15.6 41.9 12.9 41.9 ct 9.4 41.9 6.6 40.9 4.6 38.7 ct 
2.6 36.6 1.6 33.6 1.6 29.7 ct 1.6 25.7 2.6 22.7 4.7 20.5 ct 
6.7 18.19999 9.4 17.1 12.7 17.1 ct 15.9 17.1 18.5 18.19999 20.5 20.4 ct 
22.5 22.5 23.5 25.6 23.5 29.4 ct 23.5 29.7 23.5 30.1 23.5 30.5 ct 
5.7 30.5 l  5.9 33.2 6.6 35.1 7.9 36.6 ct 
9.3 38 10.9 38.6 13 38.6 ct 14.4 38.6 15.6 38.2 16.69999 37.5 ct 
17.69999 36.7 l  18.5 35.5 l  p
6 27.2 m  19.2 27.2 l  19 25.2 18.5 23.8 17.69999 22.8 ct 
16.4 21.2 14.8 20.5 12.7 20.5 ct 10.9 20.5 9.3 21 8 22.3 ct 
6.8 23.5 l  6.1 25.1 l  p ef
pom
pum
293.69999 1759.5 t 
11.7 37.8 m  12.3 41.4 l  11.1 41.6 10.1 41.7 9.3 41.7 ct 
7.8 41.7 6.6 41.4 5.8 41 ct 5.1 40.5 4.4 40 4.2 39.2 ct 
3.8 38.4 3.7 36.89999 3.7 34.5 ct 3.7 20.7 l 
0.7 20.7 l  0.7 17.6 l  3.7 17.6 l  3.7 11.8 l 
7.6 9.4 l  7.6 17.6 l  11.7 17.6 l  11.7 20.7 l 
7.6 20.7 l  7.6 34.7 l  7.6 35.89999 7.7 36.6 7.9 36.89999 ct 
8 37.2 8.3 37.5 8.59999 37.7 ct 8.9 37.89999 9.4 38 9.9 38 ct 
10.4 38 l  10.9 37.89999 l  p ef
pom
pum
306.4 1759.5 t 
2.9 41.4 m  2.9 8.7 l  6.9 8.7 l  6.9 20.4 l 
8.8 18.19999 11.2 17.1 14.1 17.1 ct 15.8 17.1 17.4 17.4 18.6 18.19999 ct 
19.9 18.8 20.8 19.8 21.4 21 ct 22 22.2 22.3 24 22.3 26.3 ct 
22.3 41.4 l  18.3 41.4 l  18.3 26.3 l  18.3 24.3 17.8 22.9 16.9 21.9 ct 
16.1 21 14.8 20.6 13.2 20.6 ct 12 20.6 10.9 20.9 9.8 21.5 ct 
8.8 22.1 8.09999 22.9 7.6 24 ct 7.2 25 6.9 26.5 6.9 28.4 ct 
6.9 41.4 l  p ef
pom
pum
331.8 1759.5 t 
1.4 29.5 m  1.4 25.1 2.6 21.8 5.1 19.7 ct 
7.1 18 9.7 17.1 12.6 17.1 ct 15.8 17.1 18.5 18.19999 20.6 20.3 ct 
22.7 22.5 23.7 25.4 23.7 29.2 ct 23.7 32.3 23.2 34.7 22.3 36.39999 ct 
21.4 38.1 20 39.5 18.3 40.5 ct 16.5 41.4 14.6 41.9 12.6 41.9 ct 
9.2 41.9 6.5 40.9 4.5 38.7 ct 2.4 36.6 l 
1.4 33.6 l  p
5.5 29.5 m  5.5 32.6 6.3 34.8 7.6 36.3 ct 
8.8 37.89999 10.6 38.6 12.6 38.6 ct 14.6 38.6 16.3 37.89999 17.5 36.3 ct 
18.9 34.8 19.6 32.5 19.6 29.4 ct 19.6 26.4 18.9 24.2 17.5 22.8 ct 
16.19999 21.2 14.5 20.5 12.6 20.5 ct 10.6 20.5 8.8 21.2 7.6 22.7 ct 
6.3 24.2 l  5.5 26.5 l  p ef
pom
pum
357.2 1759.5 t 
18.4 41.4 m  18.4 38.4 l  16.8 40.8 14.6 41.9 11.7 41.9 ct 
9.8 41.9 8 41.4 6.5 40.3 ct 4.9 39.3 3.6 37.89999 2.8 36 ct 
1.9 34.1 1.5 32 1.5 29.5 ct 1.5 27.2 1.9 25 2.7 23.1 ct 
3.4 21.2 4.6 19.6 6.2 18.6 ct 7.8 17.6 9.6 17.1 11.5 17.1 ct 
13 17.1 14.2 17.4 15.3 18 ct 16.4 18.6 17.4 19.4 18.1 20.4 ct 
18.1 8.7 l  22 8.7 l  22 41.4 l  p
5.6 29.5 m  5.6 32.6 6.3 34.8 7.6 36.39999 ct 
8.8 37.89999 10.3 38.6 12 38.6 ct 13.9 38.6 15.3 37.89999 16.5 36.5 ct 
17.8 35 18.4 32.8 18.4 29.9 ct 18.4 26.6 17.8 24.2 16.5 22.8 ct 
15.2 21.2 13.7 20.5 11.9 20.5 ct 10.1 20.5 8.7 21.2 7.4 22.7 ct 
6.2 24.1 l  5.6 26.4 l  p ef
pom
pum
382.6 1759.5 t 
4.2 41.4 m  4.2 8.7 l  8.59999 8.7 l  8.59999 41.4 l 
p ef
pom
pum
395.3 1759.5 t 
2.9 41.4 m  2.9 17.6 l  6.5 17.6 l  6.5 21 l 
8.3 18.5 10.9 17.1 14.1 17.1 ct 15.5 17.1 16.9 17.4 18.1 17.9 ct 
19.3 18.4 20.2 19.1 20.7 19.9 ct 21.4 20.7 21.8 21.8 22 22.9 ct 
22.1 23.6 22.2 25 22.2 26.8 ct 22.2 41.4 l 
18.19999 41.4 l  18.19999 27 l  18.19999 25.3 18.1 24 17.69999 23.3 ct 
17.4 22.5 16.9 21.8 16.1 21.3 ct 15.2 20.8 14.3 20.6 13.2 20.6 ct 
11.6 20.6 10 21.1 8.8 22.2 ct 7.6 23.3 6.9 25.4 6.9 28.4 ct 
6.9 41.4 l  p ef
pom
pum
420.7 1759.5 t 
9.5 41.4 m  0.5 17.6 l  4.7 17.6 l  9.8 31.9 l 
10.4 33.39999 10.9 35 11.4 36.7 ct 11.7 35.39999 12.2 33.89999 12.9 32.1 ct 
18.1 17.6 l  22.3 17.6 l  13.3 41.4 l  p ef
pom
pum
230.2 1810.3 t 
1.4 29.5 m  1.4 25.1 2.6 21.8 5.1 19.7 ct 
7.1 18 9.7 17.1 12.6 17.1 ct 15.8 17.1 18.5 18.19999 20.6 20.3 ct 
22.7 22.5 23.7 25.4 23.7 29.2 ct 23.7 32.3 23.2 34.7 22.3 36.39999 ct 
21.4 38.1 20 39.5 18.3 40.5 ct 16.5 41.4 14.6 41.9 12.6 41.9 ct 
9.2 41.9 6.5 40.9 4.5 38.7 ct 2.4 36.6 l 
1.4 33.6 l  p
5.5 29.5 m  5.5 32.6 6.3 34.8 7.6 36.3 ct 
8.8 37.89999 10.6 38.6 12.6 38.6 ct 14.6 38.6 16.3 37.89999 17.5 36.3 ct 
18.9 34.8 19.6 32.5 19.6 29.4 ct 19.6 26.4 18.9 24.2 17.5 22.8 ct 
16.19999 21.2 14.5 20.5 12.6 20.5 ct 10.6 20.5 8.8 21.2 7.6 22.7 ct 
6.3 24.2 l  5.5 26.5 l  p ef
pom
pum
255.6 1810.3 t 
18.5 32.7 m  22.4 33.2 l  21.9 35.89999 20.8 38.1 19.1 39.6 ct 
17.3 41.2 15.1 41.9 12.5 41.9 ct 9.2 41.9 6.6 40.9 4.6 38.8 ct 
2.7 36.6 1.7 33.6 1.7 29.6 ct 1.7 27.1 2.1 24.8 3 22.9 ct 
3.8 20.9 5.1 19.6 6.8 18.5 ct 8.59999 17.6 10.5 17.1 12.5 17.1 ct 
15.1 17.1 17.19999 17.69999 18.8 19.1 ct 20.5 20.4 21.6 22.2 22 24.6 ct 
18.1 25.2 l  17.69999 23.7 17.1 22.4 16.1 21.7 ct 
15.2 20.8 14.1 20.5 12.7 20.5 ct 10.7 20.5 9 21.1 7.7 22.6 ct 
6.5 24 5.8 26.3 5.8 29.5 ct 5.8 32.7 6.5 35 7.6 36.5 ct 
8.9 37.89999 10.5 38.6 12.4 38.6 ct 14.1 38.6 15.3 38.1 16.4 37.1 ct 
17.4 36.2 l  18.19999 34.8 l  p ef
pom
pum
278.5 1810.3 t 
18.5 38.5 m  16.9 39.7 15.5 40.6 14.1 41.2 ct 
12.8 41.7 11.2 41.9 9.7 41.9 ct 7.1 41.9 5.1 41.3 3.7 40 ct 
2.2 38.8 1.6 37.1 1.6 35.1 ct 1.6 33.89999 1.8 32.89999 2.3 31.9 ct 
2.9 31 3.6 30.2 4.4 29.6 ct 5.3 29.1 6.3 28.6 7.4 28.3 ct 
8.09999 28.1 9.3 27.9 10.9 27.7 ct 14.1 27.3 16.5 26.9 18.1 26.3 ct 
18.1 25.8 18.1 25.4 18.1 25.2 ct 18.1 23.7 17.69999 22.5 17 21.8 ct 
16 20.9 14.4 20.5 12.4 20.5 ct 10.5 20.5 9.09999 20.7 8.2 21.5 ct 
7.3 22.1 6.6 23.3 6.2 25 ct 2.2 24.4 l 
2.6 22.8 3.2 21.4 4 20.4 ct 4.8 19.3 6 18.5 7.6 18 ct 
9.09999 17.4 10.9 17.1 13 17.1 ct 15 17.1 16.6 17.4 17.9 17.8 ct 
19.2 18.3 20.1 18.9 20.7 19.6 ct 21.3 20.4 21.8 21.3 21.9 22.4 ct 
22.1 23 22.1 24.3 22.1 26.1 ct 22.1 31.5 l 
22.1 35.2 22.2 37.6 22.4 38.5 ct 22.6 39.5 22.9 40.5 23.4 41.4 ct 
19.2 41.4 l  18.8 40.5 l  18.5 39.6 l  p
18.1 29.4 m  16.6 30.1 14.4 30.5 11.5 31 ct 
9.8 31.3 8.7 31.6 8 31.8 ct 7.3 32.1 6.8 32.6 6.5 33.1 ct 
6 33.7 5.8 34.3 5.8 35 ct 5.8 36.1 6.3 37 7.1 37.7 ct 
7.9 38.4 9.09999 38.8 10.7 38.8 ct 12.2 38.8 13.6 38.4 14.8 37.8 ct 
16 37 16.9 36.1 17.4 34.89999 ct 17.9 34.1 18.1 32.7 18.1 30.9 ct 
p ef
pom
pum
303.9 1810.3 t 
11.7 37.8 m  12.3 41.4 l  11.1 41.6 10.1 41.7 9.3 41.7 ct 
7.8 41.7 6.6 41.4 5.8 41 ct 5.1 40.5 4.4 40 4.2 39.2 ct 
3.8 38.4 3.7 36.89999 3.7 34.5 ct 3.7 20.7 l 
0.7 20.7 l  0.7 17.6 l  3.7 17.6 l  3.7 11.8 l 
7.6 9.4 l  7.6 17.6 l  11.7 17.6 l  11.7 20.7 l 
7.6 20.7 l  7.6 34.7 l  7.6 35.89999 7.7 36.6 7.9 36.89999 ct 
8 37.2 8.3 37.5 8.59999 37.7 ct 8.9 37.89999 9.4 38 9.9 38 ct 
10.4 38 l  10.9 37.89999 l  p ef
pom
pum
316.6 1810.3 t 
3 13.2 m  3 8.7 l  7 8.7 l  7 13.2 l  p
3 41.4 m  3 17.6 l  7 17.6 l  7 41.4 l  p ef
pom
pum
326.7 1810.3 t 
1.4 29.5 m  1.4 25.1 2.6 21.8 5.1 19.7 ct 
7.1 18 9.7 17.1 12.6 17.1 ct 15.8 17.1 18.5 18.19999 20.6 20.3 ct 
22.7 22.5 23.7 25.4 23.7 29.2 ct 23.7 32.3 23.2 34.7 22.3 36.39999 ct 
21.4 38.1 20 39.5 18.3 40.5 ct 16.5 41.4 14.6 41.9 12.6 41.9 ct 
9.2 41.9 6.5 40.9 4.5 38.7 ct 2.4 36.6 l 
1.4 33.6 l  p
5.5 29.5 m  5.5 32.6 6.3 34.8 7.6 36.3 ct 
8.8 37.89999 10.6 38.6 12.6 38.6 ct 14.6 38.6 16.3 37.89999 17.5 36.3 ct 
18.9 34.8 19.6 32.5 19.6 29.4 ct 19.6 26.4 18.9 24.2 17.5 22.8 ct 
16.19999 21.2 14.5 20.5 12.6 20.5 ct 10.6 20.5 8.8 21.2 7.6 22.7 ct 
6.3 24.2 l  5.5 26.5 l  p ef
pom
pum
352.1 1810.3 t 
2.9 41.4 m  2.9 17.6 l  6.5 17.6 l  6.5 21 l 
8.3 18.5 10.9 17.1 14.1 17.1 ct 15.5 17.1 16.9 17.4 18.1 17.9 ct 
19.3 18.4 20.2 19.1 20.7 19.9 ct 21.4 20.7 21.8 21.8 22 22.9 ct 
22.1 23.6 22.2 25 22.2 26.8 ct 22.2 41.4 l 
18.19999 41.4 l  18.19999 27 l  18.19999 25.3 18.1 24 17.69999 23.3 ct 
17.4 22.5 16.9 21.8 16.1 21.3 ct 15.2 20.8 14.3 20.6 13.2 20.6 ct 
11.6 20.6 10 21.1 8.8 22.2 ct 7.6 23.3 6.9 25.4 6.9 28.4 ct 
6.9 41.4 l  p ef
pom
gr
482.9 1750.1 m  482.9 1735.1 l  ps
gs
pum
518.6 1759.5 t 
3.5 41.4 m  3.5 8.7 l  18.1 8.7 l  20.9 8.7 23.2 8.9 24.7 9.5 ct 
26.2 10.1 27.4 11.1 28.3 12.6 ct 29.3 14.1 29.7 15.8 29.7 17.5 ct 
29.7 19.9 29 21.8 27.4 23.4 ct 26 25 23.6 26.1 20.5 26.5 ct 
21.7 27.1 22.5 27.6 23.1 28.1 ct 24.4 29.3 25.6 30.7 26.7 32.5 ct 
32.39999 41.4 l  27 41.4 l  22.6 34.6 l  21.3 32.7 20.3 31.1 19.5 30.1 ct 
18.6 29 17.9 28.3 17.3 27.9 ct 16.6 27.4 16 27.2 15.2 27 ct 
14.8 26.9 14 26.9 12.9 26.9 ct 7.8 26.9 l 
7.8 41.4 l  p
7.8 23.1 m  17.19999 23.1 l  19.2 23.1 20.7 22.9 21.8 22.5 ct 
22.9 22 23.8 21.4 24.4 20.5 ct 25 19.6 25.2 18.6 25.2 17.5 ct 
25.2 16 24.7 14.7 23.6 13.8 ct 22.4 12.8 20.7 12.2 18.19999 12.2 ct 
7.8 12.2 l  p ef
pom
pum
550.8 1759.5 t 
19.2 33.8 m  23.3 34.3 l  22.7 36.7 21.5 38.6 19.7 39.9 ct 
17.9 41.3 15.6 41.9 12.9 41.9 ct 9.4 41.9 6.6 40.9 4.6 38.7 ct 
2.6 36.6 1.6 33.6 1.6 29.7 ct 1.6 25.7 2.6 22.7 4.7 20.5 ct 
6.7 18.19999 9.4 17.1 12.7 17.1 ct 15.9 17.1 18.5 18.19999 20.5 20.4 ct 
22.5 22.5 23.5 25.6 23.5 29.4 ct 23.5 29.7 23.5 30.1 23.5 30.5 ct 
5.7 30.5 l  5.9 33.2 6.6 35.1 7.9 36.6 ct 
9.3 38 10.9 38.6 13 38.6 ct 14.4 38.6 15.6 38.2 16.69999 37.5 ct 
17.69999 36.7 l  18.5 35.5 l  p
6 27.2 m  19.2 27.2 l  19 25.2 18.5 23.8 17.69999 22.8 ct 
16.4 21.2 14.8 20.5 12.7 20.5 ct 10.9 20.5 9.3 21 8 22.3 ct 
6.8 23.5 l  6.1 25.1 l  p ef
pom
pum
577 1759.5 t 
18.5 38.5 m  16.9 39.7 15.5 40.6 14.1 41.2 ct 
12.8 41.7 11.2 41.9 9.7 41.9 ct 7.1 41.9 5.1 41.3 3.7 40 ct 
2.2 38.8 1.6 37.1 1.6 35.1 ct 1.6 33.89999 1.8 32.89999 2.3 31.9 ct 
2.9 31 3.6 30.2 4.4 29.6 ct 5.3 29.1 6.3 28.6 7.4 28.3 ct 
8.09999 28.1 9.3 27.9 10.9 27.7 ct 14.1 27.3 16.5 26.9 18.1 26.3 ct 
18.1 25.8 18.1 25.4 18.1 25.2 ct 18.1 23.7 17.69999 22.5 17 21.8 ct 
16 20.9 14.4 20.5 12.4 20.5 ct 10.5 20.5 9.09999 20.7 8.2 21.5 ct 
7.3 22.1 6.6 23.3 6.2 25 ct 2.2 24.4 l 
2.6 22.8 3.2 21.4 4 20.4 ct 4.8 19.3 6 18.5 7.6 18 ct 
9.09999 17.4 10.9 17.1 13 17.1 ct 15 17.1 16.6 17.4 17.9 17.8 ct 
19.2 18.3 20.1 18.9 20.7 19.6 ct 21.3 20.4 21.8 21.3 21.9 22.4 ct 
22.1 23 22.1 24.3 22.1 26.1 ct 22.1 31.5 l 
22.1 35.2 22.2 37.6 22.4 38.5 ct 22.6 39.5 22.9 40.5 23.4 41.4 ct 
19.2 41.4 l  18.8 40.5 l  18.5 39.6 l  p
18.1 29.4 m  16.6 30.1 14.4 30.5 11.5 31 ct 
9.8 31.3 8.7 31.6 8 31.8 ct 7.3 32.1 6.8 32.6 6.5 33.1 ct 
6 33.7 5.8 34.3 5.8 35 ct 5.8 36.1 6.3 37 7.1 37.7 ct 
7.9 38.4 9.09999 38.8 10.7 38.8 ct 12.2 38.8 13.6 38.4 14.8 37.8 ct 
16 37 16.9 36.1 17.4 34.89999 ct 17.9 34.1 18.1 32.7 18.1 30.9 ct 
p ef
pom
pum
602.39999 1759.5 t 
18.4 41.4 m  18.4 38.4 l  16.8 40.8 14.6 41.9 11.7 41.9 ct 
9.8 41.9 8 41.4 6.5 40.3 ct 4.9 39.3 3.6 37.89999 2.8 36 ct 
1.9 34.1 1.5 32 1.5 29.5 ct 1.5 27.2 1.9 25 2.7 23.1 ct 
3.4 21.2 4.6 19.6 6.2 18.6 ct 7.8 17.6 9.6 17.1 11.5 17.1 ct 
13 17.1 14.2 17.4 15.3 18 ct 16.4 18.6 17.4 19.4 18.1 20.4 ct 
18.1 8.7 l  22 8.7 l  22 41.4 l  p
5.6 29.5 m  5.6 32.6 6.3 34.8 7.6 36.39999 ct 
8.8 37.89999 10.3 38.6 12 38.6 ct 13.9 38.6 15.3 37.89999 16.5 36.5 ct 
17.8 35 18.4 32.8 18.4 29.9 ct 18.4 26.6 17.8 24.2 16.5 22.8 ct 
15.2 21.2 13.7 20.5 11.9 20.5 ct 10.1 20.5 8.7 21.2 7.4 22.7 ct 
6.2 24.1 l  5.6 26.4 l  p ef
pom
pum
627.8 1759.5 t 
3.3 41.4 m  3.3 8.7 l  9.8 8.7 l  17.6 31.8 l 
18.3 34 18.8 35.6 19.2 36.7 ct 19.6 35.5 20.1 33.8 20.9 31.5 ct 
28.7 8.7 l  34.6 8.7 l  34.6 41.4 l  30.5 41.4 l 
30.5 14 l  20.9 41.4 l  17 41.4 l  7.5 13.5 l 
7.5 41.4 l  p ef
pom
pum
665.9 1759.5 t 
18.5 38.5 m  16.9 39.7 15.5 40.6 14.1 41.2 ct 
12.8 41.7 11.2 41.9 9.7 41.9 ct 7.1 41.9 5.1 41.3 3.7 40 ct 
2.2 38.8 1.6 37.1 1.6 35.1 ct 1.6 33.89999 1.8 32.89999 2.3 31.9 ct 
2.9 31 3.6 30.2 4.4 29.6 ct 5.3 29.1 6.3 28.6 7.4 28.3 ct 
8.09999 28.1 9.3 27.9 10.9 27.7 ct 14.1 27.3 16.5 26.9 18.1 26.3 ct 
18.1 25.8 18.1 25.4 18.1 25.2 ct 18.1 23.7 17.69999 22.5 17 21.8 ct 
16 20.9 14.4 20.5 12.4 20.5 ct 10.5 20.5 9.09999 20.7 8.2 21.5 ct 
7.3 22.1 6.6 23.3 6.2 25 ct 2.2 24.4 l 
2.6 22.8 3.2 21.4 4 20.4 ct 4.8 19.3 6 18.5 7.6 18 ct 
9.09999 17.4 10.9 17.1 13 17.1 ct 15 17.1 16.6 17.4 17.9 17.8 ct 
19.2 18.3 20.1 18.9 20.7 19.6 ct 21.3 20.4 21.8 21.3 21.9 22.4 ct 
22.1 23 22.1 24.3 22.1 26.1 ct 22.1 31.5 l 
22.1 35.2 22.2 37.6 22.4 38.5 ct 22.6 39.5 22.9 40.5 23.4 41.4 ct 
19.2 41.4 l  18.8 40.5 l  18.5 39.6 l  p
18.1 29.4 m  16.6 30.1 14.4 30.5 11.5 31 ct 
9.8 31.3 8.7 31.6 8 31.8 ct 7.3 32.1 6.8 32.6 6.5 33.1 ct 
6 33.7 5.8 34.3 5.8 35 ct 5.8 36.1 6.3 37 7.1 37.7 ct 
7.9 38.4 9.09999 38.8 10.7 38.8 ct 12.2 38.8 13.6 38.4 14.8 37.8 ct 
16 37 16.9 36.1 17.4 34.89999 ct 17.9 34.1 18.1 32.7 18.1 30.9 ct 
p ef
pom
pum
691.3 1759.5 t 
2.9 41.4 m  2.9 17.6 l  6.5 17.6 l  6.5 21 l 
8.3 18.5 10.9 17.1 14.1 17.1 ct 15.5 17.1 16.9 17.4 18.1 17.9 ct 
19.3 18.4 20.2 19.1 20.7 19.9 ct 21.4 20.7 21.8 21.8 22 22.9 ct 
22.1 23.6 22.2 25 22.2 26.8 ct 22.2 41.4 l 
18.19999 41.4 l  18.19999 27 l  18.19999 25.3 18.1 24 17.69999 23.3 ct 
17.4 22.5 16.9 21.8 16.1 21.3 ct 15.2 20.8 14.3 20.6 13.2 20.6 ct 
11.6 20.6 10 21.1 8.8 22.2 ct 7.6 23.3 6.9 25.4 6.9 28.4 ct 
6.9 41.4 l  p ef
pom
pum
716.7 1759.5 t 
2.8 50.5 m  2.3 46.8 l  3.2 47 4 47.1 4.6 47.1 ct 
5.5 47.1 6.2 46.9 6.7 46.7 ct 7.3 46.4 7.7 45.9 8.09999 45.4 ct 
8.3 45 8.7 44 9.3 42.5 ct 9.4 42.2 9.5 41.9 9.7 41.4 ct 
0.7 17.6 l  5 17.6 l  9.9 31.4 l  10.6 33.1 11.1 34.89999 11.7 36.89999 ct 
12.1 35 12.7 33.3 13.3 31.5 ct 18.4 17.6 l 
22.4 17.6 l  13.3 41.8 l  12.4 44.4 11.7 46.2 11.1 47.2 ct 
10.4 48.5 9.6 49.5 8.7 50.1 ct 7.7 50.7 6.6 51.1 5.4 51.1 ct 
4.5 51.1 l  3.7 50.9 l  p ef
pom
pum
518.6 1810.3 t 
3.7 41.4 m  3.7 8.7 l  25.8 8.7 l  25.8 12.5 l 
8 12.5 l  8 22.7 l  23.4 22.7 l  23.4 26.5 l 
8 26.5 l  8 41.4 l  p ef
pom
pum
545.7 1810.3 t 
3 13.2 m  3 8.7 l  7 8.7 l  7 13.2 l  p
3 41.4 m  3 17.6 l  7 17.6 l  7 41.4 l  p ef
pom
pum
555.89999 1810.3 t 
19.2 33.8 m  23.3 34.3 l  22.7 36.7 21.5 38.6 19.7 39.9 ct 
17.9 41.3 15.6 41.9 12.9 41.9 ct 9.4 41.9 6.6 40.9 4.6 38.7 ct 
2.6 36.6 1.6 33.6 1.6 29.7 ct 1.6 25.7 2.6 22.7 4.7 20.5 ct 
6.7 18.19999 9.4 17.1 12.7 17.1 ct 15.9 17.1 18.5 18.19999 20.5 20.4 ct 
22.5 22.5 23.5 25.6 23.5 29.4 ct 23.5 29.7 23.5 30.1 23.5 30.5 ct 
5.7 30.5 l  5.9 33.2 6.6 35.1 7.9 36.6 ct 
9.3 38 10.9 38.6 13 38.6 ct 14.4 38.6 15.6 38.2 16.69999 37.5 ct 
17.69999 36.7 l  18.5 35.5 l  p
6 27.2 m  19.2 27.2 l  19 25.2 18.5 23.8 17.69999 22.8 ct 
16.4 21.2 14.8 20.5 12.7 20.5 ct 10.9 20.5 9.3 21 8 22.3 ct 
6.8 23.5 l  6.1 25.1 l  p ef
pom
pum
582.1 1810.3 t 
2.8 41.4 m  2.8 8.7 l  6.8 8.7 l  6.8 41.4 l 
p ef
pom
pum
591.39999 1810.3 t 
18.4 41.4 m  18.4 38.4 l  16.8 40.8 14.6 41.9 11.7 41.9 ct 
9.8 41.9 8 41.4 6.5 40.3 ct 4.9 39.3 3.6 37.89999 2.8 36 ct 
1.9 34.1 1.5 32 1.5 29.5 ct 1.5 27.2 1.9 25 2.7 23.1 ct 
3.4 21.2 4.6 19.6 6.2 18.6 ct 7.8 17.6 9.6 17.1 11.5 17.1 ct 
13 17.1 14.2 17.4 15.3 18 ct 16.4 18.6 17.4 19.4 18.1 20.4 ct 
18.1 8.7 l  22 8.7 l  22 41.4 l  p
5.6 29.5 m  5.6 32.6 6.3 34.8 7.6 36.39999 ct 
8.8 37.89999 10.3 38.6 12 38.6 ct 13.9 38.6 15.3 37.89999 16.5 36.5 ct 
17.8 35 18.4 32.8 18.4 29.9 ct 18.4 26.6 17.8 24.2 16.5 22.8 ct 
15.2 21.2 13.7 20.5 11.9 20.5 ct 10.1 20.5 8.7 21.2 7.4 22.7 ct 
6.2 24.1 l  5.6 26.4 l  p ef
pom
pum
617.7 1810.3 t 
1.3 34.3 m  5.3 33.7 l  5.5 35.3 6.2 36.5 7.2 37.3 ct 
8.2 38.2 9.6 38.6 11.4 38.6 ct 13.3 38.6 14.7 38.2 15.5 37.5 ct 
16.4 36.8 16.9 35.89999 16.9 34.8 ct 16.9 33.89999 16.5 33.2 15.7 32.7 ct 
15.2 32.39999 13.8 31.9 11.6 31.4 ct 8.7 30.6 6.6 29.9 5.4 29.4 ct 
4.29999 28.9 3.4 28.1 2.9 27.2 ct 2.2 26.1 2 25.1 2 23.9 ct 
2 22.9 2.2 21.9 2.7 21 ct 3.2 20.1 3.9 19.4 4.7 18.69999 ct 
5.4 18.3 6.2 17.9 7.3 17.6 ct 8.4 17.3 9.5 17.1 10.8 17.1 ct 
12.6 17.1 14.2 17.4 15.6 17.9 ct 17.1 18.5 18.1 19.2 18.69999 20.1 ct 
19.5 21 19.9 22.2 20.1 23.8 ct 16.19999 24.3 l 
16.1 23.1 15.5 22.1 14.7 21.5 ct 13.8 20.7 12.6 20.5 11 20.5 ct 
9.2 20.5 7.8 20.7 7.1 21.4 ct 6.3 21.9 5.9 22.7 5.9 23.5 ct 
5.9 24 6 24.5 6.4 24.9 ct 6.7 25.3 7.2 25.7 7.9 26 ct 
8.3 26.1 9.5 26.4 11.5 27 ct 14.3 27.8 16.3 28.3 17.4 28.9 ct 
18.5 29.4 19.5 30.1 20.1 31 ct 20.7 31.9 21 33 21 34.39999 ct 
21 35.8 20.7 37 19.8 38.2 ct 19.1 39.4 18 40.3 16.4 41 ct 
15 41.6 13.3 41.9 11.5 41.9 ct 8.4 41.9 6 41.3 4.4 40 ct 
2.8 38.7 l  1.8 36.89999 l  p ef
pom
pum
640.5 1810.3 t 
17 41.4 m  13 41.4 l  13 15.7 l  11.9 16.69999 10.7 17.6 9.09999 18.5 ct 
7.6 19.5 6.2 20.1 4.9 20.6 ct 4.9 16.69999 l 
7.2 15.6 9.09999 14.3 10.8 12.9 ct 12.5 11.4 13.7 9.9 14.3 8.5 ct 
17 8.5 l  p ef
pom
gr
774 1750.1 m  774 1735.1 l  ps
gs
pum
809.6 1759.5 t 
3.5 41.4 m  3.5 8.7 l  18.1 8.7 l  20.9 8.7 23.2 8.9 24.7 9.5 ct 
26.2 10.1 27.4 11.1 28.3 12.6 ct 29.3 14.1 29.7 15.8 29.7 17.5 ct 
29.7 19.9 29 21.8 27.4 23.4 ct 26 25 23.6 26.1 20.5 26.5 ct 
21.7 27.1 22.5 27.6 23.1 28.1 ct 24.4 29.3 25.6 30.7 26.7 32.5 ct 
32.39999 41.4 l  27 41.4 l  22.6 34.6 l  21.3 32.7 20.3 31.1 19.5 30.1 ct 
18.6 29 17.9 28.3 17.3 27.9 ct 16.6 27.4 16 27.2 15.2 27 ct 
14.8 26.9 14 26.9 12.9 26.9 ct 7.8 26.9 l 
7.8 41.4 l  p
7.8 23.1 m  17.19999 23.1 l  19.2 23.1 20.7 22.9 21.8 22.5 ct 
22.9 22 23.8 21.4 24.4 20.5 ct 25 19.6 25.2 18.6 25.2 17.5 ct 
25.2 16 24.7 14.7 23.6 13.8 ct 22.4 12.8 20.7 12.2 18.19999 12.2 ct 
7.8 12.2 l  p ef
pom
pum
841.8 1759.5 t 
19.2 33.8 m  23.3 34.3 l  22.7 36.7 21.5 38.6 19.7 39.9 ct 
17.9 41.3 15.6 41.9 12.9 41.9 ct 9.4 41.9 6.6 40.9 4.6 38.7 ct 
2.6 36.6 1.6 33.6 1.6 29.7 ct 1.6 25.7 2.6 22.7 4.7 20.5 ct 
6.7 18.19999 9.4 17.1 12.7 17.1 ct 15.9 17.1 18.5 18.19999 20.5 20.4 ct 
22.5 22.5 23.5 25.6 23.5 29.4 ct 23.5 29.7 23.5 30.1 23.5 30.5 ct 
5.7 30.5 l  5.9 33.2 6.6 35.1 7.9 36.6 ct 
9.3 38 10.9 38.6 13 38.6 ct 14.4 38.6 15.6 38.2 16.69999 37.5 ct 
17.69999 36.7 l  18.5 35.5 l  p
6 27.2 m  19.2 27.2 l  19 25.2 18.5 23.8 17.69999 22.8 ct 
16.4 21.2 14.8 20.5 12.7 20.5 ct 10.9 20.5 9.3 21 8 22.3 ct 
6.8 23.5 l  6.1 25.1 l  p ef
pom
pum
868 1759.5 t 
18.5 38.5 m  16.9 39.7 15.5 40.6 14.1 41.2 ct 
12.8 41.7 11.2 41.9 9.7 41.9 ct 7.1 41.9 5.1 41.3 3.7 40 ct 
2.2 38.8 1.6 37.1 1.6 35.1 ct 1.6 33.89999 1.8 32.89999 2.3 31.9 ct 
2.9 31 3.6 30.2 4.4 29.6 ct 5.3 29.1 6.3 28.6 7.4 28.3 ct 
8.09999 28.1 9.3 27.9 10.9 27.7 ct 14.1 27.3 16.5 26.9 18.1 26.3 ct 
18.1 25.8 18.1 25.4 18.1 25.2 ct 18.1 23.7 17.69999 22.5 17 21.8 ct 
16 20.9 14.4 20.5 12.4 20.5 ct 10.5 20.5 9.09999 20.7 8.2 21.5 ct 
7.3 22.1 6.6 23.3 6.2 25 ct 2.2 24.4 l 
2.6 22.8 3.2 21.4 4 20.4 ct 4.8 19.3 6 18.5 7.6 18 ct 
9.09999 17.4 10.9 17.1 13 17.1 ct 15 17.1 16.6 17.4 17.9 17.8 ct 
19.2 18.3 20.1 18.9 20.7 19.6 ct 21.3 20.4 21.8 21.3 21.9 22.4 ct 
22.1 23 22.1 24.3 22.1 26.1 ct 22.1 31.5 l 
22.1 35.2 22.2 37.6 22.4 38.5 ct 22.6 39.5 22.9 40.5 23.4 41.4 ct 
19.2 41.4 l  18.8 40.5 l  18.5 39.6 l  p
18.1 29.4 m  16.6 30.1 14.4 30.5 11.5 31 ct 
9.8 31.3 8.7 31.6 8 31.8 ct 7.3 32.1 6.8 32.6 6.5 33.1 ct 
6 33.7 5.8 34.3 5.8 35 ct 5.8 36.1 6.3 37 7.1 37.7 ct 
7.9 38.4 9.09999 38.8 10.7 38.8 ct 12.2 38.8 13.6 38.4 14.8 37.8 ct 
16 37 16.9 36.1 17.4 34.89999 ct 17.9 34.1 18.1 32.7 18.1 30.9 ct 
p ef
pom
pum
893.4 1759.5 t 
18.4 41.4 m  18.4 38.4 l  16.8 40.8 14.6 41.9 11.7 41.9 ct 
9.8 41.9 8 41.4 6.5 40.3 ct 4.9 39.3 3.6 37.89999 2.8 36 ct 
1.9 34.1 1.5 32 1.5 29.5 ct 1.5 27.2 1.9 25 2.7 23.1 ct 
3.4 21.2 4.6 19.6 6.2 18.6 ct 7.8 17.6 9.6 17.1 11.5 17.1 ct 
13 17.1 14.2 17.4 15.3 18 ct 16.4 18.6 17.4 19.4 18.1 20.4 ct 
18.1 8.7 l  22 8.7 l  22 41.4 l  p
5.6 29.5 m  5.6 32.6 6.3 34.8 7.6 36.39999 ct 
8.8 37.89999 10.3 38.6 12 38.6 ct 13.9 38.6 15.3 37.89999 16.5 36.5 ct 
17.8 35 18.4 32.8 18.4 29.9 ct 18.4 26.6 17.8 24.2 16.5 22.8 ct 
15.2 21.2 13.7 20.5 11.9 20.5 ct 10.1 20.5 8.7 21.2 7.4 22.7 ct 
6.2 24.1 l  5.6 26.4 l  p ef
pom
pum
918.8 1759.5 t 
3.3 41.4 m  3.3 8.7 l  9.8 8.7 l  17.6 31.8 l 
18.3 34 18.8 35.6 19.2 36.7 ct 19.6 35.5 20.1 33.8 20.9 31.5 ct 
28.7 8.7 l  34.6 8.7 l  34.6 41.4 l  30.5 41.4 l 
30.5 14 l  20.9 41.4 l  17 41.4 l  7.5 13.5 l 
7.5 41.4 l  p ef
pom
pum
956.9 1759.5 t 
18.5 38.5 m  16.9 39.7 15.5 40.6 14.1 41.2 ct 
12.8 41.7 11.2 41.9 9.7 41.9 ct 7.1 41.9 5.1 41.3 3.7 40 ct 
2.2 38.8 1.6 37.1 1.6 35.1 ct 1.6 33.89999 1.8 32.89999 2.3 31.9 ct 
2.9 31 3.6 30.2 4.4 29.6 ct 5.3 29.1 6.3 28.6 7.4 28.3 ct 
8.09999 28.1 9.3 27.9 10.9 27.7 ct 14.1 27.3 16.5 26.9 18.1 26.3 ct 
18.1 25.8 18.1 25.4 18.1 25.2 ct 18.1 23.7 17.69999 22.5 17 21.8 ct 
16 20.9 14.4 20.5 12.4 20.5 ct 10.5 20.5 9.09999 20.7 8.2 21.5 ct 
7.3 22.1 6.6 23.3 6.2 25 ct 2.2 24.4 l 
2.6 22.8 3.2 21.4 4 20.4 ct 4.8 19.3 6 18.5 7.6 18 ct 
9.09999 17.4 10.9 17.1 13 17.1 ct 15 17.1 16.6 17.4 17.9 17.8 ct 
19.2 18.3 20.1 18.9 20.7 19.6 ct 21.3 20.4 21.8 21.3 21.9 22.4 ct 
22.1 23 22.1 24.3 22.1 26.1 ct 22.1 31.5 l 
22.1 35.2 22.2 37.6 22.4 38.5 ct 22.6 39.5 22.9 40.5 23.4 41.4 ct 
19.2 41.4 l  18.8 40.5 l  18.5 39.6 l  p
18.1 29.4 m  16.6 30.1 14.4 30.5 11.5 31 ct 
9.8 31.3 8.7 31.6 8 31.8 ct 7.3 32.1 6.8 32.6 6.5 33.1 ct 
6 33.7 5.8 34.3 5.8 35 ct 5.8 36.1 6.3 37 7.1 37.7 ct 
7.9 38.4 9.09999 38.8 10.7 38.8 ct 12.2 38.8 13.6 38.4 14.8 37.8 ct 
16 37 16.9 36.1 17.4 34.89999 ct 17.9 34.1 18.1 32.7 18.1 30.9 ct 
p ef
pom
pum
982.3 1759.5 t 
2.9 41.4 m  2.9 17.6 l  6.5 17.6 l  6.5 21 l 
8.3 18.5 10.9 17.1 14.1 17.1 ct 15.5 17.1 16.9 17.4 18.1 17.9 ct 
19.3 18.4 20.2 19.1 20.7 19.9 ct 21.4 20.7 21.8 21.8 22 22.9 ct 
22.1 23.6 22.2 25 22.2 26.8 ct 22.2 41.4 l 
18.19999 41.4 l  18.19999 27 l  18.19999 25.3 18.1 24 17.69999 23.3 ct 
17.4 22.5 16.9 21.8 16.1 21.3 ct 15.2 20.8 14.3 20.6 13.2 20.6 ct 
11.6 20.6 10 21.1 8.8 22.2 ct 7.6 23.3 6.9 25.4 6.9 28.4 ct 
6.9 41.4 l  p ef
pom
pum
1007.7 1759.5 t 
2.8 50.5 m  2.3 46.8 l  3.2 47 4 47.1 4.6 47.1 ct 
5.5 47.1 6.2 46.9 6.7 46.7 ct 7.3 46.4 7.7 45.9 8.09999 45.4 ct 
8.3 45 8.7 44 9.3 42.5 ct 9.4 42.2 9.5 41.9 9.7 41.4 ct 
0.7 17.6 l  5 17.6 l  9.9 31.4 l  10.6 33.1 11.1 34.89999 11.7 36.89999 ct 
12.1 35 12.7 33.3 13.3 31.5 ct 18.4 17.6 l 
22.4 17.6 l  13.3 41.8 l  12.4 44.4 11.7 46.2 11.1 47.2 ct 
10.4 48.5 9.6 49.5 8.7 50.1 ct 7.7 50.7 6.6 51.1 5.4 51.1 ct 
4.5 51.1 l  3.7 50.9 l  p ef
pom
pum
809.6 1810.3 t 
3.7 41.4 m  3.7 8.7 l  25.8 8.7 l  25.8 12.5 l 
8 12.5 l  8 22.7 l  23.4 22.7 l  23.4 26.5 l 
8 26.5 l  8 41.4 l  p ef
pom
pum
836.7 1810.3 t 
3 13.2 m  3 8.7 l  7 8.7 l  7 13.2 l  p
3 41.4 m  3 17.6 l  7 17.6 l  7 41.4 l  p ef
pom
pum
846.9 1810.3 t 
19.2 33.8 m  23.3 34.3 l  22.7 36.7 21.5 38.6 19.7 39.9 ct 
17.9 41.3 15.6 41.9 12.9 41.9 ct 9.4 41.9 6.6 40.9 4.6 38.7 ct 
2.6 36.6 1.6 33.6 1.6 29.7 ct 1.6 25.7 2.6 22.7 4.7 20.5 ct 
6.7 18.19999 9.4 17.1 12.7 17.1 ct 15.9 17.1 18.5 18.19999 20.5 20.4 ct 
22.5 22.5 23.5 25.6 23.5 29.4 ct 23.5 29.7 23.5 30.1 23.5 30.5 ct 
5.7 30.5 l  5.9 33.2 6.6 35.1 7.9 36.6 ct 
9.3 38 10.9 38.6 13 38.6 ct 14.4 38.6 15.6 38.2 16.69999 37.5 ct 
17.69999 36.7 l  18.5 35.5 l  p
6 27.2 m  19.2 27.2 l  19 25.2 18.5 23.8 17.69999 22.8 ct 
16.4 21.2 14.8 20.5 12.7 20.5 ct 10.9 20.5 9.3 21 8 22.3 ct 
6.8 23.5 l  6.1 25.1 l  p ef
pom
pum
873.1 1810.3 t 
2.8 41.4 m  2.8 8.7 l  6.8 8.7 l  6.8 41.4 l 
p ef
pom
pum
882.4 1810.3 t 
18.4 41.4 m  18.4 38.4 l  16.8 40.8 14.6 41.9 11.7 41.9 ct 
9.8 41.9 8 41.4 6.5 40.3 ct 4.9 39.3 3.6 37.89999 2.8 36 ct 
1.9 34.1 1.5 32 1.5 29.5 ct 1.5 27.2 1.9 25 2.7 23.1 ct 
3.4 21.2 4.6 19.6 6.2 18.6 ct 7.8 17.6 9.6 17.1 11.5 17.1 ct 
13 17.1 14.2 17.4 15.3 18 ct 16.4 18.6 17.4 19.4 18.1 20.4 ct 
18.1 8.7 l  22 8.7 l  22 41.4 l  p
5.6 29.5 m  5.6 32.6 6.3 34.8 7.6 36.39999 ct 
8.8 37.89999 10.3 38.6 12 38.6 ct 13.9 38.6 15.3 37.89999 16.5 36.5 ct 
17.8 35 18.4 32.8 18.4 29.9 ct 18.4 26.6 17.8 24.2 16.5 22.8 ct 
15.2 21.2 13.7 20.5 11.9 20.5 ct 10.1 20.5 8.7 21.2 7.4 22.7 ct 
6.2 24.1 l  5.6 26.4 l  p ef
pom
pum
908.7 1810.3 t 
1.3 34.3 m  5.3 33.7 l  5.5 35.3 6.2 36.5 7.2 37.3 ct 
8.2 38.2 9.6 38.6 11.4 38.6 ct 13.3 38.6 14.7 38.2 15.5 37.5 ct 
16.4 36.8 16.9 35.89999 16.9 34.8 ct 16.9 33.89999 16.5 33.2 15.7 32.7 ct 
15.2 32.39999 13.8 31.9 11.6 31.4 ct 8.7 30.6 6.6 29.9 5.4 29.4 ct 
4.29999 28.9 3.4 28.1 2.9 27.2 ct 2.2 26.1 2 25.1 2 23.9 ct 
2 22.9 2.2 21.9 2.7 21 ct 3.2 20.1 3.9 19.4 4.7 18.69999 ct 
5.4 18.3 6.2 17.9 7.3 17.6 ct 8.4 17.3 9.5 17.1 10.8 17.1 ct 
12.6 17.1 14.2 17.4 15.6 17.9 ct 17.1 18.5 18.1 19.2 18.69999 20.1 ct 
19.5 21 19.9 22.2 20.1 23.8 ct 16.19999 24.3 l 
16.1 23.1 15.5 22.1 14.7 21.5 ct 13.8 20.7 12.6 20.5 11 20.5 ct 
9.2 20.5 7.8 20.7 7.1 21.4 ct 6.3 21.9 5.9 22.7 5.9 23.5 ct 
5.9 24 6 24.5 6.4 24.9 ct 6.7 25.3 7.2 25.7 7.9 26 ct 
8.3 26.1 9.5 26.4 11.5 27 ct 14.3 27.8 16.3 28.3 17.4 28.9 ct 
18.5 29.4 19.5 30.1 20.1 31 ct 20.7 31.9 21 33 21 34.39999 ct 
21 35.8 20.7 37 19.8 38.2 ct 19.1 39.4 18 40.3 16.4 41 ct 
15 41.6 13.3 41.9 11.5 41.9 ct 8.4 41.9 6 41.3 4.4 40 ct 
2.8 38.7 l  1.8 36.89999 l  p ef
pom
pum
931.5 1810.3 t 
22.9 37.5 m  22.9 41.4 l  1.3 41.4 l  1.2 40.4 1.4 39.5 1.8 38.6 ct 
2.3 37.1 3.2 35.7 4.4 34.2 ct 5.6 32.8 7.4 31.2 9.7 29.3 ct 
13.2 26.3 15.6 24 16.9 22.3 ct 18.19999 20.7 18.8 19 18.8 17.5 ct 
18.8 15.9 18.19999 14.5 17.1 13.4 ct 15.9 12.3 14.4 11.9 12.6 11.9 ct 
10.7 11.9 9.09999 12.4 7.9 13.6 ct 6.8 14.7 6.2 16.3 6.2 18.4 ct 
2.1 18 l  2.3 14.9 3.4 12.5 5.3 10.9 ct 
7.1 9.3 9.6 8.5 12.7 8.5 ct 15.8 8.5 18.4 9.4 20.2 11.1 ct 
22 12.9 22.9 15 22.9 17.5 ct 22.9 18.9 22.7 20.2 22.1 21.5 ct 
21.6 22.8 20.7 24 19.5 25.4 ct 18.19999 26.9 16.19999 28.8 13.2 31.2 ct 
10.9 33.3 9.3 34.7 8.59999 35.3 ct 7.9 36 7.4 36.8 6.9 37.5 ct 
p ef
pom
gr
1065.2 1750.1 m  1065.2 1735.1 l  ps
gs
pum
1116.5 1759.5 t 
4.2 41.4 m  4.2 8.7 l  8.59999 8.7 l  8.59999 41.4 l 
p ef
pom
pum
1129.2 1759.5 t 
11.7 37.8 m  12.3 41.4 l  11.1 41.6 10.1 41.7 9.3 41.7 ct 
7.8 41.7 6.6 41.4 5.8 41 ct 5.1 40.5 4.4 40 4.2 39.2 ct 
3.8 38.4 3.7 36.89999 3.7 34.5 ct 3.7 20.7 l 
0.7 20.7 l  0.7 17.6 l  3.7 17.6 l  3.7 11.8 l 
7.6 9.4 l  7.6 17.6 l  11.7 17.6 l  11.7 20.7 l 
7.6 20.7 l  7.6 34.7 l  7.6 35.89999 7.7 36.6 7.9 36.89999 ct 
8 37.2 8.3 37.5 8.59999 37.7 ct 8.9 37.89999 9.4 38 9.9 38 ct 
10.4 38 l  10.9 37.89999 l  p ef
pom
pum
1141.9 1759.5 t 
19.2 33.8 m  23.3 34.3 l  22.7 36.7 21.5 38.6 19.7 39.9 ct 
17.9 41.3 15.6 41.9 12.9 41.9 ct 9.4 41.9 6.6 40.9 4.6 38.7 ct 
2.6 36.6 1.6 33.6 1.6 29.7 ct 1.6 25.7 2.6 22.7 4.7 20.5 ct 
6.7 18.19999 9.4 17.1 12.7 17.1 ct 15.9 17.1 18.5 18.19999 20.5 20.4 ct 
22.5 22.5 23.5 25.6 23.5 29.4 ct 23.5 29.7 23.5 30.1 23.5 30.5 ct 
5.7 30.5 l  5.9 33.2 6.6 35.1 7.9 36.6 ct 
9.3 38 10.9 38.6 13 38.6 ct 14.4 38.6 15.6 38.2 16.69999 37.5 ct 
17.69999 36.7 l  18.5 35.5 l  p
6 27.2 m  19.2 27.2 l  19 25.2 18.5 23.8 17.69999 22.8 ct 
16.4 21.2 14.8 20.5 12.7 20.5 ct 10.9 20.5 9.3 21 8 22.3 ct 
6.8 23.5 l  6.1 25.1 l  p ef
pom
pum
1167.29999 1759.5 t 
2.9 41.4 m  2.9 17.6 l  6.5 17.6 l  6.5 21.3 l 
7.5 19.6 8.3 18.5 9 17.9 ct 9.8 17.4 10.7 17.1 11.7 17.1 ct 
13 17.1 14.4 17.5 15.8 18.5 ct 14.4 22.1 l 
13.4 21.6 12.4 21.3 11.4 21.3 ct 10.6 21.3 9.8 21.6 9.09999 22 ct 
8.4 22.6 7.9 23.3 7.6 24.2 ct 7.1 25.7 6.9 27.2 6.9 29 ct 
6.9 41.4 l  p ef
pom
pum
1182.5 1759.5 t 
18.5 38.5 m  16.9 39.7 15.5 40.6 14.1 41.2 ct 
12.8 41.7 11.2 41.9 9.7 41.9 ct 7.1 41.9 5.1 41.3 3.7 40 ct 
2.2 38.8 1.6 37.1 1.6 35.1 ct 1.6 33.89999 1.8 32.89999 2.3 31.9 ct 
2.9 31 3.6 30.2 4.4 29.6 ct 5.3 29.1 6.3 28.6 7.4 28.3 ct 
8.09999 28.1 9.3 27.9 10.9 27.7 ct 14.1 27.3 16.5 26.9 18.1 26.3 ct 
18.1 25.8 18.1 25.4 18.1 25.2 ct 18.1 23.7 17.69999 22.5 17 21.8 ct 
16 20.9 14.4 20.5 12.4 20.5 ct 10.5 20.5 9.09999 20.7 8.2 21.5 ct 
7.3 22.1 6.6 23.3 6.2 25 ct 2.2 24.4 l 
2.6 22.8 3.2 21.4 4 20.4 ct 4.8 19.3 6 18.5 7.6 18 ct 
9.09999 17.4 10.9 17.1 13 17.1 ct 15 17.1 16.6 17.4 17.9 17.8 ct 
19.2 18.3 20.1 18.9 20.7 19.6 ct 21.3 20.4 21.8 21.3 21.9 22.4 ct 
22.1 23 22.1 24.3 22.1 26.1 ct 22.1 31.5 l 
22.1 35.2 22.2 37.6 22.4 38.5 ct 22.6 39.5 22.9 40.5 23.4 41.4 ct 
19.2 41.4 l  18.8 40.5 l  18.5 39.6 l  p
18.1 29.4 m  16.6 30.1 14.4 30.5 11.5 31 ct 
9.8 31.3 8.7 31.6 8 31.8 ct 7.3 32.1 6.8 32.6 6.5 33.1 ct 
6 33.7 5.8 34.3 5.8 35 ct 5.8 36.1 6.3 37 7.1 37.7 ct 
7.9 38.4 9.09999 38.8 10.7 38.8 ct 12.2 38.8 13.6 38.4 14.8 37.8 ct 
16 37 16.9 36.1 17.4 34.89999 ct 17.9 34.1 18.1 32.7 18.1 30.9 ct 
p ef
pom
pum
1207.9 1759.5 t 
11.7 37.8 m  12.3 41.4 l  11.1 41.6 10.1 41.7 9.3 41.7 ct 
7.8 41.7 6.6 41.4 5.8 41 ct 5.1 40.5 4.4 40 4.2 39.2 ct 
3.8 38.4 3.7 36.89999 3.7 34.5 ct 3.7 20.7 l 
0.7 20.7 l  0.7 17.6 l  3.7 17.6 l  3.7 11.8 l 
7.6 9.4 l  7.6 17.6 l  11.7 17.6 l  11.7 20.7 l 
7.6 20.7 l  7.6 34.7 l  7.6 35.89999 7.7 36.6 7.9 36.89999 ct 
8 37.2 8.3 37.5 8.59999 37.7 ct 8.9 37.89999 9.4 38 9.9 38 ct 
10.4 38 l  10.9 37.89999 l  p ef
pom
pum
1220.6 1759.5 t 
3 13.2 m  3 8.7 l  7 8.7 l  7 13.2 l  p
3 41.4 m  3 17.6 l  7 17.6 l  7 41.4 l  p ef
pom
pum
1230.8 1759.5 t 
1.4 29.5 m  1.4 25.1 2.6 21.8 5.1 19.7 ct 
7.1 18 9.7 17.1 12.6 17.1 ct 15.8 17.1 18.5 18.19999 20.6 20.3 ct 
22.7 22.5 23.7 25.4 23.7 29.2 ct 23.7 32.3 23.2 34.7 22.3 36.39999 ct 
21.4 38.1 20 39.5 18.3 40.5 ct 16.5 41.4 14.6 41.9 12.6 41.9 ct 
9.2 41.9 6.5 40.9 4.5 38.7 ct 2.4 36.6 l 
1.4 33.6 l  p
5.5 29.5 m  5.5 32.6 6.3 34.8 7.6 36.3 ct 
8.8 37.89999 10.6 38.6 12.6 38.6 ct 14.6 38.6 16.3 37.89999 17.5 36.3 ct 
18.9 34.8 19.6 32.5 19.6 29.4 ct 19.6 26.4 18.9 24.2 17.5 22.8 ct 
16.19999 21.2 14.5 20.5 12.6 20.5 ct 10.6 20.5 8.8 21.2 7.6 22.7 ct 
6.3 24.2 l  5.5 26.5 l  p ef
pom
pum
1256.2 1759.5 t 
2.9 41.4 m  2.9 17.6 l  6.5 17.6 l  6.5 21 l 
8.3 18.5 10.9 17.1 14.1 17.1 ct 15.5 17.1 16.9 17.4 18.1 17.9 ct 
19.3 18.4 20.2 19.1 20.7 19.9 ct 21.4 20.7 21.8 21.8 22 22.9 ct 
22.1 23.6 22.2 25 22.2 26.8 ct 22.2 41.4 l 
18.19999 41.4 l  18.19999 27 l  18.19999 25.3 18.1 24 17.69999 23.3 ct 
17.4 22.5 16.9 21.8 16.1 21.3 ct 15.2 20.8 14.3 20.6 13.2 20.6 ct 
11.6 20.6 10 21.1 8.8 22.2 ct 7.6 23.3 6.9 25.4 6.9 28.4 ct 
6.9 41.4 l  p ef
pom
pum
1281.6 1759.5 t 
17 41.4 m  13 41.4 l  13 15.7 l  11.9 16.69999 10.7 17.6 9.09999 18.5 ct 
7.6 19.5 6.2 20.1 4.9 20.6 ct 4.9 16.69999 l 
7.2 15.6 9.09999 14.3 10.8 12.9 ct 12.5 11.4 13.7 9.9 14.3 8.5 ct 
17 8.5 l  p ef
pom
gr
1356.3 1750.1 m  1356.3 1735.1 l  ps
gs
pum
1407.6 1759.5 t 
4.2 41.4 m  4.2 8.7 l  8.59999 8.7 l  8.59999 41.4 l 
p ef
pom
pum
1420.3 1759.5 t 
11.7 37.8 m  12.3 41.4 l  11.1 41.6 10.1 41.7 9.3 41.7 ct 
7.8 41.7 6.6 41.4 5.8 41 ct 5.1 40.5 4.4 40 4.2 39.2 ct 
3.8 38.4 3.7 36.89999 3.7 34.5 ct 3.7 20.7 l 
0.7 20.7 l  0.7 17.6 l  3.7 17.6 l  3.7 11.8 l 
7.6 9.4 l  7.6 17.6 l  11.7 17.6 l  11.7 20.7 l 
7.6 20.7 l  7.6 34.7 l  7.6 35.89999 7.7 36.6 7.9 36.89999 ct 
8 37.2 8.3 37.5 8.59999 37.7 ct 8.9 37.89999 9.4 38 9.9 38 ct 
10.4 38 l  10.9 37.89999 l  p ef
pom
pum
1433 1759.5 t 
19.2 33.8 m  23.3 34.3 l  22.7 36.7 21.5 38.6 19.7 39.9 ct 
17.9 41.3 15.6 41.9 12.9 41.9 ct 9.4 41.9 6.6 40.9 4.6 38.7 ct 
2.6 36.6 1.6 33.6 1.6 29.7 ct 1.6 25.7 2.6 22.7 4.7 20.5 ct 
6.7 18.19999 9.4 17.1 12.7 17.1 ct 15.9 17.1 18.5 18.19999 20.5 20.4 ct 
22.5 22.5 23.5 25.6 23.5 29.4 ct 23.5 29.7 23.5 30.1 23.5 30.5 ct 
5.7 30.5 l  5.9 33.2 6.6 35.1 7.9 36.6 ct 
9.3 38 10.9 38.6 13 38.6 ct 14.4 38.6 15.6 38.2 16.69999 37.5 ct 
17.69999 36.7 l  18.5 35.5 l  p
6 27.2 m  19.2 27.2 l  19 25.2 18.5 23.8 17.69999 22.8 ct 
16.4 21.2 14.8 20.5 12.7 20.5 ct 10.9 20.5 9.3 21 8 22.3 ct 
6.8 23.5 l  6.1 25.1 l  p ef
pom
pum
1458.4 1759.5 t 
2.9 41.4 m  2.9 17.6 l  6.5 17.6 l  6.5 21.3 l 
7.5 19.6 8.3 18.5 9 17.9 ct 9.8 17.4 10.7 17.1 11.7 17.1 ct 
13 17.1 14.4 17.5 15.8 18.5 ct 14.4 22.1 l 
13.4 21.6 12.4 21.3 11.4 21.3 ct 10.6 21.3 9.8 21.6 9.09999 22 ct 
8.4 22.6 7.9 23.3 7.6 24.2 ct 7.1 25.7 6.9 27.2 6.9 29 ct 
6.9 41.4 l  p ef
pom
pum
1473.6 1759.5 t 
18.5 38.5 m  16.9 39.7 15.5 40.6 14.1 41.2 ct 
12.8 41.7 11.2 41.9 9.7 41.9 ct 7.1 41.9 5.1 41.3 3.7 40 ct 
2.2 38.8 1.6 37.1 1.6 35.1 ct 1.6 33.89999 1.8 32.89999 2.3 31.9 ct 
2.9 31 3.6 30.2 4.4 29.6 ct 5.3 29.1 6.3 28.6 7.4 28.3 ct 
8.09999 28.1 9.3 27.9 10.9 27.7 ct 14.1 27.3 16.5 26.9 18.1 26.3 ct 
18.1 25.8 18.1 25.4 18.1 25.2 ct 18.1 23.7 17.69999 22.5 17 21.8 ct 
16 20.9 14.4 20.5 12.4 20.5 ct 10.5 20.5 9.09999 20.7 8.2 21.5 ct 
7.3 22.1 6.6 23.3 6.2 25 ct 2.2 24.4 l 
2.6 22.8 3.2 21.4 4 20.4 ct 4.8 19.3 6 18.5 7.6 18 ct 
9.09999 17.4 10.9 17.1 13 17.1 ct 15 17.1 16.6 17.4 17.9 17.8 ct 
19.2 18.3 20.1 18.9 20.7 19.6 ct 21.3 20.4 21.8 21.3 21.9 22.4 ct 
22.1 23 22.1 24.3 22.1 26.1 ct 22.1 31.5 l 
22.1 35.2 22.2 37.6 22.4 38.5 ct 22.6 39.5 22.9 40.5 23.4 41.4 ct 
19.2 41.4 l  18.8 40.5 l  18.5 39.6 l  p
18.1 29.4 m  16.6 30.1 14.4 30.5 11.5 31 ct 
9.8 31.3 8.7 31.6 8 31.8 ct 7.3 32.1 6.8 32.6 6.5 33.1 ct 
6 33.7 5.8 34.3 5.8 35 ct 5.8 36.1 6.3 37 7.1 37.7 ct 
7.9 38.4 9.09999 38.8 10.7 38.8 ct 12.2 38.8 13.6 38.4 14.8 37.8 ct 
16 37 16.9 36.1 17.4 34.89999 ct 17.9 34.1 18.1 32.7 18.1 30.9 ct 
p ef
pom
pum
1499 1759.5 t 
11.7 37.8 m  12.3 41.4 l  11.1 41.6 10.1 41.7 9.3 41.7 ct 
7.8 41.7 6.6 41.4 5.8 41 ct 5.1 40.5 4.4 40 4.2 39.2 ct 
3.8 38.4 3.7 36.89999 3.7 34.5 ct 3.7 20.7 l 
0.7 20.7 l  0.7 17.6 l  3.7 17.6 l  3.7 11.8 l 
7.6 9.4 l  7.6 17.6 l  11.7 17.6 l  11.7 20.7 l 
7.6 20.7 l  7.6 34.7 l  7.6 35.89999 7.7 36.6 7.9 36.89999 ct 
8 37.2 8.3 37.5 8.59999 37.7 ct 8.9 37.89999 9.4 38 9.9 38 ct 
10.4 38 l  10.9 37.89999 l  p ef
pom
pum
1511.7 1759.5 t 
3 13.2 m  3 8.7 l  7 8.7 l  7 13.2 l  p
3 41.4 m  3 17.6 l  7 17.6 l  7 41.4 l  p ef
pom
pum
1521.9 1759.5 t 
1.4 29.5 m  1.4 25.1 2.6 21.8 5.1 19.7 ct 
7.1 18 9.7 17.1 12.6 17.1 ct 15.8 17.1 18.5 18.19999 20.6 20.3 ct 
22.7 22.5 23.7 25.4 23.7 29.2 ct 23.7 32.3 23.2 34.7 22.3 36.39999 ct 
21.4 38.1 20 39.5 18.3 40.5 ct 16.5 41.4 14.6 41.9 12.6 41.9 ct 
9.2 41.9 6.5 40.9 4.5 38.7 ct 2.4 36.6 l 
1.4 33.6 l  p
5.5 29.5 m  5.5 32.6 6.3 34.8 7.6 36.3 ct 
8.8 37.89999 10.6 38.6 12.6 38.6 ct 14.6 38.6 16.3 37.89999 17.5 36.3 ct 
18.9 34.8 19.6 32.5 19.6 29.4 ct 19.6 26.4 18.9 24.2 17.5 22.8 ct 
16.19999 21.2 14.5 20.5 12.6 20.5 ct 10.6 20.5 8.8 21.2 7.6 22.7 ct 
6.3 24.2 l  5.5 26.5 l  p ef
pom
pum
1547.3 1759.5 t 
2.9 41.4 m  2.9 17.6 l  6.5 17.6 l  6.5 21 l 
8.3 18.5 10.9 17.1 14.1 17.1 ct 15.5 17.1 16.9 17.4 18.1 17.9 ct 
19.3 18.4 20.2 19.1 20.7 19.9 ct 21.4 20.7 21.8 21.8 22 22.9 ct 
22.1 23.6 22.2 25 22.2 26.8 ct 22.2 41.4 l 
18.19999 41.4 l  18.19999 27 l  18.19999 25.3 18.1 24 17.69999 23.3 ct 
17.4 22.5 16.9 21.8 16.1 21.3 ct 15.2 20.8 14.3 20.6 13.2 20.6 ct 
11.6 20.6 10 21.1 8.8 22.2 ct 7.6 23.3 6.9 25.4 6.9 28.4 ct 
6.9 41.4 l  p ef
pom
pum
1572.7 1759.5 t 
22.9 37.5 m  22.9 41.4 l  1.3 41.4 l  1.2 40.4 1.4 39.5 1.8 38.6 ct 
2.3 37.1 3.2 35.7 4.4 34.2 ct 5.6 32.8 7.4 31.2 9.7 29.3 ct 
13.2 26.3 15.6 24 16.9 22.3 ct 18.19999 20.7 18.8 19 18.8 17.5 ct 
18.8 15.9 18.19999 14.5 17.1 13.4 ct 15.9 12.3 14.4 11.9 12.6 11.9 ct 
10.7 11.9 9.09999 12.4 7.9 13.6 ct 6.8 14.7 6.2 16.3 6.2 18.4 ct 
2.1 18 l  2.3 14.9 3.4 12.5 5.3 10.9 ct 
7.1 9.3 9.6 8.5 12.7 8.5 ct 15.8 8.5 18.4 9.4 20.2 11.1 ct 
22 12.9 22.9 15 22.9 17.5 ct 22.9 18.9 22.7 20.2 22.1 21.5 ct 
21.6 22.8 20.7 24 19.5 25.4 ct 18.19999 26.9 16.19999 28.8 13.2 31.2 ct 
10.9 33.3 9.3 34.7 8.59999 35.3 ct 7.9 36 7.4 36.8 6.9 37.5 ct 
p ef
pom
gr
1647.5 1750.1 m  1647.5 1735.1 l  ps
gs
pum
1725.1 1759.5 t 
0 41.4 m  12.4 8.7 l  17.1 8.7 l  30.5 41.4 l 
25.6 41.4 l  21.8 31.5 l  8 31.5 l  4.4 41.4 l 
p
9.3 28 m  20.4 28 l  17 18.8 l  16 16.1 15.2 13.9 14.7 12 ct 
14.2 14.1 13.7 16.3 12.9 18.4 ct p ef
pom
pum
1755.6 1759.5 t 
2.9 41.4 m  2.9 17.6 l  6.5 17.6 l  6.5 21.3 l 
7.5 19.6 8.3 18.5 9 17.9 ct 9.8 17.4 10.7 17.1 11.7 17.1 ct 
13 17.1 14.4 17.5 15.8 18.5 ct 14.4 22.1 l 
13.4 21.6 12.4 21.3 11.4 21.3 ct 10.6 21.3 9.8 21.6 9.09999 22 ct 
8.4 22.6 7.9 23.3 7.6 24.2 ct 7.1 25.7 6.9 27.2 6.9 29 ct 
6.9 41.4 l  p ef
pom
pum
1770.8 1759.5 t 
2.9 41.4 m  2.9 17.6 l  6.5 17.6 l  6.5 21.3 l 
7.5 19.6 8.3 18.5 9 17.9 ct 9.8 17.4 10.7 17.1 11.7 17.1 ct 
13 17.1 14.4 17.5 15.8 18.5 ct 14.4 22.1 l 
13.4 21.6 12.4 21.3 11.4 21.3 ct 10.6 21.3 9.8 21.6 9.09999 22 ct 
8.4 22.6 7.9 23.3 7.6 24.2 ct 7.1 25.7 6.9 27.2 6.9 29 ct 
6.9 41.4 l  p ef
pom
pum
1785.2 1759.5 t 
18.5 38.5 m  16.9 39.7 15.5 40.6 14.1 41.2 ct 
12.8 41.7 11.2 41.9 9.7 41.9 ct 7.1 41.9 5.1 41.3 3.7 40 ct 
2.2 38.8 1.6 37.1 1.6 35.1 ct 1.6 33.89999 1.8 32.89999 2.3 31.9 ct 
2.9 31 3.6 30.2 4.4 29.6 ct 5.3 29.1 6.3 28.6 7.4 28.3 ct 
8.09999 28.1 9.3 27.9 10.9 27.7 ct 14.1 27.3 16.5 26.9 18.1 26.3 ct 
18.1 25.8 18.1 25.4 18.1 25.2 ct 18.1 23.7 17.69999 22.5 17 21.8 ct 
16 20.9 14.4 20.5 12.4 20.5 ct 10.5 20.5 9.09999 20.7 8.2 21.5 ct 
7.3 22.1 6.6 23.3 6.2 25 ct 2.2 24.4 l 
2.6 22.8 3.2 21.4 4 20.4 ct 4.8 19.3 6 18.5 7.6 18 ct 
9.09999 17.4 10.9 17.1 13 17.1 ct 15 17.1 16.6 17.4 17.9 17.8 ct 
19.2 18.3 20.1 18.9 20.7 19.6 ct 21.3 20.4 21.8 21.3 21.9 22.4 ct 
22.1 23 22.1 24.3 22.1 26.1 ct 22.1 31.5 l 
22.1 35.2 22.2 37.6 22.4 38.5 ct 22.6 39.5 22.9 40.5 23.4 41.4 ct 
19.2 41.4 l  18.8 40.5 l  18.5 39.6 l  p
18.1 29.4 m  16.6 30.1 14.4 30.5 11.5 31 ct 
9.8 31.3 8.7 31.6 8 31.8 ct 7.3 32.1 6.8 32.6 6.5 33.1 ct 
6 33.7 5.8 34.3 5.8 35 ct 5.8 36.1 6.3 37 7.1 37.7 ct 
7.9 38.4 9.09999 38.8 10.7 38.8 ct 12.2 38.8 13.6 38.4 14.8 37.8 ct 
16 37 16.9 36.1 17.4 34.89999 ct 17.9 34.1 18.1 32.7 18.1 30.9 ct 
p ef
pom
pum
1811.5 1759.5 t 
2.8 50.5 m  2.3 46.8 l  3.2 47 4 47.1 4.6 47.1 ct 
5.5 47.1 6.2 46.9 6.7 46.7 ct 7.3 46.4 7.7 45.9 8.09999 45.4 ct 
8.3 45 8.7 44 9.3 42.5 ct 9.4 42.2 9.5 41.9 9.7 41.4 ct 
0.7 17.6 l  5 17.6 l  9.9 31.4 l  10.6 33.1 11.1 34.89999 11.7 36.89999 ct 
12.1 35 12.7 33.3 13.3 31.5 ct 18.4 17.6 l 
22.4 17.6 l  13.3 41.8 l  12.4 44.4 11.7 46.2 11.1 47.2 ct 
10.4 48.5 9.6 49.5 8.7 50.1 ct 7.7 50.7 6.6 51.1 5.4 51.1 ct 
4.5 51.1 l  3.7 50.9 l  p ef
pom
pum
1834.3 1759.5 t 
17 41.4 m  13 41.4 l  13 15.7 l  11.9 16.69999 10.7 17.6 9.09999 18.5 ct 
7.6 19.5 6.2 20.1 4.9 20.6 ct 4.9 16.69999 l 
7.2 15.6 9.09999 14.3 10.8 12.9 ct 12.5 11.4 13.7 9.9 14.3 8.5 ct 
17 8.5 l  p ef
pom
gr
1938.6 1750.1 m  1938.6 1735.1 l  ps
gs
pum
2016.1 1759.5 t 
0 41.4 m  12.4 8.7 l  17.1 8.7 l  30.5 41.4 l 
25.6 41.4 l  21.8 31.5 l  8 31.5 l  4.4 41.4 l 
p
9.3 28 m  20.4 28 l  17 18.8 l  16 16.1 15.2 13.9 14.7 12 ct 
14.2 14.1 13.7 16.3 12.9 18.4 ct p ef
pom
pum
2046.6 1759.5 t 
2.9 41.4 m  2.9 17.6 l  6.5 17.6 l  6.5 21.3 l 
7.5 19.6 8.3 18.5 9 17.9 ct 9.8 17.4 10.7 17.1 11.7 17.1 ct 
13 17.1 14.4 17.5 15.8 18.5 ct 14.4 22.1 l 
13.4 21.6 12.4 21.3 11.4 21.3 ct 10.6 21.3 9.8 21.6 9.09999 22 ct 
8.4 22.6 7.9 23.3 7.6 24.2 ct 7.1 25.7 6.9 27.2 6.9 29 ct 
6.9 41.4 l  p ef
pom
pum
2061.8 1759.5 t 
2.9 41.4 m  2.9 17.6 l  6.5 17.6 l  6.5 21.3 l 
7.5 19.6 8.3 18.5 9 17.9 ct 9.8 17.4 10.7 17.1 11.7 17.1 ct 
13 17.1 14.4 17.5 15.8 18.5 ct 14.4 22.1 l 
13.4 21.6 12.4 21.3 11.4 21.3 ct 10.6 21.3 9.8 21.6 9.09999 22 ct 
8.4 22.6 7.9 23.3 7.6 24.2 ct 7.1 25.7 6.9 27.2 6.9 29 ct 
6.9 41.4 l  p ef
pom
pum
2076.2 1759.5 t 
18.5 38.5 m  16.9 39.7 15.5 40.6 14.1 41.2 ct 
12.8 41.7 11.2 41.9 9.7 41.9 ct 7.1 41.9 5.1 41.3 3.7 40 ct 
2.2 38.8 1.6 37.1 1.6 35.1 ct 1.6 33.89999 1.8 32.89999 2.3 31.9 ct 
2.9 31 3.6 30.2 4.4 29.6 ct 5.3 29.1 6.3 28.6 7.4 28.3 ct 
8.09999 28.1 9.3 27.9 10.9 27.7 ct 14.1 27.3 16.5 26.9 18.1 26.3 ct 
18.1 25.8 18.1 25.4 18.1 25.2 ct 18.1 23.7 17.69999 22.5 17 21.8 ct 
16 20.9 14.4 20.5 12.4 20.5 ct 10.5 20.5 9.09999 20.7 8.2 21.5 ct 
7.3 22.1 6.6 23.3 6.2 25 ct 2.2 24.4 l 
2.6 22.8 3.2 21.4 4 20.4 ct 4.8 19.3 6 18.5 7.6 18 ct 
9.09999 17.4 10.9 17.1 13 17.1 ct 15 17.1 16.6 17.4 17.9 17.8 ct 
19.2 18.3 20.1 18.9 20.7 19.6 ct 21.3 20.4 21.8 21.3 21.9 22.4 ct 
22.1 23 22.1 24.3 22.1 26.1 ct 22.1 31.5 l 
22.1 35.2 22.2 37.6 22.4 38.5 ct 22.6 39.5 22.9 40.5 23.4 41.4 ct 
19.2 41.4 l  18.8 40.5 l  18.5 39.6 l  p
18.1 29.4 m  16.6 30.1 14.4 30.5 11.5 31 ct 
9.8 31.3 8.7 31.6 8 31.8 ct 7.3 32.1 6.8 32.6 6.5 33.1 ct 
6 33.7 5.8 34.3 5.8 35 ct 5.8 36.1 6.3 37 7.1 37.7 ct 
7.9 38.4 9.09999 38.8 10.7 38.8 ct 12.2 38.8 13.6 38.4 14.8 37.8 ct 
16 37 16.9 36.1 17.4 34.89999 ct 17.9 34.1 18.1 32.7 18.1 30.9 ct 
p ef
pom
pum
2102.5 1759.5 t 
2.8 50.5 m  2.3 46.8 l  3.2 47 4 47.1 4.6 47.1 ct 
5.5 47.1 6.2 46.9 6.7 46.7 ct 7.3 46.4 7.7 45.9 8.09999 45.4 ct 
8.3 45 8.7 44 9.3 42.5 ct 9.4 42.2 9.5 41.9 9.7 41.4 ct 
0.7 17.6 l  5 17.6 l  9.9 31.4 l  10.6 33.1 11.1 34.89999 11.7 36.89999 ct 
12.1 35 12.7 33.3 13.3 31.5 ct 18.4 17.6 l 
22.4 17.6 l  13.3 41.8 l  12.4 44.4 11.7 46.2 11.1 47.2 ct 
10.4 48.5 9.6 49.5 8.7 50.1 ct 7.7 50.7 6.6 51.1 5.4 51.1 ct 
4.5 51.1 l  3.7 50.9 l  p ef
pom
pum
2125.3 1759.5 t 
22.9 37.5 m  22.9 41.4 l  1.3 41.4 l  1.2 40.4 1.4 39.5 1.8 38.6 ct 
2.3 37.1 3.2 35.7 4.4 34.2 ct 5.6 32.8 7.4 31.2 9.7 29.3 ct 
13.2 26.3 15.6 24 16.9 22.3 ct 18.19999 20.7 18.8 19 18.8 17.5 ct 
18.8 15.9 18.19999 14.5 17.1 13.4 ct 15.9 12.3 14.4 11.9 12.6 11.9 ct 
10.7 11.9 9.09999 12.4 7.9 13.6 ct 6.8 14.7 6.2 16.3 6.2 18.4 ct 
2.1 18 l  2.3 14.9 3.4 12.5 5.3 10.9 ct 
7.1 9.3 9.6 8.5 12.7 8.5 ct 15.8 8.5 18.4 9.4 20.2 11.1 ct 
22 12.9 22.9 15 22.9 17.5 ct 22.9 18.9 22.7 20.2 22.1 21.5 ct 
21.6 22.8 20.7 24 19.5 25.4 ct 18.19999 26.9 16.19999 28.8 13.2 31.2 ct 
10.9 33.3 9.3 34.7 8.59999 35.3 ct 7.9 36 7.4 36.8 6.9 37.5 ct 
p ef
pom
gr
2229.8 1750.1 m  2229.8 1735.1 l  ps
gs
pum
2259.5 1759.5 t 
3.3 41.4 m  3.3 8.7 l  9.8 8.7 l  17.6 31.8 l 
18.3 34 18.8 35.6 19.2 36.7 ct 19.6 35.5 20.1 33.8 20.9 31.5 ct 
28.7 8.7 l  34.6 8.7 l  34.6 41.4 l  30.5 41.4 l 
30.5 14 l  20.9 41.4 l  17 41.4 l  7.5 13.5 l 
7.5 41.4 l  p ef
pom
pum
2296.8 1759.5 t 
18.5 41.4 m  18.5 37.89999 l  16.6 40.6 14.1 41.9 10.9 41.9 ct 
9.6 41.9 8.3 41.6 7 41.2 ct 5.8 40.6 4.9 39.9 4.29999 39.1 ct 
3.7 38.3 3.3 37.3 3.1 36.1 ct 2.9 35.3 2.8 34.1 2.8 32.39999 ct 
2.8 17.6 l  6.8 17.6 l  6.8 30.8 l  6.8 32.89999 6.9 34.3 7.1 35 ct 
7.4 36.1 7.9 37 8.7 37.6 ct 9.6 38.1 10.6 38.5 11.8 38.5 ct 
13 38.5 14.1 38.1 15.2 37.5 ct 16.3 37 17 36 17.4 35 ct 
17.8 33.89999 18.1 32.39999 18.1 30.4 ct 18.1 17.6 l 
22.1 17.6 l  22.1 41.4 l  p ef
pom
pum
2323 1759.5 t 
2.8 41.4 m  2.8 8.7 l  6.8 8.7 l  6.8 41.4 l 
p ef
pom
pum
2332.3 1759.5 t 
11.7 37.8 m  12.3 41.4 l  11.1 41.6 10.1 41.7 9.3 41.7 ct 
7.8 41.7 6.6 41.4 5.8 41 ct 5.1 40.5 4.4 40 4.2 39.2 ct 
3.8 38.4 3.7 36.89999 3.7 34.5 ct 3.7 20.7 l 
0.7 20.7 l  0.7 17.6 l  3.7 17.6 l  3.7 11.8 l 
7.6 9.4 l  7.6 17.6 l  11.7 17.6 l  11.7 20.7 l 
7.6 20.7 l  7.6 34.7 l  7.6 35.89999 7.7 36.6 7.9 36.89999 ct 
8 37.2 8.3 37.5 8.59999 37.7 ct 8.9 37.89999 9.4 38 9.9 38 ct 
10.4 38 l  10.9 37.89999 l  p ef
pom
pum
2345.9 1759.5 t 
3 13.2 m  3 8.7 l  7 8.7 l  7 13.2 l  p
3 41.4 m  3 17.6 l  7 17.6 l  7 41.4 l  p ef
pom
pum
2355.2 1759.5 t 
0 41.4 m  12.4 8.7 l  17.1 8.7 l  30.5 41.4 l 
25.6 41.4 l  21.8 31.5 l  8 31.5 l  4.4 41.4 l 
p
9.3 28 m  20.4 28 l  17 18.8 l  16 16.1 15.2 13.9 14.7 12 ct 
14.2 14.1 13.7 16.3 12.9 18.4 ct p ef
pom
pum
2386.5 1759.5 t 
2.9 41.4 m  2.9 17.6 l  6.5 17.6 l  6.5 21.3 l 
7.5 19.6 8.3 18.5 9 17.9 ct 9.8 17.4 10.7 17.1 11.7 17.1 ct 
13 17.1 14.4 17.5 15.8 18.5 ct 14.4 22.1 l 
13.4 21.6 12.4 21.3 11.4 21.3 ct 10.6 21.3 9.8 21.6 9.09999 22 ct 
8.4 22.6 7.9 23.3 7.6 24.2 ct 7.1 25.7 6.9 27.2 6.9 29 ct 
6.9 41.4 l  p ef
pom
pum
2400.9 1759.5 t 
2.9 41.4 m  2.9 17.6 l  6.5 17.6 l  6.5 21.3 l 
7.5 19.6 8.3 18.5 9 17.9 ct 9.8 17.4 10.7 17.1 11.7 17.1 ct 
13 17.1 14.4 17.5 15.8 18.5 ct 14.4 22.1 l 
13.4 21.6 12.4 21.3 11.4 21.3 ct 10.6 21.3 9.8 21.6 9.09999 22 ct 
8.4 22.6 7.9 23.3 7.6 24.2 ct 7.1 25.7 6.9 27.2 6.9 29 ct 
6.9 41.4 l  p ef
pom
pum
2416.09999 1759.5 t 
18.5 38.5 m  16.9 39.7 15.5 40.6 14.1 41.2 ct 
12.8 41.7 11.2 41.9 9.7 41.9 ct 7.1 41.9 5.1 41.3 3.7 40 ct 
2.2 38.8 1.6 37.1 1.6 35.1 ct 1.6 33.89999 1.8 32.89999 2.3 31.9 ct 
2.9 31 3.6 30.2 4.4 29.6 ct 5.3 29.1 6.3 28.6 7.4 28.3 ct 
8.09999 28.1 9.3 27.9 10.9 27.7 ct 14.1 27.3 16.5 26.9 18.1 26.3 ct 
18.1 25.8 18.1 25.4 18.1 25.2 ct 18.1 23.7 17.69999 22.5 17 21.8 ct 
16 20.9 14.4 20.5 12.4 20.5 ct 10.5 20.5 9.09999 20.7 8.2 21.5 ct 
7.3 22.1 6.6 23.3 6.2 25 ct 2.2 24.4 l 
2.6 22.8 3.2 21.4 4 20.4 ct 4.8 19.3 6 18.5 7.6 18 ct 
9.09999 17.4 10.9 17.1 13 17.1 ct 15 17.1 16.6 17.4 17.9 17.8 ct 
19.2 18.3 20.1 18.9 20.7 19.6 ct 21.3 20.4 21.8 21.3 21.9 22.4 ct 
22.1 23 22.1 24.3 22.1 26.1 ct 22.1 31.5 l 
22.1 35.2 22.2 37.6 22.4 38.5 ct 22.6 39.5 22.9 40.5 23.4 41.4 ct 
19.2 41.4 l  18.8 40.5 l  18.5 39.6 l  p
18.1 29.4 m  16.6 30.1 14.4 30.5 11.5 31 ct 
9.8 31.3 8.7 31.6 8 31.8 ct 7.3 32.1 6.8 32.6 6.5 33.1 ct 
6 33.7 5.8 34.3 5.8 35 ct 5.8 36.1 6.3 37 7.1 37.7 ct 
7.9 38.4 9.09999 38.8 10.7 38.8 ct 12.2 38.8 13.6 38.4 14.8 37.8 ct 
16 37 16.9 36.1 17.4 34.89999 ct 17.9 34.1 18.1 32.7 18.1 30.9 ct 
p ef
pom
pum
2442.4 1759.5 t 
2.8 50.5 m  2.3 46.8 l  3.2 47 4 47.1 4.6 47.1 ct 
5.5 47.1 6.2 46.9 6.7 46.7 ct 7.3 46.4 7.7 45.9 8.09999 45.4 ct 
8.3 45 8.7 44 9.3 42.5 ct 9.4 42.2 9.5 41.9 9.7 41.4 ct 
0.7 17.6 l  5 17.6 l  9.9 31.4 l  10.6 33.1 11.1 34.89999 11.7 36.89999 ct 
12.1 35 12.7 33.3 13.3 31.5 ct 18.4 17.6 l 
22.4 17.6 l  13.3 41.8 l  12.4 44.4 11.7 46.2 11.1 47.2 ct 
10.4 48.5 9.6 49.5 8.7 50.1 ct 7.7 50.7 6.6 51.1 5.4 51.1 ct 
4.5 51.1 l  3.7 50.9 l  p ef
pom
pum
2465.2 1759.5 t 
17 41.4 m  13 41.4 l  13 15.7 l  11.9 16.69999 10.7 17.6 9.09999 18.5 ct 
7.6 19.5 6.2 20.1 4.9 20.6 ct 4.9 16.69999 l 
7.2 15.6 9.09999 14.3 10.8 12.9 ct 12.5 11.4 13.7 9.9 14.3 8.5 ct 
17 8.5 l  p ef
pom
gr
2520.9 1750.1 m  2520.9 1735.1 l  ps
gs
pum
2550.6 1759.5 t 
3.3 41.4 m  3.3 8.7 l  9.8 8.7 l  17.6 31.8 l 
18.3 34 18.8 35.6 19.2 36.7 ct 19.6 35.5 20.1 33.8 20.9 31.5 ct 
28.7 8.7 l  34.6 8.7 l  34.6 41.4 l  30.5 41.4 l 
30.5 14 l  20.9 41.4 l  17 41.4 l  7.5 13.5 l 
7.5 41.4 l  p ef
pom
pum
2587.9 1759.5 t 
18.5 41.4 m  18.5 37.89999 l  16.6 40.6 14.1 41.9 10.9 41.9 ct 
9.6 41.9 8.3 41.6 7 41.2 ct 5.8 40.6 4.9 39.9 4.29999 39.1 ct 
3.7 38.3 3.3 37.3 3.1 36.1 ct 2.9 35.3 2.8 34.1 2.8 32.39999 ct 
2.8 17.6 l  6.8 17.6 l  6.8 30.8 l  6.8 32.89999 6.9 34.3 7.1 35 ct 
7.4 36.1 7.9 37 8.7 37.6 ct 9.6 38.1 10.6 38.5 11.8 38.5 ct 
13 38.5 14.1 38.1 15.2 37.5 ct 16.3 37 17 36 17.4 35 ct 
17.8 33.89999 18.1 32.39999 18.1 30.4 ct 18.1 17.6 l 
22.1 17.6 l  22.1 41.4 l  p ef
pom
pum
2614.1 1759.5 t 
2.8 41.4 m  2.8 8.7 l  6.8 8.7 l  6.8 41.4 l 
p ef
pom
pum
2623.4 1759.5 t 
11.7 37.8 m  12.3 41.4 l  11.1 41.6 10.1 41.7 9.3 41.7 ct 
7.8 41.7 6.6 41.4 5.8 41 ct 5.1 40.5 4.4 40 4.2 39.2 ct 
3.8 38.4 3.7 36.89999 3.7 34.5 ct 3.7 20.7 l 
0.7 20.7 l  0.7 17.6 l  3.7 17.6 l  3.7 11.8 l 
7.6 9.4 l  7.6 17.6 l  11.7 17.6 l  11.7 20.7 l 
7.6 20.7 l  7.6 34.7 l  7.6 35.89999 7.7 36.6 7.9 36.89999 ct 
8 37.2 8.3 37.5 8.59999 37.7 ct 8.9 37.89999 9.4 38 9.9 38 ct 
10.4 38 l  10.9 37.89999 l  p ef
pom
pum
2637 1759.5 t 
3 13.2 m  3 8.7 l  7 8.7 l  7 13.2 l  p
3 41.4 m  3 17.6 l  7 17.6 l  7 41.4 l  p ef
pom
pum
2646.3 1759.5 t 
0 41.4 m  12.4 8.7 l  17.1 8.7 l  30.5 41.4 l 
25.6 41.4 l  21.8 31.5 l  8 31.5 l  4.4 41.4 l 
p
9.3 28 m  20.4 28 l  17 18.8 l  16 16.1 15.2 13.9 14.7 12 ct 
14.2 14.1 13.7 16.3 12.9 18.4 ct p ef
pom
pum
2677.6 1759.5 t 
2.9 41.4 m  2.9 17.6 l  6.5 17.6 l  6.5 21.3 l 
7.5 19.6 8.3 18.5 9 17.9 ct 9.8 17.4 10.7 17.1 11.7 17.1 ct 
13 17.1 14.4 17.5 15.8 18.5 ct 14.4 22.1 l 
13.4 21.6 12.4 21.3 11.4 21.3 ct 10.6 21.3 9.8 21.6 9.09999 22 ct 
8.4 22.6 7.9 23.3 7.6 24.2 ct 7.1 25.7 6.9 27.2 6.9 29 ct 
6.9 41.4 l  p ef
pom
pum
2692 1759.5 t 
2.9 41.4 m  2.9 17.6 l  6.5 17.6 l  6.5 21.3 l 
7.5 19.6 8.3 18.5 9 17.9 ct 9.8 17.4 10.7 17.1 11.7 17.1 ct 
13 17.1 14.4 17.5 15.8 18.5 ct 14.4 22.1 l 
13.4 21.6 12.4 21.3 11.4 21.3 ct 10.6 21.3 9.8 21.6 9.09999 22 ct 
8.4 22.6 7.9 23.3 7.6 24.2 ct 7.1 25.7 6.9 27.2 6.9 29 ct 
6.9 41.4 l  p ef
pom
pum
2707.2 1759.5 t 
18.5 38.5 m  16.9 39.7 15.5 40.6 14.1 41.2 ct 
12.8 41.7 11.2 41.9 9.7 41.9 ct 7.1 41.9 5.1 41.3 3.7 40 ct 
2.2 38.8 1.6 37.1 1.6 35.1 ct 1.6 33.89999 1.8 32.89999 2.3 31.9 ct 
2.9 31 3.6 30.2 4.4 29.6 ct 5.3 29.1 6.3 28.6 7.4 28.3 ct 
8.09999 28.1 9.3 27.9 10.9 27.7 ct 14.1 27.3 16.5 26.9 18.1 26.3 ct 
18.1 25.8 18.1 25.4 18.1 25.2 ct 18.1 23.7 17.69999 22.5 17 21.8 ct 
16 20.9 14.4 20.5 12.4 20.5 ct 10.5 20.5 9.09999 20.7 8.2 21.5 ct 
7.3 22.1 6.6 23.3 6.2 25 ct 2.2 24.4 l 
2.6 22.8 3.2 21.4 4 20.4 ct 4.8 19.3 6 18.5 7.6 18 ct 
9.09999 17.4 10.9 17.1 13 17.1 ct 15 17.1 16.6 17.4 17.9 17.8 ct 
19.2 18.3 20.1 18.9 20.7 19.6 ct 21.3 20.4 21.8 21.3 21.9 22.4 ct 
22.1 23 22.1 24.3 22.1 26.1 ct 22.1 31.5 l 
22.1 35.2 22.2 37.6 22.4 38.5 ct 22.6 39.5 22.9 40.5 23.4 41.4 ct 
19.2 41.4 l  18.8 40.5 l  18.5 39.6 l  p
18.1 29.4 m  16.6 30.1 14.4 30.5 11.5 31 ct 
9.8 31.3 8.7 31.6 8 31.8 ct 7.3 32.1 6.8 32.6 6.5 33.1 ct 
6 33.7 5.8 34.3 5.8 35 ct 5.8 36.1 6.3 37 7.1 37.7 ct 
7.9 38.4 9.09999 38.8 10.7 38.8 ct 12.2 38.8 13.6 38.4 14.8 37.8 ct 
16 37 16.9 36.1 17.4 34.89999 ct 17.9 34.1 18.1 32.7 18.1 30.9 ct 
p ef
pom
pum
2733.5 1759.5 t 
2.8 50.5 m  2.3 46.8 l  3.2 47 4 47.1 4.6 47.1 ct 
5.5 47.1 6.2 46.9 6.7 46.7 ct 7.3 46.4 7.7 45.9 8.09999 45.4 ct 
8.3 45 8.7 44 9.3 42.5 ct 9.4 42.2 9.5 41.9 9.7 41.4 ct 
0.7 17.6 l  5 17.6 l  9.9 31.4 l  10.6 33.1 11.1 34.89999 11.7 36.89999 ct 
12.1 35 12.7 33.3 13.3 31.5 ct 18.4 17.6 l 
22.4 17.6 l  13.3 41.8 l  12.4 44.4 11.7 46.2 11.1 47.2 ct 
10.4 48.5 9.6 49.5 8.7 50.1 ct 7.7 50.7 6.6 51.1 5.4 51.1 ct 
4.5 51.1 l  3.7 50.9 l  p ef
pom
pum
2756.3 1759.5 t 
22.9 37.5 m  22.9 41.4 l  1.3 41.4 l  1.2 40.4 1.4 39.5 1.8 38.6 ct 
2.3 37.1 3.2 35.7 4.4 34.2 ct 5.6 32.8 7.4 31.2 9.7 29.3 ct 
13.2 26.3 15.6 24 16.9 22.3 ct 18.19999 20.7 18.8 19 18.8 17.5 ct 
18.8 15.9 18.19999 14.5 17.1 13.4 ct 15.9 12.3 14.4 11.9 12.6 11.9 ct 
10.7 11.9 9.09999 12.4 7.9 13.6 ct 6.8 14.7 6.2 16.3 6.2 18.4 ct 
2.1 18 l  2.3 14.9 3.4 12.5 5.3 10.9 ct 
7.1 9.3 9.6 8.5 12.7 8.5 ct 15.8 8.5 18.4 9.4 20.2 11.1 ct 
22 12.9 22.9 15 22.9 17.5 ct 22.9 18.9 22.7 20.2 22.1 21.5 ct 
21.6 22.8 20.7 24 19.5 25.4 ct 18.19999 26.9 16.19999 28.8 13.2 31.2 ct 
10.9 33.3 9.3 34.7 8.59999 35.3 ct 7.9 36 7.4 36.8 6.9 37.5 ct 
p ef
pom
gr
0.003 0.402 0.800 c 373.5 1672.8 m  446.2 1672.8 l  446.2 1735.1 l 
373.5 1735.1 l  373.5 1672.8 l  p ef
0.003 0.003 0.003 c 409.8 1735.1 m  373.5 1735.1 l  373.5 1672.8 l 
446.2 1672.8 l  446.2 1735.1 l  409.8 1735.1 l 
ps
0.003 0.402 0.800 c 664.6 1403.9 m  737.3 1403.9 l  737.3 1735.1 l 
664.6 1735.1 l  664.6 1403.9 l  p ef
0.003 0.003 0.003 c 700.9 1735.1 m  664.6 1735.1 l  664.6 1403.9 l 
737.3 1403.9 l  737.3 1735.1 l  700.9 1735.1 l 
ps
0.003 0.402 0.800 c 955.7 1600.5 m  1028.4 1600.5 l 
1028.4 1735.1 l  955.7 1735.1 l  955.7 1600.5 l 
p ef
0.003 0.003 0.003 c 992 1735.1 m  955.7 1735.1 l  955.7 1600.5 l 
1028.4 1600.5 l  1028.4 1735.1 l  992 1735.1 l 
ps
0.003 0.402 0.800 c 1246.8 1708.7 m  1319.5 1708.7 l 
1319.5 1735.1 l  1246.8 1735.1 l  1246.8 1708.7 l 
p ef
0.003 0.003 0.003 c 1283.1 1735.1 m  1246.8 1735.1 l  1246.8 1708.7 l 
1319.5 1708.7 l  1319.5 1735.1 l  1283.1 1735.1 l 
ps
0.003 0.402 0.800 c 1537.9 1460.1 m  1610.6 1460.1 l 
1610.6 1735.1 l  1537.9 1735.1 l  1537.9 1460.1 l 
p ef
0.003 0.003 0.003 c 1574.2 1735.1 m  1537.9 1735.1 l  1537.9 1460.1 l 
1610.6 1460.1 l  1610.6 1735.1 l  1574.2 1735.1 l 
ps
0.003 0.402 0.800 c 1829 1597.5 m  1901.7 1597.5 l  1901.7 1735.1 l 
1829 1735.1 l  1829 1597.5 l  p ef
0.003 0.003 0.003 c 1865.3 1735.1 m  1829 1735.1 l  1829 1597.5 l 
1901.7 1597.5 l  1901.7 1735.1 l  1865.3 1735.1 l 
ps
0.003 0.402 0.800 c 2120.09999 225.8 m  2192.8 225.8 l  2192.8 1735.1 l 
2120.09999 1735.1 l  2120.09999 225.8 l  p ef
0.003 0.003 0.003 c 2156.4 1735.1 m  2120.09999 1735.1 l  2120.09999 225.8 l 
2192.8 225.8 l  2192.8 1735.1 l  2156.4 1735.1 l 
ps
0.003 0.402 0.800 c 2411.2 1732.4 m  2483.9 1732.4 l 
2483.9 1735.1 l  2411.2 1735.1 l  2411.2 1732.4 l 
p ef
0.003 0.003 0.003 c 2447.5 1735.1 m  2411.2 1735.1 l  2411.2 1732.4 l 
2483.9 1732.4 l  2483.9 1735.1 l  2447.5 1735.1 l 
ps
0.003 0.402 0.800 c 2702.3 1477.2 m  2775 1477.2 l  2775 1735.1 l 
2702.3 1735.1 l  2702.3 1477.2 l  p ef
0.003 0.003 0.003 c 2738.6 1735.1 m  2702.3 1735.1 l  2702.3 1477.2 l 
2775 1477.2 l  2775 1735.1 l  2738.6 1735.1 l  ps
0.601 0.203 0.402 c 300.8 1733.3 m  373.5 1733.3 l 
373.5 1735.1 l  300.8 1735.1 l  300.8 1733.3 l 
p ef
0.003 0.003 0.003 c 337.1 1735.1 m  300.8 1735.1 l  300.8 1733.3 l 
373.5 1733.3 l  373.5 1735.1 l  337.1 1735.1 l 
ps
0.601 0.203 0.402 c 591.89999 1718.1 m  664.6 1718.1 l 
664.6 1735.1 l  591.89999 1735.1 l  591.89999 1718.1 l 
p ef
0.003 0.003 0.003 c 628.2 1735.1 m  591.89999 1735.1 l  591.89999 1718.1 l 
664.6 1718.1 l  664.6 1735.1 l  628.2 1735.1 l 
ps
0.601 0.203 0.402 c 883 1723.2 m  955.7 1723.2 l  955.7 1735.1 l 
883 1735.1 l  883 1723.2 l  p ef
0.003 0.003 0.003 c 919.3 1735.1 m  883 1735.1 l  883 1723.2 l 
955.7 1723.2 l  955.7 1735.1 l  919.3 1735.1 l 
ps
0.601 0.203 0.402 c 1174.1 1730.7 m  1246.8 1730.7 l 
1246.8 1735.1 l  1174.1 1735.1 l  1174.1 1730.7 l 
p ef
0.003 0.003 0.003 c 1210.4 1735.1 m  1174.1 1735.1 l  1174.1 1730.7 l 
1246.8 1730.7 l  1246.8 1735.1 l  1210.4 1735.1 l 
ps
0.601 0.203 0.402 c 1465.2 1695 m  1537.9 1695 l  1537.9 1735.1 l 
1465.2 1735.1 l  1465.2 1695 l  p ef
0.003 0.003 0.003 c 1501.5 1735.1 m  1465.2 1735.1 l  1465.2 1695 l 
1537.9 1695 l  1537.9 1735.1 l  1501.5 1735.1 l 
ps
0.601 0.203 0.402 c 1756.3 1726.8 m  1829 1726.8 l  1829 1735.1 l 
1756.3 1735.1 l  1756.3 1726.8 l  p ef
0.003 0.003 0.003 c 1792.6 1735.1 m  1756.3 1735.1 l  1756.3 1726.8 l 
1829 1726.8 l  1829 1735.1 l  1792.6 1735.1 l  ps
0.601 0.203 0.402 c 2047.4 1653 m  2120.09999 1653 l  2120.09999 1735.1 l 
2047.4 1735.1 l  2047.4 1653 l  p ef
0.003 0.003 0.003 c 2083.7 1735.1 m  2047.4 1735.1 l  2047.4 1653 l 
2120.09999 1653 l  2120.09999 1735.1 l  2083.7 1735.1 l 
ps
0.601 0.203 0.402 c 2338.5 1734.5 m  2411.2 1734.5 l 
2411.2 1735.1 l  2338.5 1735.1 l  2338.5 1734.5 l 
p ef
0.003 0.003 0.003 c 2374.8 1735.1 m  2338.5 1735.1 l  2338.5 1734.5 l 
2411.2 1734.5 l  2411.2 1735.1 l  2374.8 1735.1 l 
ps
0.601 0.203 0.402 c 2629.6 1722.9 m  2702.3 1722.9 l 
2702.3 1735.1 l  2629.6 1735.1 l  2629.6 1722.9 l 
p ef
0.003 0.003 0.003 c 2665.9 1735.1 m  2629.6 1735.1 l  2629.6 1722.9 l 
2702.3 1722.9 l  2702.3 1735.1 l  2665.9 1735.1 l 
ps
0.902 0.902 0.902 c 228.1 1731.1 m  300.8 1731.1 l 
300.8 1735.1 l  228.1 1735.1 l  228.1 1731.1 l 
p ef
0.003 0.003 0.003 c 264.4 1735.1 m  228.1 1735.1 l  228.1 1731.1 l 
300.8 1731.1 l  300.8 1735.1 l  264.4 1735.1 l 
ps
0.902 0.902 0.902 c 519.2 1724.9 m  591.89999 1724.9 l 
591.89999 1735.1 l  519.2 1735.1 l  519.2 1724.9 l 
p ef
0.003 0.003 0.003 c 555.5 1735.1 m  519.2 1735.1 l  519.2 1724.9 l 
591.89999 1724.9 l  591.89999 1735.1 l  555.5 1735.1 l 
ps
0.902 0.902 0.902 c 810.3 1730.9 m  883 1730.9 l  883 1735.1 l 
810.3 1735.1 l  810.3 1730.9 l  p ef
0.003 0.003 0.003 c 846.6 1735.1 m  810.3 1735.1 l  810.3 1730.9 l 
883 1730.9 l  883 1735.1 l  846.6 1735.1 l  ps
0.902 0.902 0.902 c 1101.4 1731.7 m  1174.1 1731.7 l 
1174.1 1735.1 l  1101.4 1735.1 l  1101.4 1731.7 l 
p ef
0.003 0.003 0.003 c 1137.7 1735.1 m  1101.4 1735.1 l  1101.4 1731.7 l 
1174.1 1731.7 l  1174.1 1735.1 l  1137.7 1735.1 l 
ps
0.902 0.902 0.902 c 1392.5 1731.2 m  1465.2 1731.2 l 
1465.2 1735.1 l  1392.5 1735.1 l  1392.5 1731.2 l 
p ef
0.003 0.003 0.003 c 1428.8 1735.1 m  1392.5 1735.1 l  1392.5 1731.2 l 
1465.2 1731.2 l  1465.2 1735.1 l  1428.8 1735.1 l 
ps
0.902 0.902 0.902 c 1683.6 1730.7 m  1756.3 1730.7 l 
1756.3 1735.1 l  1683.6 1735.1 l  1683.6 1730.7 l 
p ef
0.003 0.003 0.003 c 1719.9 1735.1 m  1683.6 1735.1 l  1683.6 1730.7 l 
1756.3 1730.7 l  1756.3 1735.1 l  1719.9 1735.1 l 
ps
0.902 0.902 0.902 c 1974.7 1728.5 m  2047.4 1728.5 l 
2047.4 1735.1 l  1974.7 1735.1 l  1974.7 1728.5 l 
p ef
0.003 0.003 0.003 c 2011 1735.1 m  1974.7 1735.1 l  1974.7 1728.5 l 
2047.4 1728.5 l  2047.4 1735.1 l  2011 1735.1 l 
ps
0.902 0.902 0.902 c 2265.8 1731.6 m  2338.5 1731.6 l 
2338.5 1735.1 l  2265.8 1735.1 l  2265.8 1731.6 l 
p ef
0.003 0.003 0.003 c 2302.09999 1735.1 m  2265.8 1735.1 l  2265.8 1731.6 l 
2338.5 1731.6 l  2338.5 1735.1 l  2302.09999 1735.1 l 
ps
0.902 0.902 0.902 c 2556.9 1730 m  2629.6 1730 l  2629.6 1735.1 l 
2556.9 1735.1 l  2556.9 1730 l  p ef
0.003 0.003 0.003 c 2593.2 1735.1 m  2556.9 1735.1 l  2556.9 1730 l 
2629.6 1730 l  2629.6 1735.1 l  2593.2 1735.1 l 
ps
191.8 1735.1 m  191.8 197.8 l  ps
191.8 1735.1 m  191.8 197.8 l  ps
176.8 1735.1 m  191.8 1735.1 l  ps
gs
pum
129.59999 1698 t 
2.7 37.5 m  2.7 31.8 3.4 27.2 4.4 23.6 ct 
5.7 20.1 7.4 17.4 9.7 15.5 ct 12.1 13.6 15 12.6 18.6 12.6 ct 
21.2 12.6 23.5 13.1 25.4 14.2 ct 27.4 15.2 29.1 16.8 30.3 18.69999 ct 
31.6 20.8 32.6 23.1 33.39999 25.9 ct 34.1 28.8 34.5 32.7 34.5 37.5 ct 
34.5 43.2 33.8 47.8 32.7 51.4 ct 31.5 54.8 29.7 57.5 27.4 59.4 ct 
25.1 61.4 22.1 62.4 18.6 62.4 ct 13.8 62.4 10.2 60.6 7.6 57.3 ct 
4.29999 53.3 l  2.7 46.6 l  p
8.8 37.5 m  8.8 45.5 9.7 50.8 11.6 53.4 ct 
13.6 56.1 15.9 57.3 18.6 57.3 ct 21.3 57.3 23.6 56.1 25.5 53.4 ct 
27.4 50.8 28.2 45.5 28.2 37.5 ct 28.2 29.5 27.4 24.2 25.5 21.6 ct 
23.6 18.9 21.3 17.6 18.4 17.6 ct 15.7 17.6 13.6 18.69999 11.9 21 ct 
9.9 24 l  8.8 29.5 l  p ef
pom
pum
129.59999 1698 t 
2.7 37.5 m  2.7 31.8 3.4 27.2 4.4 23.6 ct 
5.7 20.1 7.4 17.4 9.7 15.5 ct 12.1 13.6 15 12.6 18.6 12.6 ct 
21.2 12.6 23.5 13.1 25.4 14.2 ct 27.4 15.2 29.1 16.8 30.3 18.69999 ct 
31.6 20.8 32.6 23.1 33.39999 25.9 ct 34.1 28.8 34.5 32.7 34.5 37.5 ct 
34.5 43.2 33.8 47.8 32.7 51.4 ct 31.5 54.8 29.7 57.5 27.4 59.4 ct 
25.1 61.4 22.1 62.4 18.6 62.4 ct 13.8 62.4 10.2 60.6 7.6 57.3 ct 
4.29999 53.3 l  2.7 46.6 l  p
8.8 37.5 m  8.8 45.5 9.7 50.8 11.6 53.4 ct 
13.6 56.1 15.9 57.3 18.6 57.3 ct 21.3 57.3 23.6 56.1 25.5 53.4 ct 
27.4 50.8 28.2 45.5 28.2 37.5 ct 28.2 29.5 27.4 24.2 25.5 21.6 ct 
23.6 18.9 21.3 17.6 18.4 17.6 ct 15.7 17.6 13.6 18.69999 11.9 21 ct 
9.9 24 l  8.8 29.5 l  p ef
pom
gr
176.8 1564.3 m  191.8 1564.3 l  ps
gs
pum
92.6 1526 t 
25.2 61.6 m  19.3 61.6 l  19.3 23.3 l  17.8 24.8 15.9 26.2 13.6 27.6 ct 
11.2 28.9 9.2 29.9 7.3 30.6 ct 7.3 24.8 l 
10.7 23.2 13.6 21.3 16 19.1 ct 18.6 17 20.4 14.8 21.3 12.6 ct 
25.2 12.6 l  p ef
pom
pum
129.9 1526 t 
2.7 37.5 m  2.7 31.8 3.4 27.2 4.4 23.6 ct 
5.7 20.1 7.4 17.4 9.7 15.5 ct 12.1 13.6 15 12.6 18.6 12.6 ct 
21.2 12.6 23.5 13.1 25.4 14.2 ct 27.4 15.2 29.1 16.8 30.3 18.69999 ct 
31.6 20.8 32.6 23.1 33.39999 25.9 ct 34.1 28.8 34.5 32.7 34.5 37.5 ct 
34.5 43.2 33.8 47.8 32.7 51.4 ct 31.5 54.8 29.7 57.5 27.4 59.4 ct 
25.1 61.4 22.1 62.4 18.6 62.4 ct 13.8 62.4 10.2 60.6 7.6 57.3 ct 
4.29999 53.3 l  2.7 46.6 l  p
8.8 37.5 m  8.8 45.5 9.7 50.8 11.6 53.4 ct 
13.6 56.1 15.9 57.3 18.6 57.3 ct 21.3 57.3 23.6 56.1 25.5 53.4 ct 
27.4 50.8 28.2 45.5 28.2 37.5 ct 28.2 29.5 27.4 24.2 25.5 21.6 ct 
23.6 18.9 21.3 17.6 18.4 17.6 ct 15.7 17.6 13.6 18.69999 11.9 21 ct 
9.9 24 l  8.8 29.5 l  p ef
pom
gr
176.8 1393.5 m  191.8 1393.5 l  ps
gs
pum
92.6 1354.1 t 
34.1 55.7 m  34.1 61.6 l  2 61.6 l  1.9 60.1 2.1 58.7 2.7 57.3 ct 
3.5 55.2 4.7 53 6.6 50.8 ct 8.4 48.8 11 46.3 14.4 43.5 ct 
19.7 39.1 23.2 35.7 25.1 33.1 ct 27 30.7 28 28.2 28 26.1 ct 
28 23.6 27 21.6 25.4 19.9 ct 23.6 18.3 21.4 17.6 18.69999 17.6 ct 
15.9 17.6 13.6 18.4 11.8 20.2 ct 10.2 21.8 9.2 24.3 9.2 27.3 ct 
3.1 26.7 l  3.5 22.1 5.1 18.6 7.8 16.3 ct 
10.6 13.8 14.2 12.6 18.9 12.6 ct 23.5 12.6 27.3 14 30 16.5 ct 
32.7 19.1 34.1 22.3 34.1 26.1 ct 34.1 28.1 33.7 30 32.89999 31.9 ct 
32 33.8 30.7 35.7 28.9 37.8 ct 27 39.9 24 42.8 19.7 46.3 ct 
16.1 49.5 13.8 51.5 12.7 52.4 ct 11.8 53.5 11 54.6 10.3 55.7 ct 
p ef
pom
pum
129.9 1354.1 t 
2.7 37.5 m  2.7 31.8 3.4 27.2 4.4 23.6 ct 
5.7 20.1 7.4 17.4 9.7 15.5 ct 12.1 13.6 15 12.6 18.6 12.6 ct 
21.2 12.6 23.5 13.1 25.4 14.2 ct 27.4 15.2 29.1 16.8 30.3 18.69999 ct 
31.6 20.8 32.6 23.1 33.39999 25.9 ct 34.1 28.8 34.5 32.7 34.5 37.5 ct 
34.5 43.2 33.8 47.8 32.7 51.4 ct 31.5 54.8 29.7 57.5 27.4 59.4 ct 
25.1 61.4 22.1 62.4 18.6 62.4 ct 13.8 62.4 10.2 60.6 7.6 57.3 ct 
4.29999 53.3 l  2.7 46.6 l  p
8.8 37.5 m  8.8 45.5 9.7 50.8 11.6 53.4 ct 
13.6 56.1 15.9 57.3 18.6 57.3 ct 21.3 57.3 23.6 56.1 25.5 53.4 ct 
27.4 50.8 28.2 45.5 28.2 37.5 ct 28.2 29.5 27.4 24.2 25.5 21.6 ct 
23.6 18.9 21.3 17.6 18.4 17.6 ct 15.7 17.6 13.6 18.69999 11.9 21 ct 
9.9 24 l  8.8 29.5 l  p ef
pom
gr
176.8 1222.7 m  191.8 1222.7 l  ps
gs
pum
92.6 1184.7 t 
2.8 48.6 m  8.7 47.8 l  9.3 51.2 10.6 53.7 12.2 55.2 ct 
13.8 56.7 15.9 57.3 18.3 57.3 ct 21 57.3 23.5 56.4 25.4 54.5 ct 
27.3 52.6 28.2 50.1 28.2 47.3 ct 28.2 44.6 27.4 42.2 25.5 40.5 ct 
23.8 38.7 21.6 37.8 18.69999 37.8 ct 17.6 37.8 16.3 38 14.5 38.4 ct 
15.2 33.1 l  15.6 33.3 15.9 33.3 16.1 33.3 ct 
18.69999 33.3 21 32.6 23.1 31.2 ct 25.1 30 26.1 28 26.1 25.1 ct 
26.1 22.9 25.4 21.2 23.9 19.7 ct 22.4 18.3 20.5 17.5 18.19999 17.5 ct 
15.7 17.5 13.8 18.3 12.3 19.7 ct 10.7 21.2 9.7 23.3 9.3 26.3 ct 
3.4 25.2 l  4 21.2 5.7 18.19999 8.4 15.9 ct 
11 13.7 14.1 12.6 18 12.6 ct 20.6 12.6 23.1 13.1 25.4 14.4 ct 
27.6 15.5 29.3 17.1 30.4 19 ct 31.6 20.9 32.2 23.1 32.2 25.2 ct 
32.2 27.4 31.6 29.3 30.6 31 ct 29.5 32.7 27.7 34.1 25.5 35.2 ct 
28.4 35.89999 30.7 37.2 32.2 39.3 ct 33.8 41.3 34.6 44 34.6 47.1 ct 
34.6 51.4 33 55 30 57.9 ct 26.9 60.9 22.9 62.4 18.19999 62.4 ct 
14 62.4 10.4 61 7.6 58.6 ct 4.7 56 l  3.1 52.7 l 
p ef
pom
pum
129.9 1184.7 t 
2.7 37.5 m  2.7 31.8 3.4 27.2 4.4 23.6 ct 
5.7 20.1 7.4 17.4 9.7 15.5 ct 12.1 13.6 15 12.6 18.6 12.6 ct 
21.2 12.6 23.5 13.1 25.4 14.2 ct 27.4 15.2 29.1 16.8 30.3 18.69999 ct 
31.6 20.8 32.6 23.1 33.39999 25.9 ct 34.1 28.8 34.5 32.7 34.5 37.5 ct 
34.5 43.2 33.8 47.8 32.7 51.4 ct 31.5 54.8 29.7 57.5 27.4 59.4 ct 
25.1 61.4 22.1 62.4 18.6 62.4 ct 13.8 62.4 10.2 60.6 7.6 57.3 ct 
4.29999 53.3 l  2.7 46.6 l  p
8.8 37.5 m  8.8 45.5 9.7 50.8 11.6 53.4 ct 
13.6 56.1 15.9 57.3 18.6 57.3 ct 21.3 57.3 23.6 56.1 25.5 53.4 ct 
27.4 50.8 28.2 45.5 28.2 37.5 ct 28.2 29.5 27.4 24.2 25.5 21.6 ct 
23.6 18.9 21.3 17.6 18.4 17.6 ct 15.7 17.6 13.6 18.69999 11.9 21 ct 
9.9 24 l  8.8 29.5 l  p ef
pom
gr
176.8 1051.9 m  191.8 1051.9 l  ps
gs
pum
92.6 1012.8 t 
21.8 61.6 m  21.8 49.9 l  0.8 49.9 l  0.8 44.4 l 
22.9 12.9 l  27.8 12.9 l  27.8 44.4 l  34.39999 44.4 l 
34.39999 49.9 l  27.8 49.9 l  27.8 61.6 l  p
21.8 44.4 m  21.8 22.4 l  6.6 44.4 l  p ef
pom
pum
129.9 1012.8 t 
2.7 37.5 m  2.7 31.8 3.4 27.2 4.4 23.6 ct 
5.7 20.1 7.4 17.4 9.7 15.5 ct 12.1 13.6 15 12.6 18.6 12.6 ct 
21.2 12.6 23.5 13.1 25.4 14.2 ct 27.4 15.2 29.1 16.8 30.3 18.69999 ct 
31.6 20.8 32.6 23.1 33.39999 25.9 ct 34.1 28.8 34.5 32.7 34.5 37.5 ct 
34.5 43.2 33.8 47.8 32.7 51.4 ct 31.5 54.8 29.7 57.5 27.4 59.4 ct 
25.1 61.4 22.1 62.4 18.6 62.4 ct 13.8 62.4 10.2 60.6 7.6 57.3 ct 
4.29999 53.3 l  2.7 46.6 l  p
8.8 37.5 m  8.8 45.5 9.7 50.8 11.6 53.4 ct 
13.6 56.1 15.9 57.3 18.6 57.3 ct 21.3 57.3 23.6 56.1 25.5 53.4 ct 
27.4 50.8 28.2 45.5 28.2 37.5 ct 28.2 29.5 27.4 24.2 25.5 21.6 ct 
23.6 18.9 21.3 17.6 18.4 17.6 ct 15.7 17.6 13.6 18.69999 11.9 21 ct 
9.9 24 l  8.8 29.5 l  p ef
pom
gr
176.8 881 m  191.8 881 l  ps
gs
pum
92.6 843.4 t 
2.7 48.8 m  8.9 48.2 l  9.5 51.2 10.6 53.5 12.2 55.2 ct 
14 56.7 16 57.3 18.3 57.3 ct 21.2 57.3 23.6 56.4 25.7 54.2 ct 
27.7 52 28.6 49 28.6 45.5 ct 28.6 42.1 27.7 39.4 25.8 37.5 ct 
23.9 35.39999 21.3 34.5 18.3 34.5 ct 16.3 34.5 14.6 34.89999 13 35.89999 ct 
11.5 36.7 10.3 37.8 9.3 39.3 ct 3.8 38.4 l 
8.5 13.4 l  32.7 13.4 l  32.7 19.1 l  13.3 19.1 l 
10.7 32.3 l  13.6 30.3 16.69999 29.2 19.8 29.2 ct 
24 29.2 27.7 30.7 30.6 33.7 ct 33.5 36.5 35 40.3 35 45 ct 
35 49.5 33.7 53.3 31.1 56.4 ct 28 60.3 23.8 62.4 18.3 62.4 ct 
14 62.4 10.3 61.2 7.6 58.6 ct 4.7 56.1 l 
3.1 52.9 l  p ef
pom
pum
129.9 843.4 t 
2.7 37.5 m  2.7 31.8 3.4 27.2 4.4 23.6 ct 
5.7 20.1 7.4 17.4 9.7 15.5 ct 12.1 13.6 15 12.6 18.6 12.6 ct 
21.2 12.6 23.5 13.1 25.4 14.2 ct 27.4 15.2 29.1 16.8 30.3 18.69999 ct 
31.6 20.8 32.6 23.1 33.39999 25.9 ct 34.1 28.8 34.5 32.7 34.5 37.5 ct 
34.5 43.2 33.8 47.8 32.7 51.4 ct 31.5 54.8 29.7 57.5 27.4 59.4 ct 
25.1 61.4 22.1 62.4 18.6 62.4 ct 13.8 62.4 10.2 60.6 7.6 57.3 ct 
4.29999 53.3 l  2.7 46.6 l  p
8.8 37.5 m  8.8 45.5 9.7 50.8 11.6 53.4 ct 
13.6 56.1 15.9 57.3 18.6 57.3 ct 21.3 57.3 23.6 56.1 25.5 53.4 ct 
27.4 50.8 28.2 45.5 28.2 37.5 ct 28.2 29.5 27.4 24.2 25.5 21.6 ct 
23.6 18.9 21.3 17.6 18.4 17.6 ct 15.7 17.6 13.6 18.69999 11.9 21 ct 
9.9 24 l  8.8 29.5 l  p ef
pom
gr
176.8 710.2 m  191.8 710.2 l  ps
gs
pum
92.6 671.4 t 
33.7 24.7 m  27.8 25.2 l  27.3 22.8 26.5 21.2 25.5 20.1 ct 
23.9 18.4 21.8 17.5 19.5 17.5 ct 17.6 17.5 16 18 14.5 19.1 ct 
12.6 20.5 11.1 22.5 10 25.1 ct 8.9 27.8 8.4 31.5 8.4 36.39999 ct 
9.9 34.2 11.6 32.6 13.7 31.5 ct 15.7 30.4 17.9 29.9 20.2 29.9 ct 
24.2 29.9 27.6 31.4 30.4 34.39999 ct 33.1 37.2 34.6 41 34.6 45.6 ct 
34.6 48.8 34 51.6 32.6 54.2 ct 31.2 56.8 29.5 58.8 27.2 60.2 ct 
24.8 61.6 22.3 62.4 19.4 62.4 ct 14.4 62.4 10.3 60.5 7.2 56.8 ct 
4 53.1 2.4 47.1 2.4 38.7 ct 2.4 29.3 4.2 22.5 7.7 18.19999 ct 
10.7 14.5 14.8 12.6 19.9 12.6 ct 23.8 12.6 26.9 13.7 29.3 15.9 ct 
31.8 18 l  33.3 20.9 l  p
9.3 45.8 m  9.3 47.8 9.7 49.7 10.6 51.6 ct 
11.5 53.5 12.7 54.9 14.2 56 ct 15.9 56.9 17.5 57.3 19.3 57.3 ct 
21.7 57.3 23.9 56.4 25.8 54.4 ct 27.6 52.3 28.5 49.6 28.5 46.1 ct 
28.5 42.7 27.6 40.1 25.8 38.2 ct 24 36.1 21.7 35.2 19 35.2 ct 
16.3 35.2 14 36.1 12.2 38.2 ct 10.3 40.1 l 
9.3 42.5 l  p ef
pom
pum
129.9 671.4 t 
2.7 37.5 m  2.7 31.8 3.4 27.2 4.4 23.6 ct 
5.7 20.1 7.4 17.4 9.7 15.5 ct 12.1 13.6 15 12.6 18.6 12.6 ct 
21.2 12.6 23.5 13.1 25.4 14.2 ct 27.4 15.2 29.1 16.8 30.3 18.69999 ct 
31.6 20.8 32.6 23.1 33.39999 25.9 ct 34.1 28.8 34.5 32.7 34.5 37.5 ct 
34.5 43.2 33.8 47.8 32.7 51.4 ct 31.5 54.8 29.7 57.5 27.4 59.4 ct 
25.1 61.4 22.1 62.4 18.6 62.4 ct 13.8 62.4 10.2 60.6 7.6 57.3 ct 
4.29999 53.3 l  2.7 46.6 l  p
8.8 37.5 m  8.8 45.5 9.7 50.8 11.6 53.4 ct 
13.6 56.1 15.9 57.3 18.6 57.3 ct 21.3 57.3 23.6 56.1 25.5 53.4 ct 
27.4 50.8 28.2 45.5 28.2 37.5 ct 28.2 29.5 27.4 24.2 25.5 21.6 ct 
23.6 18.9 21.3 17.6 18.4 17.6 ct 15.7 17.6 13.6 18.69999 11.9 21 ct 
9.9 24 l  8.8 29.5 l  p ef
pom
gr
176.8 539.39999 m  191.8 539.39999 l  ps
gs
pum
92.6 502.1 t 
3.1 19.1 m  3.1 13.4 l  34.6 13.4 l  34.6 18 l 
31.5 21.4 28.5 25.8 25.4 31.2 ct 22.4 36.7 19.9 42.4 18.3 48.1 ct 
17.1 52.2 16.4 56.7 16 61.6 ct 9.9 61.6 l 
10 57.6 10.7 53 12.2 47.6 ct 13.6 42.2 15.7 36.89999 18.3 31.9 ct 
21 26.9 23.9 22.7 26.9 19.1 ct p ef
pom
pum
129.9 502.1 t 
2.7 37.5 m  2.7 31.8 3.4 27.2 4.4 23.6 ct 
5.7 20.1 7.4 17.4 9.7 15.5 ct 12.1 13.6 15 12.6 18.6 12.6 ct 
21.2 12.6 23.5 13.1 25.4 14.2 ct 27.4 15.2 29.1 16.8 30.3 18.69999 ct 
31.6 20.8 32.6 23.1 33.39999 25.9 ct 34.1 28.8 34.5 32.7 34.5 37.5 ct 
34.5 43.2 33.8 47.8 32.7 51.4 ct 31.5 54.8 29.7 57.5 27.4 59.4 ct 
25.1 61.4 22.1 62.4 18.6 62.4 ct 13.8 62.4 10.2 60.6 7.6 57.3 ct 
4.29999 53.3 l  2.7 46.6 l  p
8.8 37.5 m  8.8 45.5 9.7 50.8 11.6 53.4 ct 
13.6 56.1 15.9 57.3 18.6 57.3 ct 21.3 57.3 23.6 56.1 25.5 53.4 ct 
27.4 50.8 28.2 45.5 28.2 37.5 ct 28.2 29.5 27.4 24.2 25.5 21.6 ct 
23.6 18.9 21.3 17.6 18.4 17.6 ct 15.7 17.6 13.6 18.69999 11.9 21 ct 
9.9 24 l  8.8 29.5 l  p ef
pom
gr
176.8 368.6 m  191.8 368.6 l  ps
gs
pum
92.6 330.1 t 
11.9 35 m  9.5 34.2 7.6 32.89999 6.3 31.2 ct 
5.3 29.5 4.6 27.6 4.6 25.1 ct 4.6 21.6 5.9 18.6 8.4 16.3 ct 
11 13.8 14.4 12.6 18.6 12.6 ct 22.8 12.6 26.2 13.8 28.8 16.3 ct 
31.4 18.69999 32.7 21.8 32.7 25.4 ct 32.7 27.6 32.2 29.6 31 31.2 ct 
29.7 32.89999 28 34.2 25.5 35 ct 28.5 36.1 30.8 37.6 32.3 39.8 ct 
34 42 34.8 44.6 34.8 47.6 ct 34.8 51.8 33.3 55.3 30.3 58 ct 
27.3 60.9 23.5 62.4 18.69999 62.4 ct 13.8 62.4 10 60.9 7 58 ct 
4.2 55.2 2.7 51.6 2.7 47.4 ct 2.7 44.3 3.5 41.6 5 39.5 ct 
6.6 37.39999 l  8.9 35.89999 l  p
10.7 25 m  10.7 27.3 11.5 29.2 12.9 30.6 ct 
14.4 32 16.4 32.89999 18.69999 32.89999 ct 21 32.89999 22.9 32 24.4 30.7 ct 
25.8 29.2 26.6 27.4 26.6 25.2 ct 26.6 23.1 25.8 21.3 24.3 19.8 ct 
22.8 18.3 20.9 17.5 18.6 17.5 ct 16.4 17.5 14.5 18.3 13 19.7 ct 
11.5 21.2 l  10.7 22.9 l  p
8.8 47.4 m  8.8 49.2 9.2 50.8 10 52.4 ct 
10.8 53.9 12.1 55.2 13.6 56.1 ct 15.2 56.9 17 57.3 18.69999 57.3 ct 
21.6 57.3 24 56.5 25.8 54.6 ct 27.7 52.9 28.6 50.5 28.6 47.7 ct 
28.6 44.8 27.7 42.4 25.8 40.5 ct 23.8 38.6 21.4 37.6 18.6 37.6 ct 
15.7 37.6 13.4 38.6 11.5 40.5 ct 9.7 42.4 l 
8.8 44.7 l  p ef
pom
pum
129.9 330.1 t 
2.7 37.5 m  2.7 31.8 3.4 27.2 4.4 23.6 ct 
5.7 20.1 7.4 17.4 9.7 15.5 ct 12.1 13.6 15 12.6 18.6 12.6 ct 
21.2 12.6 23.5 13.1 25.4 14.2 ct 27.4 15.2 29.1 16.8 30.3 18.69999 ct 
31.6 20.8 32.6 23.1 33.39999 25.9 ct 34.1 28.8 34.5 32.7 34.5 37.5 ct 
34.5 43.2 33.8 47.8 32.7 51.4 ct 31.5 54.8 29.7 57.5 27.4 59.4 ct 
25.1 61.4 22.1 62.4 18.6 62.4 ct 13.8 62.4 10.2 60.6 7.6 57.3 ct 
4.29999 53.3 l  2.7 46.6 l  p
8.8 37.5 m  8.8 45.5 9.7 50.8 11.6 53.4 ct 
13.6 56.1 15.9 57.3 18.6 57.3 ct 21.3 57.3 23.6 56.1 25.5 53.4 ct 
27.4 50.8 28.2 45.5 28.2 37.5 ct 28.2 29.5 27.4 24.2 25.5 21.6 ct 
23.6 18.9 21.3 17.6 18.4 17.6 ct 15.7 17.6 13.6 18.69999 11.9 21 ct 
9.9 24 l  8.8 29.5 l  p ef
pom
gr
176.8 197.7 m  191.8 197.7 l  ps
gs
pum
92.6 158.2 t 
3.6 50.3 m  9.3 49.7 l  9.9 52.4 10.8 54.4 12.2 55.6 ct 
13.6 56.8 15.3 57.3 17.4 57.3 ct 19.3 57.3 20.9 56.9 22.3 56.1 ct 
23.6 55.3 24.7 54.2 25.7 52.7 ct 26.5 51.4 27.3 49.5 27.8 47.1 ct 
28.5 44.7 28.8 42.2 28.8 39.8 ct 28.8 39.5 28.8 39.1 28.8 38.6 ct 
27.6 40.5 25.9 42 23.9 43.2 ct 21.7 44.4 19.5 45 17.1 45 ct 
13.1 45 9.7 43.5 6.9 40.6 ct 4.2 37.6 2.7 33.8 2.7 29.1 ct 
2.7 24.2 4.2 20.1 7 17.1 ct 10 14.1 13.7 12.6 18 12.6 ct 
21.2 12.6 24 13.4 26.7 15.2 ct 29.3 16.8 31.4 19.3 32.7 22.5 ct 
34.1 25.7 34.8 30.1 34.8 36.1 ct 34.8 42.4 34.1 47.3 32.7 51 ct 
31.4 54.8 29.3 57.5 26.6 59.4 ct 24 61.4 20.9 62.4 17.19999 62.4 ct 
13.4 62.4 10.4 61.3 8 59.1 ct 5.5 57.1 l 
4 54.1 l  p
28.1 28.8 m  28.1 25.4 27.2 22.7 25.4 20.6 ct 
23.5 18.6 21.3 17.6 18.69999 17.6 ct 16.1 17.6 13.8 18.6 11.8 20.8 ct 
9.9 22.9 8.8 25.8 8.8 29.2 ct 8.8 32.3 9.7 34.89999 11.6 36.8 ct 
13.6 38.7 15.9 39.7 18.6 39.7 ct 21.3 39.7 23.6 38.7 25.4 36.8 ct 
27.2 34.89999 l  28.1 32.2 l  p ef
pom
pum
129.9 158.2 t 
2.7 37.5 m  2.7 31.8 3.4 27.2 4.4 23.6 ct 
5.7 20.1 7.4 17.4 9.7 15.5 ct 12.1 13.6 15 12.6 18.6 12.6 ct 
21.2 12.6 23.5 13.1 25.4 14.2 ct 27.4 15.2 29.1 16.8 30.3 18.69999 ct 
31.6 20.8 32.6 23.1 33.39999 25.9 ct 34.1 28.8 34.5 32.7 34.5 37.5 ct 
34.5 43.2 33.8 47.8 32.7 51.4 ct 31.5 54.8 29.7 57.5 27.4 59.4 ct 
25.1 61.4 22.1 62.4 18.6 62.4 ct 13.8 62.4 10.2 60.6 7.6 57.3 ct 
4.29999 53.3 l  2.7 46.6 l  p
8.8 37.5 m  8.8 45.5 9.7 50.8 11.6 53.4 ct 
13.6 56.1 15.9 57.3 18.6 57.3 ct 21.3 57.3 23.6 56.1 25.5 53.4 ct 
27.4 50.8 28.2 45.5 28.2 37.5 ct 28.2 29.5 27.4 24.2 25.5 21.6 ct 
23.6 18.9 21.3 17.6 18.4 17.6 ct 15.7 17.6 13.6 18.69999 11.9 21 ct 
9.9 24 l  8.8 29.5 l  p ef
pom
gr
1420 180.9 m  577.2 180.9 l  577.2 73.2 l  2262.9 73.2 l 
2262.9 180.9 l  1420 180.9 l  ps
0.902 0.902 0.902 c 596.8 99.3 m  655.6 99.3 l  655.6 158.1 l 
596.8 158.1 l  596.8 99.3 l  p ef
0.003 0.003 0.003 c 626.2 158.1 m  596.8 158.1 l  596.8 99.3 l 
655.6 99.3 l  655.6 158.1 l  626.2 158.1 l 
ps
gs
pum
674.7 92.8 t 
3.4 56.8 m  3.4 50.8 l  9 53.5 14.7 54.8 20.1 54.8 ct 
26.3 54.8 29.4 52.6 29.4 48 ct 29.4 45.7 28.6 43.9 26.9 42.7 ct 
25.5 41.9 23.4 40.9 20.4 40 ct 14.7 38.1 l 
7.3 35.6 3.6 31.6 3.6 26.1 ct 3.6 18.4 8.8 14.7 19.2 14.7 ct 
23.6 14.7 28.2 15.3 33.1 16.6 ct 33.1 22.1 l 
28 20.2 23.3 19.2 18.8 19.2 ct 12.6 19.2 9.4 21.4 9.4 25.6 ct 
9.4 27.3 10 28.6 11.1 29.6 ct 12.3 30.7 14.6 31.8 17.5 32.7 ct 
23.5 34.6 l  28 36.1 31 37.8 32.89999 39.6 ct 34.7 41.5 35.6 44 35.6 47.1 ct 
35.6 50.8 34.2 53.9 31.4 56 ct 28.7 58.3 24.8 59.4 19.9 59.4 ct 
15 59.4 l  9.6 58.5 l  p ef
pom
pum
713.6 92.8 t 
22.6 58.4 m  22.6 52.5 l  21.2 54.4 19.7 55.9 18.4 56.8 ct 
16.4 58.4 14.3 59.1 12 59.1 ct 6.7 59.1 4 55.9 4 49.5 ct 
4 27 l  9.6 27 l  9.6 47.7 l  9.6 50.3 9.8 51.9 10.4 52.8 ct 
10.9 53.7 12 54.1 13.4 54.1 ct 16.6 54.1 19.5 51.9 22.6 47.3 ct 
22.6 27 l  28.2 27 l  28.2 58.4 l  p ef
pom
pum
746.7 92.8 t 
4.29999 58.4 m  4.29999 27 l  10 27 l  10 32.89999 l  11.4 31 12.8 29.5 14.1 28.6 ct 
16.1 27.2 18.3 26.5 20.7 26.5 ct 25.9 26.5 28.6 29.5 28.6 35.89999 ct 
28.6 58.4 l  22.9 58.4 l  22.9 37.8 l  22.9 35.2 22.6 33.5 22.1 32.6 ct 
21.5 31.8 20.6 31.3 19.2 31.3 ct 16 31.3 12.9 33.5 10 38.1 ct 
10 58.4 l  p ef
pom
pum
779.7 92.8 t 
pom
pum
795.8 92.8 t 
1.2 65 m  1.2 59.8 l  4.5 61.2 7.6 62 10.6 62 ct 
13.7 62 15.9 61.2 16.8 59.7 ct 17.6 58.4 18 56.3 18 53.2 ct 
18 15.7 l  24.1 15.7 l  24.1 53 l  24.1 62.1 19.4 66.9 10.2 66.9 ct 
7.1 66.9 l  4.2 66.29999 l  p ef
pom
pum
825.4 92.8 t 
4.7 58.4 m  4.7 15.7 l  18.3 15.7 l  32.6 15.7 39.8 22.6 39.8 36.1 ct 
39.8 43.1 37.89999 48.6 34.1 52.5 ct 30.5 56.4 25.2 58.4 18.3 58.4 ct 
p
10.7 53.8 m  18 53.8 l  28.2 53.8 33.3 48.1 33.3 36.7 ct 
33.3 30.1 31.3 25.4 27.2 22.6 ct 26 21.7 24.6 21.3 23 20.9 ct 
21 20.4 18.4 20.3 15.1 20.3 ct 10.7 20.3 l 
p ef
pom
pum
868.6 92.8 t 
5.4 58.4 m  5.4 15.7 l  11 15.7 l  11 36.7 l 
28.7 15.7 l  34.8 15.7 l  17.6 36.1 l  37.8 58.4 l 
30.1 58.4 l  11 36.7 l  11 58.4 l  p ef
pom
pum
908.4 92.8 t 
pom
pum
924.5 92.8 t 
6.5 58.4 m  6.5 54 l  15 54 l  15 20.4 l  6.5 22.6 l 
6.5 18.19999 l  20.7 14.7 l  20.7 54 l  29.3 54 l 
29.3 58.4 l  p ef
pom
pum
957.5 92.8 t 
4.5 58.4 m  4.5 51.2 l  11.6 51.2 l  11.6 58.4 l 
p ef
pom
pum
973.6 92.8 t 
19.6 58.4 m  19.6 46.2 l  0.8 46.2 l  0.8 42 l 
19.6 15.7 l  25 15.7 l  25 41.7 l  30.7 41.7 l 
30.7 46.2 l  25 46.2 l  25 58.4 l  p
6.3 41.7 m  20.1 41.7 l  20.1 22.7 l  p ef
pom
gr
0.601 0.203 0.402 c 1152.2 99.3 m  1211 99.3 l  1211 158.1 l 
1152.2 158.1 l  1152.2 99.3 l  p ef
0.003 0.003 0.003 c 1181.6 158.1 m  1152.2 158.1 l  1152.2 99.3 l 
1211 99.3 l  1211 158.1 l  1181.6 158.1 l  ps
gs
pum
1230.3 92.8 t 
1.2 65 m  1.2 59.8 l  4.5 61.2 7.6 62 10.6 62 ct 
13.7 62 15.9 61.2 16.8 59.7 ct 17.6 58.4 18 56.3 18 53.2 ct 
18 15.7 l  24.1 15.7 l  24.1 53 l  24.1 62.1 19.4 66.9 10.2 66.9 ct 
7.1 66.9 l  4.2 66.29999 l  p ef
pom
pum
1259.9 92.8 t 
4.7 58.4 m  4.7 15.7 l  10.6 15.7 l  32.5 48.6 l 
32.5 15.7 l  37.6 15.7 l  37.6 58.4 l  31.8 58.4 l 
9.8 25.4 l  9.8 58.4 l  p ef
pom
pum
1302.3 92.8 t 
22.6 58.4 m  22.6 52.5 l  21.2 54.4 19.7 55.9 18.4 56.8 ct 
16.4 58.4 14.3 59.1 12 59.1 ct 6.7 59.1 4 55.9 4 49.5 ct 
4 27 l  9.6 27 l  9.6 47.7 l  9.6 50.3 9.8 51.9 10.4 52.8 ct 
10.9 53.7 12 54.1 13.4 54.1 ct 16.6 54.1 19.5 51.9 22.6 47.3 ct 
22.6 27 l  28.2 27 l  28.2 58.4 l  p ef
pom
pum
1335.3 92.8 t 
4.29999 58.4 m  4.29999 12.9 l  10 12.9 l  10 42.2 l 
20.4 27 l  25.9 27 l  15.9 41.9 l  28.8 58.4 l 
22 58.4 l  10 42.4 l  10 58.4 l  p ef
pom
pum
1364.9 92.8 t 
23.4 39.3 m  23.4 37.39999 23.2 36 22.8 35.1 ct 
21.9 32.1 19.6 30.6 16.3 30.6 ct 14 30.6 12.2 31.3 10.9 32.7 ct 
9.5 34 8.8 36.2 8.4 39.3 ct p
29 52.8 m  29 57.3 l  25.2 58.5 21.6 59.1 18.3 59.1 ct 
13.4 59.1 9.6 57.6 6.7 54.5 ct 3.8 51.4 2.4 47.4 2.4 42.4 ct 
2.4 37.39999 3.6 33.6 6.2 30.7 ct 8.7 27.9 12.2 26.5 16.4 26.5 ct 
21.5 26.5 24.9 28.1 27 31.6 ct 28.6 34.3 29.3 37.6 29.2 41.9 ct 
29.2 43.7 l  8.3 43.7 l  8.5 45.9 8.9 47.7 9.5 48.8 ct 
11.1 52.7 14.4 54.7 19.5 54.7 ct 22.4 54.7 l 
25.5 54.1 l  p ef
pom
pum
1397.9 92.8 t 
pom
pum
1414 92.8 t 
17.4 58.4 m  0.9 15.7 l  7.1 15.7 l  20.7 50.7 l 
33.8 15.7 l  38.8 15.7 l  23 58.4 l  p ef
pom
pum
1453.8 92.8 t 
4.7 58.4 m  4.7 15.7 l  13 15.7 l  24.7 48.7 l 
36.7 15.7 l  44.2 15.7 l  44.2 58.4 l  38.6 58.4 l 
38.6 23.7 l  26.9 55.4 l  21.2 55.4 l  9.8 23.6 l 
9.8 58.4 l  p ef
pom
gr
0.003 0.402 0.800 c 1707.6 99.3 m  1766.4 99.3 l  1766.4 158.1 l 
1707.6 158.1 l  1707.6 99.3 l  p ef
0.003 0.003 0.003 c 1737 158.1 m  1707.6 158.1 l  1707.6 99.3 l 
1766.4 99.3 l  1766.4 158.1 l  1737 158.1 l  ps
gs
pum
1785.9 92.8 t 
1.2 65 m  1.2 59.8 l  4.5 61.2 7.6 62 10.6 62 ct 
13.7 62 15.9 61.2 16.8 59.7 ct 17.6 58.4 18 56.3 18 53.2 ct 
18 15.7 l  24.1 15.7 l  24.1 53 l  24.1 62.1 19.4 66.9 10.2 66.9 ct 
7.1 66.9 l  4.2 66.29999 l  p ef
pom
pum
1815.5 92.8 t 
4.7 58.4 m  4.7 15.7 l  10.6 15.7 l  32.5 48.6 l 
32.5 15.7 l  37.6 15.7 l  37.6 58.4 l  31.8 58.4 l 
9.8 25.4 l  9.8 58.4 l  p ef
pom
pum
1857.9 92.8 t 
22.6 58.4 m  22.6 52.5 l  21.2 54.4 19.7 55.9 18.4 56.8 ct 
16.4 58.4 14.3 59.1 12 59.1 ct 6.7 59.1 4 55.9 4 49.5 ct 
4 27 l  9.6 27 l  9.6 47.7 l  9.6 50.3 9.8 51.9 10.4 52.8 ct 
10.9 53.7 12 54.1 13.4 54.1 ct 16.6 54.1 19.5 51.9 22.6 47.3 ct 
22.6 27 l  28.2 27 l  28.2 58.4 l  p ef
pom
pum
1890.9 92.8 t 
4.29999 58.4 m  4.29999 12.9 l  10 12.9 l  10 42.2 l 
20.4 27 l  25.9 27 l  15.9 41.9 l  28.8 58.4 l 
22 58.4 l  10 42.4 l  10 58.4 l  p ef
pom
pum
1920.5 92.8 t 
23.4 39.3 m  23.4 37.39999 23.2 36 22.8 35.1 ct 
21.9 32.1 19.6 30.6 16.3 30.6 ct 14 30.6 12.2 31.3 10.9 32.7 ct 
9.5 34 8.8 36.2 8.4 39.3 ct p
29 52.8 m  29 57.3 l  25.2 58.5 21.6 59.1 18.3 59.1 ct 
13.4 59.1 9.6 57.6 6.7 54.5 ct 3.8 51.4 2.4 47.4 2.4 42.4 ct 
2.4 37.39999 3.6 33.6 6.2 30.7 ct 8.7 27.9 12.2 26.5 16.4 26.5 ct 
21.5 26.5 24.9 28.1 27 31.6 ct 28.6 34.3 29.3 37.6 29.2 41.9 ct 
29.2 43.7 l  8.3 43.7 l  8.5 45.9 8.9 47.7 9.5 48.8 ct 
11.1 52.7 14.4 54.7 19.5 54.7 ct 22.4 54.7 l 
25.5 54.1 l  p ef
pom
pum
1953.5 92.8 t 
pom
pum
1969.6 92.8 t 
5 58.4 m  5 15.7 l  11.1 15.7 l  11.1 58.4 l 
p ef
pom
pum
1986.6 92.8 t 
4.29999 58.4 m  4.29999 27 l  10 27 l  10 32.89999 l  11.4 31 12.8 29.5 14.1 28.6 ct 
16.1 27.2 18.3 26.5 20.7 26.5 ct 25.9 26.5 28.6 29.5 28.6 35.89999 ct 
28.6 58.4 l  22.9 58.4 l  22.9 37.8 l  22.9 35.2 22.6 33.5 22.1 32.6 ct 
21.5 31.8 20.6 31.3 19.2 31.3 ct 16 31.3 12.9 33.5 10 38.1 ct 
10 58.4 l  p ef
pom
pum
2019.6 92.8 t 
15.1 58.5 m  14 58.9 12.9 59.1 11.8 59.1 ct 
6.8 59.1 4.29999 55.9 4.29999 49.7 ct 4.29999 31.4 l 
0.8 31.4 l  0.8 27 l  4.29999 27 l  4.29999 21.4 l 
10 20.9 l  10 27 l  16 27 l  16 31.4 l  10 31.4 l  10 48.6 l 
10 51.1 10.2 52.7 10.6 53.5 ct 11 54.4 11.8 54.7 13.3 54.7 ct 
14 54.7 14.6 54.7 15.1 54.5 ct p ef
pom
pum
2035.7 92.8 t 
23.4 39.3 m  23.4 37.39999 23.2 36 22.8 35.1 ct 
21.9 32.1 19.6 30.6 16.3 30.6 ct 14 30.6 12.2 31.3 10.9 32.7 ct 
9.5 34 8.8 36.2 8.4 39.3 ct p
29 52.8 m  29 57.3 l  25.2 58.5 21.6 59.1 18.3 59.1 ct 
13.4 59.1 9.6 57.6 6.7 54.5 ct 3.8 51.4 2.4 47.4 2.4 42.4 ct 
2.4 37.39999 3.6 33.6 6.2 30.7 ct 8.7 27.9 12.2 26.5 16.4 26.5 ct 
21.5 26.5 24.9 28.1 27 31.6 ct 28.6 34.3 29.3 37.6 29.2 41.9 ct 
29.2 43.7 l  8.3 43.7 l  8.5 45.9 8.9 47.7 9.5 48.8 ct 
11.1 52.7 14.4 54.7 19.5 54.7 ct 22.4 54.7 l 
25.5 54.1 l  p ef
pom
pum
2068.7 92.8 t 
4.29999 58.4 m  4.29999 27 l  10 27 l  10 32.89999 l  10.8 30.9 11.7 29.5 12.7 28.6 ct 
14 27.2 15.6 26.5 17.5 26.5 ct 17.9 26.5 18.4 26.5 19.2 26.6 ct 
19.2 31.9 l  18.1 31.5 17.3 31.4 16.69999 31.4 ct 
14.6 31.4 12.3 33.5 10 37.8 ct 10 58.4 l  p ef
pom
pum
2088.2 92.8 t 
10 69.7 m  4.29999 69.7 l  4.29999 27 l  10 27 l  10 32.89999 l 
11 31 12.2 29.5 13.4 28.6 ct 15 27.2 17 26.5 19.4 26.5 ct 
22.6 26.5 25.2 27.8 27.2 30.6 ct 29.2 33.39999 30.1 37.2 30.1 41.9 ct 
30.1 47.3 28.8 51.5 26.3 54.6 ct 23.7 57.6 20.1 59.1 15.4 59.1 ct 
13.7 59.1 11.8 58.9 10 58.4 ct p
10 38.1 m  10 54 l  12.6 54.5 14.6 54.7 15.9 54.7 ct 
21.3 54.7 24 50.7 24 42.5 ct 24 38.9 23.5 36.2 22.4 34.3 ct 
21.4 32.3 20 31.4 18.1 31.4 ct 15.7 31.4 l 
13 33.6 l  p ef
pom
pum
2121.2 92.8 t 
4.29999 58.4 m  4.29999 27 l  10 27 l  10 32.89999 l  10.8 30.9 11.7 29.5 12.7 28.6 ct 
14 27.2 15.6 26.5 17.5 26.5 ct 17.9 26.5 18.4 26.5 19.2 26.6 ct 
19.2 31.9 l  18.1 31.5 17.3 31.4 16.69999 31.4 ct 
14.6 31.4 12.3 33.5 10 37.8 ct 10 58.4 l  p ef
pom
pum
2140.7 92.8 t 
23.4 39.3 m  23.4 37.39999 23.2 36 22.8 35.1 ct 
21.9 32.1 19.6 30.6 16.3 30.6 ct 14 30.6 12.2 31.3 10.9 32.7 ct 
9.5 34 8.8 36.2 8.4 39.3 ct p
29 52.8 m  29 57.3 l  25.2 58.5 21.6 59.1 18.3 59.1 ct 
13.4 59.1 9.6 57.6 6.7 54.5 ct 3.8 51.4 2.4 47.4 2.4 42.4 ct 
2.4 37.39999 3.6 33.6 6.2 30.7 ct 8.7 27.9 12.2 26.5 16.4 26.5 ct 
21.5 26.5 24.9 28.1 27 31.6 ct 28.6 34.3 29.3 37.6 29.2 41.9 ct 
29.2 43.7 l  8.3 43.7 l  8.5 45.9 8.9 47.7 9.5 48.8 ct 
11.1 52.7 14.4 54.7 19.5 54.7 ct 22.4 54.7 l 
25.5 54.1 l  p ef
pom
pum
2173.7 92.8 t 
15.1 58.5 m  14 58.9 12.9 59.1 11.8 59.1 ct 
6.8 59.1 4.29999 55.9 4.29999 49.7 ct 4.29999 31.4 l 
0.8 31.4 l  0.8 27 l  4.29999 27 l  4.29999 21.4 l 
10 20.9 l  10 27 l  16 27 l  16 31.4 l  10 31.4 l  10 48.6 l 
10 51.1 10.2 52.7 10.6 53.5 ct 11 54.4 11.8 54.7 13.3 54.7 ct 
14 54.7 14.6 54.7 15.1 54.5 ct p ef
pom
pum
2190.59999 92.8 t 
23.4 39.3 m  23.4 37.39999 23.2 36 22.8 35.1 ct 
21.9 32.1 19.6 30.6 16.3 30.6 ct 14 30.6 12.2 31.3 10.9 32.7 ct 
9.5 34 8.8 36.2 8.4 39.3 ct p
29 52.8 m  29 57.3 l  25.2 58.5 21.6 59.1 18.3 59.1 ct 
13.4 59.1 9.6 57.6 6.7 54.5 ct 3.8 51.4 2.4 47.4 2.4 42.4 ct 
2.4 37.39999 3.6 33.6 6.2 30.7 ct 8.7 27.9 12.2 26.5 16.4 26.5 ct 
21.5 26.5 24.9 28.1 27 31.6 ct 28.6 34.3 29.3 37.6 29.2 41.9 ct 
29.2 43.7 l  8.3 43.7 l  8.5 45.9 8.9 47.7 9.5 48.8 ct 
11.1 52.7 14.4 54.7 19.5 54.7 ct 22.4 54.7 l 
25.5 54.1 l  p ef
pom
pum
2223.59999 92.8 t 
4.29999 58.4 m  4.29999 27 l  10 27 l  10 32.89999 l  10.8 30.9 11.7 29.5 12.7 28.6 ct 
14 27.2 15.6 26.5 17.5 26.5 ct 17.9 26.5 18.4 26.5 19.2 26.6 ct 
19.2 31.9 l  18.1 31.5 17.3 31.4 16.69999 31.4 ct 
14.6 31.4 12.3 33.5 10 37.8 ct 10 58.4 l  p ef
pom
gr
1260.34958 1260.34958 t 
-1260.34958 -1260.34958 m -57626.75586 -1260.34958 l -57626.75586 -40339.12606 l -1260.34958 -40339.12606 l -1260.34958 -1260.34958 l
eoclip newpath
gr
63.5 63.5 m 2903.4 63.5 l 2903.4 2032.4 l 63.5 2032.4 l 63.5 63.5 l
eoclip newpath
gr
gs
pum
153.5 103.6 t 
0.003 0.003 0.003 c 19.6 94.4 m  15.5 89.1 12.1 83 9.3 76.1 ct 
6.4 69.2 5 62 5 54.6 ct 5 48 6 41.7 8.2 35.8 ct 
10.6 28.7 14.5 21.8 19.6 14.8 ct 25 14.8 l 
21.6 20.6 19.4 24.8 18.4 27.2 ct 16.69999 30.9 15.3 35 14.3 39 ct 
13.1 44.3 12.6 49.4 12.6 54.6 ct 12.6 67.79999 16.69999 81.2 25 94.4 ct 
p ef
pom
pum
181.4 103.6 t 
2.5 63.4 m  9.8 62.2 l  10.3 65.29999 11.5 67.5 13.3 69 ct 
15.2 70.7 17.69999 71.4 21.1 71.4 ct 24.7 71.4 27.2 70.7 28.7 69.29999 ct 
30.4 68 31.3 66.29999 31.3 64.4 ct 31.3 62.7 30.6 61.4 29.1 60.5 ct 
28 59.8 25.5 59 21.4 58 ct 16 56.6 12.3 55.3 10.1 54.4 ct 
8.09999 53.4 6.4 51.9 5.4 50.2 ct 4.2 48.3 3.7 46.5 3.7 44.3 ct 
3.7 42.4 4.2 40.6 5 38.9 ct 5.9 37.2 7.2 35.8 8.7 34.6 ct 
9.9 33.8 11.5 33.1 13.5 32.6 ct 15.5 31.9 17.5 31.6 19.9 31.6 ct 
23.3 31.6 26.3 32.1 28.9 33.1 ct 31.6 34.1 33.5 35.5 34.6 37.2 ct 
36 38.9 36.8 41.1 37.2 43.9 ct 29.9 45 l  29.7 42.8 28.7 40.9 27.2 39.7 ct 
25.5 38.4 23.3 37.89999 20.4 37.89999 ct 17 37.89999 14.5 38.4 13.1 39.5 ct 
11.6 40.6 10.9 41.9 10.9 43.4 ct 10.9 44.4 11.1 45.3 11.8 46 ct 
12.5 46.8 13.3 47.5 14.7 48 ct 15.3 48.3 17.5 48.8 21.3 49.9 ct 
26.5 51.4 30.2 52.4 32.3 53.4 ct 34.3 54.3 36 55.6 37.2 57.3 ct 
38.4 59 38.9 61 38.9 63.6 ct 38.9 66.1 38.2 68.5 36.7 70.7 ct 
35.3 72.9 33.3 74.6 30.4 75.79999 ct 27.7 76.9 24.7 77.4 21.3 77.4 ct 
15.5 77.4 11.1 76.29999 8.2 73.9 ct 5.2 71.5 l 
3.3 68.1 l  p ef
pom
pum
223.8 103.6 t 
10.3 94.4 m  5 94.4 l  13.1 81.2 17.4 67.79999 17.4 54.6 ct 
17.4 49.5 16.69999 44.3 15.5 39.2 ct 14.7 35.1 13.3 31.1 11.6 27.4 ct 
10.6 24.8 8.4 20.8 5 14.8 ct 10.3 14.8 l 
15.5 21.8 19.4 28.7 21.8 35.8 ct 24 41.7 25 48 25 54.6 ct 
25 62 23.6 69.2 20.8 76.1 ct 17.9 83 l  14.3 89.1 l 
p ef
pom
gr
gr
0 1969 t 
pom
count op_count sub {pop} repeat countdictstack dict_count sub {end} repeat b4_inc_state restore
%%PageTrailer
%%Trailer
%%EOF
