%!PS-Adobe-2.0
%%Creator: dot version 1.8.5 (Wed May 19 09:04:31 CEST 2004)
%%For: (cartho) Cyrille Artho,,,
%%Title: G
%%Pages: (atend)
%%BoundingBox: 35 35 315 377
%%EndComments
save
%%BeginProlog
/DotDict 200 dict def
DotDict begin

/setupLatin1 {
mark
/EncodingVector 256 array def
 EncodingVector 0

ISOLatin1Encoding 0 255 getinterval putinterval

EncodingVector
  dup 306 /AE
  dup 301 /Aacute
  dup 302 /Acircumflex
  dup 304 /Adieresis
  dup 300 /Agrave
  dup 305 /Aring
  dup 303 /Atilde
  dup 307 /Ccedilla
  dup 311 /Eacute
  dup 312 /Ecircumflex
  dup 313 /Edieresis
  dup 310 /Egrave
  dup 315 /Iacute
  dup 316 /Icircumflex
  dup 317 /Idieresis
  dup 314 /Igrave
  dup 334 /Udieresis
  dup 335 /Yacute
  dup 376 /thorn
  dup 337 /germandbls
  dup 341 /aacute
  dup 342 /acircumflex
  dup 344 /adieresis
  dup 346 /ae
  dup 340 /agrave
  dup 345 /aring
  dup 347 /ccedilla
  dup 351 /eacute
  dup 352 /ecircumflex
  dup 353 /edieresis
  dup 350 /egrave
  dup 355 /iacute
  dup 356 /icircumflex
  dup 357 /idieresis
  dup 354 /igrave
  dup 360 /dcroat
  dup 361 /ntilde
  dup 363 /oacute
  dup 364 /ocircumflex
  dup 366 /odieresis
  dup 362 /ograve
  dup 365 /otilde
  dup 370 /oslash
  dup 372 /uacute
  dup 373 /ucircumflex
  dup 374 /udieresis
  dup 371 /ugrave
  dup 375 /yacute
  dup 377 /ydieresis  

% Set up ISO Latin 1 character encoding
/starnetISO {
        dup dup findfont dup length dict begin
        { 1 index /FID ne { def }{ pop pop } ifelse
        } forall
        /Encoding EncodingVector def
        currentdict end definefont
} def
/Times-Roman starnetISO def
/Times-Italic starnetISO def
/Times-Bold starnetISO def
/Times-BoldItalic starnetISO def
/Helvetica starnetISO def
/Helvetica-Oblique starnetISO def
/Helvetica-Bold starnetISO def
/Helvetica-BoldOblique starnetISO def
/Courier starnetISO def
/Courier-Oblique starnetISO def
/Courier-Bold starnetISO def
/Courier-BoldOblique starnetISO def
cleartomark
} bind def

%%BeginResource: procset
/coord-font-family /Times-Roman def
/default-font-family /Times-Roman def
/coordfont coord-font-family findfont 8 scalefont def

/InvScaleFactor 1.0 def
/set_scale {
	dup 1 exch div /InvScaleFactor exch def
	dup scale
} bind def

% styles
/solid { } bind def
/dashed { [9 InvScaleFactor mul dup ] 0 setdash } bind def
/dotted { [1 InvScaleFactor mul 6 InvScaleFactor mul] 0 setdash } bind def
/invis {/fill {newpath} def /stroke {newpath} def /show {pop newpath} def} bind def
/bold { 2 setlinewidth } bind def
/filled { } bind def
/unfilled { } bind def
/rounded { } bind def
/diagonals { } bind def

% hooks for setting color 
/nodecolor { sethsbcolor } bind def
/edgecolor { sethsbcolor } bind def
/graphcolor { sethsbcolor } bind def
/nopcolor {pop pop pop} bind def

/beginpage {	% i j npages
	/npages exch def
	/j exch def
	/i exch def
	/str 10 string def
	npages 1 gt {
		gsave
			coordfont setfont
			0 0 moveto
			(() show i str cvs show (,) show j str cvs show ()) show
		grestore
	} if
} bind def

/set_font {
	findfont exch
	scalefont setfont
} def

% draw aligned label in bounding box aligned to current point
/alignedtext {			% width adj text
	/text exch def
	/adj exch def
	/width exch def
	gsave
		width 0 gt {
			text stringwidth pop adj mul 0 rmoveto
		} if
		[] 0 setdash
		text show
	grestore
} def

/boxprim {				% xcorner ycorner xsize ysize
		4 2 roll
		moveto
		2 copy
		exch 0 rlineto
		0 exch rlineto
		pop neg 0 rlineto
		closepath
} bind def

/ellipse_path {
	/ry exch def
	/rx exch def
	/y exch def
	/x exch def
	matrix currentmatrix
	newpath
	x y translate
	rx ry scale
	0 0 1 0 360 arc
	setmatrix
} bind def

/endpage { showpage } bind def

/layercolorseq
	[	% layer color sequence - darkest to lightest
		[0 0 0]
		[.2 .8 .8]
		[.4 .8 .8]
		[.6 .8 .8]
		[.8 .8 .8]
	]
def

/setlayer {/maxlayer exch def /curlayer exch def
	layercolorseq curlayer get
	aload pop sethsbcolor
	/nodecolor {nopcolor} def
	/edgecolor {nopcolor} def
	/graphcolor {nopcolor} def
} bind def

/onlayer { curlayer ne {invis} if } def

/onlayers {
	/myupper exch def
	/mylower exch def
	curlayer mylower lt
	curlayer myupper gt
	or
	{invis} if
} def

/curlayer 0 def

%%EndResource
%%EndProlog
%%BeginSetup
14 default-font-family set_font
1 setmiterlimit
% /arrowlength 10 def
% /arrowwidth 5 def

% make sure pdfmark is harmless for PS-interpreters other than Distiller
/pdfmark where {pop} {userdict /pdfmark /cleartomark load put} ifelse
% make '<<' and '>>' safe on PS Level 1 devices
/languagelevel where {pop languagelevel}{1} ifelse
2 lt {
    userdict (<<) cvn ([) cvn load put
    userdict (>>) cvn ([) cvn load put
} if

%%EndSetup
%%Page: 1 1
%%PageBoundingBox: 36 36 315 377
%%PageOrientation: Portrait
gsave
35 35 280 342 boxprim clip newpath
36 36 translate
0 0 1 beginpage
0 0 translate 0 rotate
0.000 0.000 0.000 graphcolor
14.00 /Times-Roman set_font

%	cnt
gsave 10 dict begin
147 26 27 18 ellipse_path
stroke
gsave 10 dict begin
147 21 moveto 21 -0.5 (cnt) alignedtext
end grestore
end grestore

%	pp
gsave 10 dict begin
219 26 27 18 ellipse_path
stroke
gsave 10 dict begin
219 21 moveto 17 -0.5 (pp) alignedtext
end grestore
end grestore

%	cnt -> pp
newpath 168 15 moveto
176 13 184 12 191 13 curveto
stroke
0.000 0.000 0.000 edgecolor
newpath 188 9 moveto
197 15 lineto
187 14 lineto
closepath
fill
0.000 0.000 0.000 edgecolor

%	pp -> cnt
newpath 178 39 moveto
185 40 191 39 198 37 curveto
stroke
0.000 0.000 0.000 edgecolor
newpath 178 42 moveto
169 37 lineto
179 37 lineto
closepath
fill
0.000 0.000 0.000 edgecolor

%	algo
gsave 10 dict begin
175 242 27 18 ellipse_path
stroke
gsave 10 dict begin
175 237 moveto 28 -0.5 (algo) alignedtext
end grestore
end grestore

%	algo -> cnt
newpath 176 224 moveto
177 194 178 132 170 80 curveto
168 66 169 57 167 48 curveto
stroke
0.000 0.000 0.000 edgecolor
newpath 165 50 moveto
164 40 lineto
170 48 lineto
closepath
fill
0.000 0.000 0.000 edgecolor

%	java
gsave 10 dict begin
120 170 27 18 ellipse_path
stroke
gsave 10 dict begin
120 165 moveto 29 -0.5 (java) alignedtext
end grestore
end grestore

%	algo -> java
newpath 163 226 moveto
156 216 146 204 138 194 curveto
stroke
0.000 0.000 0.000 edgecolor
newpath 136 196 moveto
132 186 lineto
140 193 lineto
closepath
fill
0.000 0.000 0.000 edgecolor

%	java -> cnt
newpath 134 154 moveto
142 144 151 130 156 116 curveto
162 94 159 70 155 52 curveto
stroke
0.000 0.000 0.000 edgecolor
newpath 153 54 moveto
153 44 lineto
158 53 lineto
closepath
fill
0.000 0.000 0.000 edgecolor

%	jar
gsave 10 dict begin
120 98 27 18 ellipse_path
stroke
gsave 10 dict begin
120 93 moveto 19 -0.5 (jar) alignedtext
end grestore
end grestore

%	java -> jar
newpath 114 152 moveto
113 144 113 135 113 126 curveto
stroke
0.000 0.000 0.000 edgecolor
newpath 111 126 moveto
114 116 lineto
115 126 lineto
closepath
fill
0.000 0.000 0.000 edgecolor

%	jar -> cnt
newpath 127 80 moveto
130 72 133 62 137 53 curveto
stroke
0.000 0.000 0.000 edgecolor
newpath 135 52 moveto
141 44 lineto
139 54 lineto
closepath
fill
0.000 0.000 0.000 edgecolor

%	jar -> java
newpath 127 143 moveto
127 134 127 124 126 116 curveto
stroke
0.000 0.000 0.000 edgecolor
newpath 130 142 moveto
126 152 lineto
125 142 lineto
closepath
fill
0.000 0.000 0.000 edgecolor

%	rv
gsave 10 dict begin
92 314 27 18 ellipse_path
stroke
gsave 10 dict begin
92 309 moveto 15 -0.5 (rv) alignedtext
end grestore
end grestore

%	rv -> cnt
newpath 70 303 moveto
51 292 40 285 29 260 curveto
23 245 27 239 29 224 curveto
38 158 36 138 68 80 curveto
83 54 87 42 111 30 curveto
stroke
0.000 0.000 0.000 edgecolor
newpath 110 28 moveto
120 27 lineto
111 33 lineto
closepath
fill
0.000 0.000 0.000 edgecolor

%	rv -> algo
newpath 109 299 moveto
121 289 138 274 151 262 curveto
stroke
0.000 0.000 0.000 edgecolor
newpath 149 261 moveto
158 256 lineto
152 264 lineto
closepath
fill
0.000 0.000 0.000 edgecolor

%	rv -> java
newpath 95 296 moveto
100 271 109 226 114 197 curveto
stroke
0.000 0.000 0.000 edgecolor
newpath 111 197 moveto
116 188 lineto
116 198 lineto
closepath
fill
0.000 0.000 0.000 edgecolor

%	vm
gsave 10 dict begin
65 242 27 18 ellipse_path
stroke
gsave 10 dict begin
65 237 moveto 23 -0.5 (vm) alignedtext
end grestore
end grestore

%	rv -> vm
newpath 85 296 moveto
82 288 79 278 75 269 curveto
stroke
0.000 0.000 0.000 edgecolor
newpath 73 270 moveto
71 260 lineto
77 268 lineto
closepath
fill
0.000 0.000 0.000 edgecolor

%	vm -> cnt
newpath 63 224 moveto
62 193 61 128 84 80 curveto
94 59 102 49 116 40 curveto
stroke
0.000 0.000 0.000 edgecolor
newpath 114 38 moveto
124 35 lineto
117 42 lineto
closepath
fill
0.000 0.000 0.000 edgecolor

%	vm -> java
newpath 77 226 moveto
84 216 94 204 102 194 curveto
stroke
0.000 0.000 0.000 edgecolor
newpath 100 193 moveto
108 186 lineto
104 195 lineto
closepath
fill
0.000 0.000 0.000 edgecolor

%	sa
gsave 10 dict begin
230 314 27 18 ellipse_path
stroke
gsave 10 dict begin
230 309 moveto 13 -0.5 (sa) alignedtext
end grestore
end grestore

%	sa -> cnt
newpath 232 296 moveto
233 277 235 248 231 224 curveto
220 157 206 143 185 80 curveto
179 63 182 51 177 40 curveto
stroke
0.000 0.000 0.000 edgecolor
newpath 176 43 moveto
172 33 lineto
180 40 lineto
closepath
fill
0.000 0.000 0.000 edgecolor

%	sa -> algo
newpath 218 298 moveto
211 288 201 276 193 266 curveto
stroke
0.000 0.000 0.000 edgecolor
newpath 191 268 moveto
187 258 lineto
195 265 lineto
closepath
fill
0.000 0.000 0.000 edgecolor

%	sa -> java
newpath 230 296 moveto
229 277 225 246 211 224 curveto
193 195 179 188 153 178 curveto
stroke
0.000 0.000 0.000 edgecolor
newpath 154 181 moveto
146 175 lineto
156 177 lineto
closepath
fill
0.000 0.000 0.000 edgecolor
endpage
grestore
%%PageTrailer
%%EndPage: 1
%%Trailer
%%Pages: 1
end
restore
%%EOF
