#FIG 3.2
Landscape
Center
Inches
Letter  
100.00
Single
-2
1200 2
0 32 #dfe3ef
0 33 #96969e
0 34 #d7dbd7
0 35 #9ea2b6
0 36 #9e0000
0 37 #efefef
0 38 #dfe3df
0 39 #86aeff
0 40 #7171ff
0 41 #c7b696
0 42 #effbff
0 43 #dfcba6
0 44 #414141
0 45 #868286
0 46 #bec3be
0 47 #dfe3df
0 48 #8e8e8e
0 49 #aeaaae
0 50 #414141
0 51 #868286
0 52 #bec3be
0 53 #868286
0 54 #bec3be
0 55 #dfe3df
0 56 #8e8e8e
0 57 #8e8e8e
0 58 #414141
0 59 #868286
0 60 #bec3be
0 61 #dfe3df
0 62 #414141
0 63 #868286
0 64 #bec3be
0 65 #dfe3df
0 66 #868286
0 67 #bec3be
0 68 #dfe3df
0 69 #c7b696
0 70 #effbff
0 71 #dfcba6
0 72 #c7b696
0 73 #effbff
0 74 #dfcba6
0 75 #aeaaae
0 76 #595559
0 77 #8e8e8e
0 78 #414141
0 79 #868286
0 80 #bec3be
0 81 #dfe3df
0 82 #414141
0 83 #868286
0 84 #bec3be
0 85 #dfe3df
0 86 #868286
0 87 #bec3be
0 88 #dfe3df
0 89 #414141
0 90 #868286
0 91 #bec3be
0 92 #414141
0 93 #bec3be
0 94 #dfe3df
0 95 #414141
0 96 #868286
0 97 #bec3be
0 98 #8e8e8e
0 99 #414141
0 100 #868286
0 101 #bec3be
0 102 #dfe3df
0 103 #414141
0 104 #868286
0 105 #bec3be
0 106 #dfe3df
0 107 #bebebe
0 108 #515151
0 109 #e7e3e7
0 110 #000049
0 111 #797979
0 112 #303430
0 113 #414541
0 114 #414141
0 115 #868286
0 116 #bec3be
0 117 #dfe3df
0 118 #8e928e
0 119 #e7e7cf
0 120 #9e9a9e
0 121 #cf9200
0 122 #f761ae
0 123 #7171ff
0 124 #595d59
0 125 #000079
0 126 #ff8200
0 127 #007d00
0 128 #0000be
0 129 #414141
0 130 #868286
0 131 #bec3be
0 132 #dfe3df
0 133 #868286
0 134 #bec3be
0 135 #dfe3df
0 136 #494549
0 137 #494549
0 138 #8e8e8e
0 139 #cfcfcf
6 3825 600 5175 2100
6 4350 1275 4650 1875
1 3 0 1 0 0 25 0 20 0.000 1 0.0000 4500 1395 120 120 4500 1395 4620 1395
2 1 0 1 0 0 25 0 20 0.000 0 0 -1 0 0 5
	 4440 1470 4350 1845 4650 1845 4567 1477 4425 1470
-6
6 3975 600 5025 1200
6 3975 600 5025 1200
6 3975 600 5025 1200
5 1 0 3 0 33 60 0 20 0.000 0 0 0 0 4500.000 1125.000 4050 1125 4500 675 4950 1125
5 1 0 3 0 33 50 0 40 0.000 0 0 0 0 4500.000 1125.000 4200 1125 4500 825 4800 1125
-6
-6
-6
2 2 0 3 0 33 50 0 20 0.000 0 0 -1 0 0 5
	 3900 1125 5100 1125 5100 2025 3900 2025 3900 1125
-6
