%!PS-Adobe-2.0 EPSF-2.0
%%Title: ebrw-example1.dia
%%Creator: Dia v0.90
%%CreationDate: Fri Jan 31 11:08:58 2003
%%For: pascal
%%Magnification: 1.0000
%%Orientation: Portrait
%%BoundingBox: 0 0 559 728
%%Pages: 1
%%EndComments
%%BeginProlog
/cp {closepath} bind def
/c {curveto} bind def
/f {fill} bind def
/a {arc} bind def
/ef {eofill} bind def
/ex {exch} bind def
/gr {grestore} bind def
/gs {gsave} bind def
/sa {save} bind def
/rs {restore} bind def
/l {lineto} bind def
/m {moveto} bind def
/rm {rmoveto} bind def
/n {newpath} bind def
/s {stroke} bind def
/sh {show} bind def
/slc {setlinecap} bind def
/slj {setlinejoin} bind def
/slw {setlinewidth} bind def
/srgb {setrgbcolor} bind def
/rot {rotate} bind def
/sc {scale} bind def
/sd {setdash} bind def
/ff {findfont} bind def
/sf {setfont} bind def
/scf {scalefont} bind def
/sw {stringwidth pop} bind def
/tr {translate} bind def

/ellipsedict 8 dict def
ellipsedict /mtrx matrix put
/ellipse
{ ellipsedict begin
   /endangle exch def
   /startangle exch def
   /yrad exch def
   /xrad exch def
   /y exch def
   /x exch def   /savematrix mtrx currentmatrix def
   x y tr xrad yrad sc
   0 0 1 startangle endangle arc
   savematrix setmatrix
   end
} def

/mergeprocs {
dup length
3 -1 roll
dup
length
dup
5 1 roll
3 -1 roll
add
array cvx
dup
3 -1 roll
0 exch
putinterval
dup
4 2 roll
putinterval
} bind def
%%EndProlog

%%BeginSetup
%%EndSetup
28.346000 -28.346000 scale
-3.750000 -28.030000 translate

1.000000 1.000000 1.000000 srgb
n 3.800000 2.400000 m 3.800000 4.300000 l 8.006400 4.300000 l 8.006400 2.400000 l f
0.100000 slw
[] 0 sd
[] 0 sd
0 slj
0.000000 0.000000 0.000000 srgb
n 3.800000 2.400000 m 3.800000 4.300000 l 8.006400 4.300000 l 8.006400 2.400000 l cp s
 [ /xi /xi /xi /xi /xi /xi /xi /xi /xi /xi /xi /xi /xi /xi /xi /xi
 /xi /xi /xi /xi /xi /xi /xi /xi /xi /xi /xi /xi /xi /xi /xi /xi
 /T /zero /comma /space /one /braceleft /two /braceright /xi /xi /three /four /five /six /seven /eight
 /nine /parenleft /parenright /xi /xi /xi /xi /xi /xi /xi /xi /xi /xi /xi /xi /xi
 /xi /xi /xi /xi /xi /xi /xi /xi /xi /xi /xi /xi /xi /xi /xi /xi
 /xi /xi /xi /xi /xi /xi /xi /xi /xi /xi /xi /xi /xi /xi /xi /xi
 /xi /xi /xi /xi /xi /xi /xi /xi /xi /xi /xi /xi /xi /xi /xi /xi
 /xi /xi /xi /xi /xi /xi /xi /xi /xi /xi /xi /xi /xi /xi /xi /xi
 /xi /xi /xi /xi /xi /xi /xi /xi /xi /xi /xi /xi /xi /xi /xi /xi
 /xi /xi /xi /xi /xi /xi /xi /xi /xi /xi /xi /xi /xi /xi /xi /xi
 /xi /xi /xi /xi /xi /xi /xi /xi /xi /xi /xi /xi /xi /xi /xi /xi
 /xi /xi /xi /xi /xi /xi /xi /xi /xi /xi /xi /xi /xi /xi /xi /xi
 /xi /xi /xi /xi /xi /xi /xi /xi /xi /xi /xi /xi /xi /xi /xi /xi
 /xi /xi /xi /xi /xi /xi /xi /xi /xi /xi /xi /xi /xi /xi /xi /xi
 /xi /xi /xi /xi /xi /xi /xi /xi /xi /xi /xi /xi /xi /xi /xi /xi
 /xi /xi /xi /xi /xi /xi /xi /xi /xi /xi /xi /xi /xi /xi /xi /xi
] /e0 exch def
/Courier_e0 undefinefont
/Courier_e0
  /Courier findfont
  dup length dict begin
  {1 index /FID ne {def} {pop pop} ifelse} forall
  /Encoding e0 def
  currentdict end
definefont pop
/Courier_e0 ff 0.800000 scf sf
( !"# $) sw
2 div 5.903200 ex sub 3.546491 m ( !"# $)
 gs 1 -1 sc sh gr
1.000000 1.000000 1.000000 srgb
n 3.800000 7.150000 m 3.800000 9.050000 l 8.006400 9.050000 l 8.006400 7.150000 l f
0.100000 slw
[] 0 sd
[] 0 sd
0 slj
0.000000 0.000000 0.000000 srgb
n 3.800000 7.150000 m 3.800000 9.050000 l 8.006400 9.050000 l 8.006400 7.150000 l cp s
/Courier_e0 ff 0.800000 scf sf
( !"# $) sw
2 div 5.903200 ex sub 8.296491 m ( !"# $)
 gs 1 -1 sc sh gr
0.100000 slw
[] 0 sd
[0.400000] 0 sd
0 slc
n 5.903200 4.300000 m 5.903200 7.150000 l s
0.100000 slw
[] 0 sd
0 slj
0 slc
n 5.653200 6.350000 m 5.903200 7.150000 l 6.153200 6.350000 l s
5.903200 5.725000 m /Courier_e0 ff 0.800000 scf sf
(%$"&')
 gs 1 -1 sc sh gr
1.000000 1.000000 1.000000 srgb
n 3.800000 11.850000 m 3.800000 13.750000 l 8.006400 13.750000 l 8.006400 11.850000 l f
0.100000 slw
[] 0 sd
[] 0 sd
0 slj
0.000000 0.000000 0.000000 srgb
n 3.800000 11.850000 m 3.800000 13.750000 l 8.006400 13.750000 l 8.006400 11.850000 l cp s
/Courier_e0 ff 0.800000 scf sf
( !"# $) sw
2 div 5.903200 ex sub 12.996491 m ( !"# $)
 gs 1 -1 sc sh gr
0.100000 slw
[] 0 sd
[0.400000] 0 sd
0 slc
n 5.903200 9.050000 m 5.903200 11.850000 l s
0.100000 slw
[] 0 sd
0 slj
0 slc
n 5.653200 11.050000 m 5.903200 11.850000 l 6.153200 11.050000 l s
5.903200 10.450000 m /Courier_e0 ff 0.800000 scf sf
(%*"+",')
 gs 1 -1 sc sh gr
0.100000 slw
[] 0 sd
[0.400000] 0 sd
0 slc
n 5.903200 13.750000 m 5.903200 16.580000 l s
0.100000 slw
[] 0 sd
0 slj
0 slc
n 5.653200 15.780000 m 5.903200 16.580000 l 6.153200 15.780000 l s
5.903200 15.165000 m /Courier_e0 ff 0.800000 scf sf
(%-')
 gs 1 -1 sc sh gr
1.000000 1.000000 1.000000 srgb
n 4.873600 16.580000 m 4.873600 18.480000 l 6.932800 18.480000 l 6.932800 16.580000 l f
0.100000 slw
[] 0 sd
[] 0 sd
0 slj
0.000000 0.000000 0.000000 srgb
n 4.873600 16.580000 m 4.873600 18.480000 l 6.932800 18.480000 l 6.932800 16.580000 l cp s
/Courier_e0 ff 0.800000 scf sf
( $) sw
2 div 5.903200 ex sub 17.726491 m ( $)
 gs 1 -1 sc sh gr
1.000000 1.000000 1.000000 srgb
n 4.873600 21.380000 m 4.873600 23.280000 l 6.932800 23.280000 l 6.932800 21.380000 l f
0.100000 slw
[] 0 sd
[] 0 sd
0 slj
0.000000 0.000000 0.000000 srgb
n 4.873600 21.380000 m 4.873600 23.280000 l 6.932800 23.280000 l 6.932800 21.380000 l cp s
/Courier_e0 ff 0.800000 scf sf
( $) sw
2 div 5.903200 ex sub 22.526491 m ( $)
 gs 1 -1 sc sh gr
0.100000 slw
[] 0 sd
[0.400000] 0 sd
0 slc
n 5.903200 18.480000 m 5.903200 21.380000 l s
0.100000 slw
[] 0 sd
0 slj
0 slc
n 5.653200 20.580000 m 5.903200 21.380000 l 6.153200 20.580000 l s
5.903200 19.930000 m /Courier_e0 ff 0.800000 scf sf
(%."/"0')
 gs 1 -1 sc sh gr
1.000000 1.000000 1.000000 srgb
n 5.071600 26.080000 m 5.071600 27.980000 l 6.734800 27.980000 l 6.734800 26.080000 l f
0.100000 slw
[] 0 sd
[] 0 sd
0 slj
0.000000 0.000000 0.000000 srgb
n 5.071600 26.080000 m 5.071600 27.980000 l 6.734800 27.980000 l 6.734800 26.080000 l cp s
/Courier_e0 ff 0.800000 scf sf
(12) sw
2 div 5.903200 ex sub 27.226491 m (12)
 gs 1 -1 sc sh gr
0.100000 slw
[] 0 sd
[0.400000] 0 sd
0 slc
n 5.903200 23.280000 m 5.903200 26.080000 l s
0.100000 slw
[] 0 sd
0 slj
0 slc
n 5.653200 25.280000 m 5.903200 26.080000 l 6.153200 25.280000 l s
5.903200 24.680000 m /Courier_e0 ff 0.800000 scf sf
(%$!')
 gs 1 -1 sc sh gr
1.000000 1.000000 1.000000 srgb
n 17.806000 7.180000 m 17.806000 9.080000 l 22.373200 9.080000 l 22.373200 7.180000 l f
0.100000 slw
[] 0 sd
[] 0 sd
0 slj
0.000000 0.000000 0.000000 srgb
n 17.806000 7.180000 m 17.806000 9.080000 l 22.373200 9.080000 l 22.373200 7.180000 l cp s
/Courier_e0 ff 0.800000 scf sf
( $"1 !2) sw
2 div 20.089600 ex sub 8.326491 m ( $"1 !2)
 gs 1 -1 sc sh gr
1.000000 1.000000 1.000000 srgb
n 17.806000 11.980000 m 17.806000 13.880000 l 22.373200 13.880000 l 22.373200 11.980000 l f
0.100000 slw
[] 0 sd
[] 0 sd
0 slj
0.000000 0.000000 0.000000 srgb
n 17.806000 11.980000 m 17.806000 13.880000 l 22.373200 13.880000 l 22.373200 11.980000 l cp s
/Courier_e0 ff 0.800000 scf sf
( $"1 !2) sw
2 div 20.089600 ex sub 13.126491 m ( $"1 !2)
 gs 1 -1 sc sh gr
0.100000 slw
[] 0 sd
[0.400000] 0 sd
0 slc
n 20.089600 9.080000 m 20.089600 11.980000 l s
0.100000 slw
[] 0 sd
0 slj
0 slc
n 19.839600 11.180000 m 20.089600 11.980000 l 20.339600 11.180000 l s
20.089600 10.530000 m /Courier_e0 ff 0.800000 scf sf
(%."/"0')
 gs 1 -1 sc sh gr
0.100000 slw
[] 0 sd
[0.400000] 0 sd
0 slc
n 20.089600 13.880000 m 20.089600 16.780000 l s
0.100000 slw
[] 0 sd
0 slj
0 slc
n 19.839600 15.980000 m 20.089600 16.780000 l 20.339600 15.980000 l s
20.089600 15.330000 m /Courier_e0 ff 0.800000 scf sf
(%$!')
 gs 1 -1 sc sh gr
0.100000 slw
[] 0 sd
[] 0 sd
0 slj
0 slc
n 8.006400 8.100000 m 8.006400 8.200000 l 17.806000 8.200000 l 17.806000 8.130000 l s
1.000000 1.000000 1.000000 srgb
n 19.258000 16.780000 m 19.258000 18.680000 l 20.921200 18.680000 l 20.921200 16.780000 l f
0.100000 slw
[] 0 sd
[] 0 sd
0 slj
0.000000 0.000000 0.000000 srgb
n 19.258000 16.780000 m 19.258000 18.680000 l 20.921200 18.680000 l 20.921200 16.780000 l cp s
/Courier_e0 ff 0.800000 scf sf
(12) sw
2 div 20.089600 ex sub 17.926491 m (12)
 gs 1 -1 sc sh gr
1.000000 1.000000 1.000000 srgb
n 10.860000 11.850000 m 10.860000 13.750000 l 15.427200 13.750000 l 15.427200 11.850000 l f
0.100000 slw
[] 0 sd
[] 0 sd
0 slj
0.000000 0.000000 0.000000 srgb
n 10.860000 11.850000 m 10.860000 13.750000 l 15.427200 13.750000 l 15.427200 11.850000 l cp s
/Courier_e0 ff 0.800000 scf sf
( $"1 !2) sw
2 div 13.143600 ex sub 12.996491 m ( $"1 !2)
 gs 1 -1 sc sh gr
0.100000 slw
[] 0 sd
[] 0 sd
0 slj
0 slc
n 8.006400 12.800000 m 8.006400 12.880000 l 10.860000 12.880000 l 10.860000 12.800000 l s
0.757576 0.757576 0.757576 srgb
n 13.143600 16.642893 m 14.350707 17.850000 l 13.143600 19.057107 l 11.936493 17.850000 l f
0.100000 slw
[] 0 sd
[] 0 sd
0 slj
0.000000 0.000000 0.000000 srgb
n 13.143600 16.642893 m 14.350707 17.850000 l 13.143600 19.057107 l 11.936493 17.850000 l cp s
0.100000 slw
[] 0 sd
[0.400000] 0 sd
0 slc
n 13.143600 13.750000 m 13.143600 16.642893 l s
0.100000 slw
[] 0 sd
0 slj
0 slc
n 12.893600 15.842893 m 13.143600 16.642893 l 13.393600 15.842893 l s
13.143600 15.196447 m /Courier_e0 ff 0.800000 scf sf
(%.')
 gs 1 -1 sc sh gr
showpage
