(JNukeWaitList 
  (JNukeThread (num 0) (alive) (not_assigned))
  (JNukeThread (num 1) (alive) (not_assigned))
  (JNukeThread (num 2) (alive) (not_assigned))
  (JNukeThread (num 3) (alive) (not_assigned))
  (JNukeThread (num 4) (alive) (not_assigned))
)
(JNukeWaitList 
)
(JNukeThread (num 0) (alive) (ready_to_run) (not_assigned))
(JNukeThread (num 1) (alive) (ready_to_run) (not_assigned))
(JNukeThread (num 2) (alive) (ready_to_run) (not_assigned))
(JNukeThread (num 3) (alive) (ready_to_run) (not_assigned))
(JNukeThread (num 4) (alive) (ready_to_run) (not_assigned))
