%!PS-Adobe-2.0 EPSF-2.0
%%Title: bild2.eps
%%Creator: fig2dev Version 3.2 Patchlevel 3d
%%CreationDate: Mon Jul 14 12:56:57 2003
%%For: zboris@vera (B Z)
%%BoundingBox: 0 0 270 204
%%Magnification: 1.0000
%%EndComments
/$F2psDict 200 dict def
$F2psDict begin
$F2psDict /mtrx matrix put
/col-1 {0 setgray} bind def
/col0 {0.000 0.000 0.000 srgb} bind def
/col1 {0.000 0.000 1.000 srgb} bind def
/col2 {0.000 1.000 0.000 srgb} bind def
/col3 {0.000 1.000 1.000 srgb} bind def
/col4 {1.000 0.000 0.000 srgb} bind def
/col5 {1.000 0.000 1.000 srgb} bind def
/col6 {1.000 1.000 0.000 srgb} bind def
/col7 {1.000 1.000 1.000 srgb} bind def
/col8 {0.000 0.000 0.560 srgb} bind def
/col9 {0.000 0.000 0.690 srgb} bind def
/col10 {0.000 0.000 0.820 srgb} bind def
/col11 {0.530 0.810 1.000 srgb} bind def
/col12 {0.000 0.560 0.000 srgb} bind def
/col13 {0.000 0.690 0.000 srgb} bind def
/col14 {0.000 0.820 0.000 srgb} bind def
/col15 {0.000 0.560 0.560 srgb} bind def
/col16 {0.000 0.690 0.690 srgb} bind def
/col17 {0.000 0.820 0.820 srgb} bind def
/col18 {0.560 0.000 0.000 srgb} bind def
/col19 {0.690 0.000 0.000 srgb} bind def
/col20 {0.820 0.000 0.000 srgb} bind def
/col21 {0.560 0.000 0.560 srgb} bind def
/col22 {0.690 0.000 0.690 srgb} bind def
/col23 {0.820 0.000 0.820 srgb} bind def
/col24 {0.500 0.190 0.000 srgb} bind def
/col25 {0.630 0.250 0.000 srgb} bind def
/col26 {0.750 0.380 0.000 srgb} bind def
/col27 {1.000 0.500 0.500 srgb} bind def
/col28 {1.000 0.630 0.630 srgb} bind def
/col29 {1.000 0.750 0.750 srgb} bind def
/col30 {1.000 0.880 0.880 srgb} bind def
/col31 {1.000 0.840 0.000 srgb} bind def

end
save
newpath 0 204 moveto 0 0 lineto 270 0 lineto 270 204 lineto closepath clip newpath
-146.6 294.1 translate
1 -1 scale

/cp {closepath} bind def
/ef {eofill} bind def
/gr {grestore} bind def
/gs {gsave} bind def
/sa {save} bind def
/rs {restore} bind def
/l {lineto} bind def
/m {moveto} bind def
/rm {rmoveto} bind def
/n {newpath} bind def
/s {stroke} bind def
/sh {show} bind def
/slc {setlinecap} bind def
/slj {setlinejoin} bind def
/slw {setlinewidth} bind def
/srgb {setrgbcolor} bind def
/rot {rotate} bind def
/sc {scale} bind def
/sd {setdash} bind def
/ff {findfont} bind def
/sf {setfont} bind def
/scf {scalefont} bind def
/sw {stringwidth} bind def
/tr {translate} bind def
/tnt {dup dup currentrgbcolor
  4 -2 roll dup 1 exch sub 3 -1 roll mul add
  4 -2 roll dup 1 exch sub 3 -1 roll mul add
  4 -2 roll dup 1 exch sub 3 -1 roll mul add srgb}
  bind def
/shd {dup dup currentrgbcolor 4 -2 roll mul 4 -2 roll mul
  4 -2 roll mul srgb} bind def
/reencdict 12 dict def /ReEncode { reencdict begin
/newcodesandnames exch def /newfontname exch def /basefontname exch def
/basefontdict basefontname findfont def /newfont basefontdict maxlength dict def
basefontdict { exch dup /FID ne { dup /Encoding eq
{ exch dup length array copy newfont 3 1 roll put }
{ exch newfont 3 1 roll put } ifelse } { pop pop } ifelse } forall
newfont /FontName newfontname put newcodesandnames aload pop
128 1 255 { newfont /Encoding get exch /.notdef put } for
newcodesandnames length 2 idiv { newfont /Encoding get 3 1 roll put } repeat
newfontname newfont definefont pop end } def
/isovec [
8#055 /minus 8#200 /grave 8#201 /acute 8#202 /circumflex 8#203 /tilde
8#204 /macron 8#205 /breve 8#206 /dotaccent 8#207 /dieresis
8#210 /ring 8#211 /cedilla 8#212 /hungarumlaut 8#213 /ogonek 8#214 /caron
8#220 /dotlessi 8#230 /oe 8#231 /OE
8#240 /space 8#241 /exclamdown 8#242 /cent 8#243 /sterling
8#244 /currency 8#245 /yen 8#246 /brokenbar 8#247 /section 8#250 /dieresis
8#251 /copyright 8#252 /ordfeminine 8#253 /guillemotleft 8#254 /logicalnot
8#255 /hyphen 8#256 /registered 8#257 /macron 8#260 /degree 8#261 /plusminus
8#262 /twosuperior 8#263 /threesuperior 8#264 /acute 8#265 /mu 8#266 /paragraph
8#267 /periodcentered 8#270 /cedilla 8#271 /onesuperior 8#272 /ordmasculine
8#273 /guillemotright 8#274 /onequarter 8#275 /onehalf
8#276 /threequarters 8#277 /questiondown 8#300 /Agrave 8#301 /Aacute
8#302 /Acircumflex 8#303 /Atilde 8#304 /Adieresis 8#305 /Aring
8#306 /AE 8#307 /Ccedilla 8#310 /Egrave 8#311 /Eacute
8#312 /Ecircumflex 8#313 /Edieresis 8#314 /Igrave 8#315 /Iacute
8#316 /Icircumflex 8#317 /Idieresis 8#320 /Eth 8#321 /Ntilde 8#322 /Ograve
8#323 /Oacute 8#324 /Ocircumflex 8#325 /Otilde 8#326 /Odieresis 8#327 /multiply
8#330 /Oslash 8#331 /Ugrave 8#332 /Uacute 8#333 /Ucircumflex
8#334 /Udieresis 8#335 /Yacute 8#336 /Thorn 8#337 /germandbls 8#340 /agrave
8#341 /aacute 8#342 /acircumflex 8#343 /atilde 8#344 /adieresis 8#345 /aring
8#346 /ae 8#347 /ccedilla 8#350 /egrave 8#351 /eacute
8#352 /ecircumflex 8#353 /edieresis 8#354 /igrave 8#355 /iacute
8#356 /icircumflex 8#357 /idieresis 8#360 /eth 8#361 /ntilde 8#362 /ograve
8#363 /oacute 8#364 /ocircumflex 8#365 /otilde 8#366 /odieresis 8#367 /divide
8#370 /oslash 8#371 /ugrave 8#372 /uacute 8#373 /ucircumflex
8#374 /udieresis 8#375 /yacute 8#376 /thorn 8#377 /ydieresis] def
/Times-Bold /Times-Bold-iso isovec ReEncode
/Times-Roman /Times-Roman-iso isovec ReEncode
 /DrawEllipse {
	/endangle exch def
	/startangle exch def
	/yrad exch def
	/xrad exch def
	/y exch def
	/x exch def
	/savematrix mtrx currentmatrix def
	x y tr xrad yrad sc 0 0 1 startangle endangle arc
	closepath
	savematrix setmatrix
	} def

/$F2psBegin {$F2psDict begin /$F2psEnteredState save def} def
/$F2psEnd {$F2psEnteredState restore end} def

$F2psBegin
10 setmiterlimit
 0.06299 0.06299 sc
%
% Fig objects follow
%
7.500 slw
% Ellipse
n 3690 4050 162 162 0 360 DrawEllipse gs col0 s gr

% Ellipse
n 4725 4050 162 162 0 360 DrawEllipse gs col0 s gr

% Ellipse
n 4725 4500 162 162 0 360 DrawEllipse gs col0 s gr

% Ellipse
n 3690 2430 162 162 0 360 DrawEllipse gs col0 s gr

% Ellipse
n 4185 2430 162 162 0 360 DrawEllipse gs col0 s gr

% Ellipse
n 4185 2880 162 162 0 360 DrawEllipse gs col0 s gr

% Polyline
n 3420 1620 m 3960 1620 l 3960 2115 l 3420 2115 l
 cp gs col0 s gr 
% Polyline
n 3960 1620 m 4500 1620 l 4500 2115 l 3960 2115 l
 cp gs col0 s gr 
% Polyline
n 4500 1620 m 5040 1620 l 5040 2115 l 4500 2115 l
 cp gs col0 s gr 
% Polyline
n 5985 1620 m 6525 1620 l 6525 2115 l 5985 2115 l
 cp gs col0 s gr 
% Polyline
n 5040 1620 m 5990 1620 l 5990 2115 l 5040 2115 l
 cp gs col0 s gr 
% Polyline
n 3420 3240 m 3960 3240 l 3960 3735 l 3420 3735 l
 cp gs col0 s gr 
% Polyline
n 3960 3240 m 4500 3240 l 4500 3735 l 3960 3735 l
 cp gs col0 s gr 
% Polyline
n 5040 3240 m 5990 3240 l 5990 3735 l 5040 3735 l
 cp gs col0 s gr 
% Polyline
n 5985 3240 m 6525 3240 l 6525 3735 l 5985 3735 l
 cp gs col0 s gr 
% Polyline
n 2340 2700 m 2880 2700 l 2880 3195 l 2340 3195 l
 cp gs col0 s gr 
% Polyline
n 2340 2205 m 2880 2205 l 2880 2700 l 2340 2700 l
 cp gs col0 s gr 
% Polyline
gs  clippath
3452 1854 m 3408 1813 l 3305 1924 l 3409 1857 l 3349 1965 l cp
eoclip
n 2880 2430 m
 3420 1845 l gs col0 s gr gr

% arrowhead
n 3349 1965 m 3409 1857 l 3305 1924 l  col0 s
% Polyline
gs  clippath
3408 3541 m 3452 3500 l 3349 3389 l 3409 3498 l 3305 3430 l cp
eoclip
n 2880 2925 m
 3420 3510 l gs col0 s gr gr

% arrowhead
n 3305 3430 m 3409 3498 l 3349 3389 l  col0 s
% Polyline
n 3690 2115 m
 3690 2270 l gs col0 s gr 
% Polyline
n 3690 3735 m
 3690 3885 l gs col0 s gr 
% Polyline
n 4725 3735 m
 4725 3885 l gs col0 s gr 
% Polyline
n 4725 4210 m
 4725 4340 l gs col0 s gr 
% Polyline
n 4500 3240 m 5040 3240 l 5040 3735 l 4500 3735 l
 cp gs col0 s gr 
% Polyline
gs  clippath
6375 2100 m 6315 2100 l 6315 2252 l 6345 2132 l 6375 2252 l cp
eoclip
n 6345 2475 m
 6345 2115 l gs col0 s gr gr

% arrowhead
n 6375 2252 m 6345 2132 l 6315 2252 l  col0 s
% Polyline
gs  clippath
6223 3251 m 6283 3257 l 6298 3107 l 6257 3224 l 6239 3101 l cp
eoclip
n 6300 2790 m
 6255 3240 l gs col0 s gr gr

% arrowhead
n 6239 3101 m 6257 3224 l 6298 3107 l  col0 s
% Polyline
n 4185 2115 m
 4185 2270 l gs col0 s gr 
% Polyline
n 4185 2590 m
 4185 2720 l gs col0 s gr 
/Times-Bold-iso ff 240.00 scf sf
2565 3015 m
gs 1 -1 sc (1) col0 sh gr
/Times-Bold-iso ff 240.00 scf sf
2565 2520 m
gs 1 -1 sc (0) col0 sh gr
/Times-Roman-iso ff 180.00 scf sf
2385 2160 m
gs 1 -1 sc (waitfd) col0 sh gr
/Times-Roman-iso ff 180.00 scf sf
4005 2025 m
gs 1 -1 sc (Index) col0 sh gr
/Times-Roman-iso ff 180.00 scf sf
4050 1800 m
gs 1 -1 sc (max) col0 sh gr
/Times-Roman-iso ff 180.00 scf sf
4635 3420 m
gs 1 -1 sc (max) col0 sh gr
/Times-Roman-iso ff 180.00 scf sf
4590 3645 m
gs 1 -1 sc (Index) col0 sh gr
/Times-Roman-iso ff 180.00 scf sf
6030 2745 m
gs 1 -1 sc (size[op]) col0 sh gr
/Times-Roman-iso ff 180.00 scf sf
6030 2565 m
gs 1 -1 sc (current) col0 sh gr
/Times-Roman-iso ff 180.00 scf sf
3645 2475 m
gs 1 -1 sc (T) col0 sh gr
/Times-Roman-iso ff 180.00 scf sf
4680 4095 m
gs 1 -1 sc (T) col0 sh gr
/Times-Roman-iso ff 180.00 scf sf
4680 4590 m
gs 1 -1 sc (T) col0 sh gr
/Times-Roman-iso ff 180.00 scf sf
3645 4140 m
gs 1 -1 sc (T) col0 sh gr
/Times-Roman-iso ff 180.00 scf sf
4140 2475 m
gs 1 -1 sc (T) col0 sh gr
/Times-Roman-iso ff 180.00 scf sf
3420 3195 m
gs 1 -1 sc (write-queue) col0 sh gr
/Times-Roman-iso ff 180.00 scf sf
3420 1575 m
gs 1 -1 sc (read-queue) col0 sh gr
/Times-Roman-iso ff 180.00 scf sf
4140 2925 m
gs 1 -1 sc (T) col0 sh gr
$F2psEnd
rs
