(JNukeVirtualTable "java/lang/Object"
  (JNukeVTableEntry (java) (JNukeMethod "java/lang/Object.<init>" (JNukeSignature "V" (JNukeVector))))
  (JNukeVTableEntry (java) (JNukeMethod "java/lang/Object.hashCode" (JNukeSignature "I" (JNukeVector))))
  (JNukeVTableEntry (native) (JNukeMethod "java/lang/Object.notify" (JNukeSignature "V" (JNukeVector))))
  (JNukeVTableEntry (native) (JNukeMethod "java/lang/Object.notifyAll" (JNukeSignature "V" (JNukeVector))))
  (JNukeVTableEntry (native) (JNukeMethod "java/lang/Object.wait" (JNukeSignature "V" (JNukeVector))))
  (JNukeVTableEntry (native) (JNukeMethod "java/lang/Object.wait" (JNukeSignature "V" (JNukeVector "J"))))
  (JNukeVTableEntry (native) (JNukeMethod "java/lang/Object.getClass" (JNukeSignature "Ljava/lang/Class;" (JNukeVector))))
  (JNukeVTableEntry (java) (JNukeMethod "java/lang/Object.equals" (JNukeSignature "Z" (JNukeVector "Ljava/lang/Object;"))))
)
(JNukeVirtualTable "Class1"
  (JNukeVTableEntry (java) (JNukeMethod "Class1.<init>" (JNukeSignature "V" (JNukeVector))))
  (JNukeVTableEntry (java) (JNukeMethod "Class1.a" (JNukeSignature "V" (JNukeVector))))
  (JNukeVTableEntry (java) (JNukeMethod "Class1.b" (JNukeSignature "V" (JNukeVector))))
  (JNukeVTableEntry (java) (JNukeMethod "Class1.c" (JNukeSignature "V" (JNukeVector))))
  (JNukeVTableEntry (java) (JNukeMethod "Class1.d" (JNukeSignature "V" (JNukeVector))))
  (JNukeVTableEntry (java) (JNukeMethod "Class1.e" (JNukeSignature "V" (JNukeVector))))
  (JNukeVTableEntry (java) (JNukeMethod "Class1.f" (JNukeSignature "V" (JNukeVector))))
  (JNukeVTableEntry (java) (JNukeMethod "java/lang/Object.hashCode" (JNukeSignature "I" (JNukeVector))))
  (JNukeVTableEntry (native) (JNukeMethod "java/lang/Object.notify" (JNukeSignature "V" (JNukeVector))))
  (JNukeVTableEntry (native) (JNukeMethod "java/lang/Object.notifyAll" (JNukeSignature "V" (JNukeVector))))
  (JNukeVTableEntry (native) (JNukeMethod "java/lang/Object.wait" (JNukeSignature "V" (JNukeVector))))
  (JNukeVTableEntry (native) (JNukeMethod "java/lang/Object.wait" (JNukeSignature "V" (JNukeVector "J"))))
  (JNukeVTableEntry (native) (JNukeMethod "java/lang/Object.getClass" (JNukeSignature "Ljava/lang/Class;" (JNukeVector))))
  (JNukeVTableEntry (java) (JNukeMethod "java/lang/Object.equals" (JNukeSignature "Z" (JNukeVector "Ljava/lang/Object;"))))
)
(JNukeVirtualTable "Interface1"
  (JNukeVTableEntry (java) (JNukeMethod "Interface1.f1" (JNukeSignature "V" (JNukeVector))))
  (JNukeVTableEntry (java) (JNukeMethod "Interface1.f2" (JNukeSignature "V" (JNukeVector))))
  (JNukeVTableEntry (java) (JNukeMethod "java/lang/Object.<init>" (JNukeSignature "V" (JNukeVector))))
  (JNukeVTableEntry (java) (JNukeMethod "java/lang/Object.hashCode" (JNukeSignature "I" (JNukeVector))))
  (JNukeVTableEntry (native) (JNukeMethod "java/lang/Object.notify" (JNukeSignature "V" (JNukeVector))))
  (JNukeVTableEntry (native) (JNukeMethod "java/lang/Object.notifyAll" (JNukeSignature "V" (JNukeVector))))
  (JNukeVTableEntry (native) (JNukeMethod "java/lang/Object.wait" (JNukeSignature "V" (JNukeVector))))
  (JNukeVTableEntry (native) (JNukeMethod "java/lang/Object.wait" (JNukeSignature "V" (JNukeVector "J"))))
  (JNukeVTableEntry (native) (JNukeMethod "java/lang/Object.getClass" (JNukeSignature "Ljava/lang/Class;" (JNukeVector))))
  (JNukeVTableEntry (java) (JNukeMethod "java/lang/Object.equals" (JNukeSignature "Z" (JNukeVector "Ljava/lang/Object;"))))
)
(JNukeVirtualTable "Class2"
  (JNukeVTableEntry (java) (JNukeMethod "Class2.<init>" (JNukeSignature "V" (JNukeVector))))
  (JNukeVTableEntry (java) (JNukeMethod "Class2.f1" (JNukeSignature "V" (JNukeVector))))
  (JNukeVTableEntry (java) (JNukeMethod "Class2.f2" (JNukeSignature "V" (JNukeVector))))
  (JNukeVTableEntry (java) (JNukeMethod "Class2.a" (JNukeSignature "V" (JNukeVector))))
  (JNukeVTableEntry (java) (JNukeMethod "Class2.b" (JNukeSignature "V" (JNukeVector))))
  (JNukeVTableEntry (java) (JNukeMethod "Class2.foo" (JNukeSignature "V" (JNukeVector))))
  (JNukeVTableEntry (java) (JNukeMethod "Class1.c" (JNukeSignature "V" (JNukeVector))))
  (JNukeVTableEntry (java) (JNukeMethod "Class1.d" (JNukeSignature "V" (JNukeVector))))
  (JNukeVTableEntry (java) (JNukeMethod "Class1.e" (JNukeSignature "V" (JNukeVector))))
  (JNukeVTableEntry (java) (JNukeMethod "Class1.f" (JNukeSignature "V" (JNukeVector))))
  (JNukeVTableEntry (java) (JNukeMethod "java/lang/Object.hashCode" (JNukeSignature "I" (JNukeVector))))
  (JNukeVTableEntry (native) (JNukeMethod "java/lang/Object.notify" (JNukeSignature "V" (JNukeVector))))
  (JNukeVTableEntry (native) (JNukeMethod "java/lang/Object.notifyAll" (JNukeSignature "V" (JNukeVector))))
  (JNukeVTableEntry (native) (JNukeMethod "java/lang/Object.wait" (JNukeSignature "V" (JNukeVector))))
  (JNukeVTableEntry (native) (JNukeMethod "java/lang/Object.wait" (JNukeSignature "V" (JNukeVector "J"))))
  (JNukeVTableEntry (native) (JNukeMethod "java/lang/Object.getClass" (JNukeSignature "Ljava/lang/Class;" (JNukeVector))))
  (JNukeVTableEntry (java) (JNukeMethod "java/lang/Object.equals" (JNukeSignature "Z" (JNukeVector "Ljava/lang/Object;"))))
)
