%!PS-Adobe-2.0 EPSF-2.0
%%Title: startthread.dia
%%Creator: Dia v0.90
%%CreationDate: Wed Feb 26 10:04:23 2003
%%For: pascal
%%Magnification: 1.0000
%%Orientation: Portrait
%%BoundingBox: 0 0 513 488
%%Pages: 1
%%EndComments
%%BeginProlog
/cp {closepath} bind def
/c {curveto} bind def
/f {fill} bind def
/a {arc} bind def
/ef {eofill} bind def
/ex {exch} bind def
/gr {grestore} bind def
/gs {gsave} bind def
/sa {save} bind def
/rs {restore} bind def
/l {lineto} bind def
/m {moveto} bind def
/rm {rmoveto} bind def
/n {newpath} bind def
/s {stroke} bind def
/sh {show} bind def
/slc {setlinecap} bind def
/slj {setlinejoin} bind def
/slw {setlinewidth} bind def
/srgb {setrgbcolor} bind def
/rot {rotate} bind def
/sc {scale} bind def
/sd {setdash} bind def
/ff {findfont} bind def
/sf {setfont} bind def
/scf {scalefont} bind def
/sw {stringwidth pop} bind def
/tr {translate} bind def

/ellipsedict 8 dict def
ellipsedict /mtrx matrix put
/ellipse
{ ellipsedict begin
   /endangle exch def
   /startangle exch def
   /yrad exch def
   /xrad exch def
   /y exch def
   /x exch def   /savematrix mtrx currentmatrix def
   x y tr xrad yrad sc
   0 0 1 startangle endangle arc
   savematrix setmatrix
   end
} def

/mergeprocs {
dup length
3 -1 roll
dup
length
dup
5 1 roll
3 -1 roll
add
array cvx
dup
3 -1 roll
0 exch
putinterval
dup
4 2 roll
putinterval
} bind def
%%EndProlog

%%BeginSetup
%%EndSetup
28.346000 -28.346000 scale
-3.586800 -19.203509 translate

1.000000 1.000000 1.000000 srgb
n 3.636800 2.050000 m 3.636800 3.950000 l 5.669600 3.950000 l 5.669600 2.050000 l f
0.100000 slw
[] 0 sd
[] 0 sd
0 slj
0.000000 0.000000 0.000000 srgb
n 3.636800 2.050000 m 3.636800 3.950000 l 5.669600 3.950000 l 5.669600 2.050000 l cp s
 [ /xi /xi /xi /xi /xi /xi /xi /xi /xi /xi /xi /xi /xi /xi /xi /xi
 /xi /xi /xi /xi /xi /xi /xi /xi /xi /xi /xi /xi /xi /xi /xi /xi
 /T /zero /braceleft /one /braceright /two /comma /three /xi /xi /four /five /six /seven /parenleft /parenright
 /C /o /n /d /i /t /space /D /e /a /l /c /k /xi /xi /xi
 /xi /xi /xi /xi /xi /xi /xi /xi /xi /xi /xi /xi /xi /xi /xi /xi
 /xi /xi /xi /xi /xi /xi /xi /xi /xi /xi /xi /xi /xi /xi /xi /xi
 /xi /xi /xi /xi /xi /xi /xi /xi /xi /xi /xi /xi /xi /xi /xi /xi
 /xi /xi /xi /xi /xi /xi /xi /xi /xi /xi /xi /xi /xi /xi /xi /xi
 /xi /xi /xi /xi /xi /xi /xi /xi /xi /xi /xi /xi /xi /xi /xi /xi
 /xi /xi /xi /xi /xi /xi /xi /xi /xi /xi /xi /xi /xi /xi /xi /xi
 /xi /xi /xi /xi /xi /xi /xi /xi /xi /xi /xi /xi /xi /xi /xi /xi
 /xi /xi /xi /xi /xi /xi /xi /xi /xi /xi /xi /xi /xi /xi /xi /xi
 /xi /xi /xi /xi /xi /xi /xi /xi /xi /xi /xi /xi /xi /xi /xi /xi
 /xi /xi /xi /xi /xi /xi /xi /xi /xi /xi /xi /xi /xi /xi /xi /xi
 /xi /xi /xi /xi /xi /xi /xi /xi /xi /xi /xi /xi /xi /xi /xi /xi
 /xi /xi /xi /xi /xi /xi /xi /xi /xi /xi /xi /xi /xi /xi /xi /xi
] /e0 exch def
/Courier_e0 undefinefont
/Courier_e0
  /Courier findfont
  dup length dict begin
  {1 index /FID ne {def} {pop pop} ifelse} forall
  /Encoding e0 def
  currentdict end
definefont pop
/Courier_e0 ff 0.800000 scf sf
( !) sw
2 div 4.653200 ex sub 3.196491 m ( !)
 gs 1 -1 sc sh gr
0.100000 slw
[] 0 sd
[0.400000] 0 sd
0 slc
n 4.653200 3.950000 m 4.666400 6.950000 l s
0.100000 slw
[] 0 sd
0 slj
0 slc
n 4.412882 6.151108 m 4.666400 6.950000 l 4.912878 6.148908 l s
4.659800 5.450000 m /Courier_e0 ff 0.800000 scf sf
("#$)
 gs 1 -1 sc sh gr
1.000000 1.000000 1.000000 srgb
n 3.650000 6.950000 m 3.650000 8.850000 l 5.682800 8.850000 l 5.682800 6.950000 l f
0.100000 slw
[] 0 sd
[] 0 sd
0 slj
0.000000 0.000000 0.000000 srgb
n 3.650000 6.950000 m 3.650000 8.850000 l 5.682800 8.850000 l 5.682800 6.950000 l cp s
/Courier_e0 ff 0.800000 scf sf
( !) sw
2 div 4.666400 ex sub 8.096491 m ( !)
 gs 1 -1 sc sh gr
0.100000 slw
[] 0 sd
[0.400000] 0 sd
0 slc
n 4.666400 8.850000 m 4.666400 11.750000 l s
0.100000 slw
[] 0 sd
0 slj
0 slc
n 4.416400 10.950000 m 4.666400 11.750000 l 4.916400 10.950000 l s
4.666400 10.300000 m /Courier_e0 ff 0.800000 scf sf
("%&'&*$)
 gs 1 -1 sc sh gr
1.000000 1.000000 1.000000 srgb
n 9.336800 6.950000 m 9.336800 8.850000 l 11.396000 8.850000 l 11.396000 6.950000 l f
0.100000 slw
[] 0 sd
[] 0 sd
0 slj
0.000000 0.000000 0.000000 srgb
n 9.336800 6.950000 m 9.336800 8.850000 l 11.396000 8.850000 l 11.396000 6.950000 l cp s
/Courier_e0 ff 0.800000 scf sf
( #) sw
2 div 10.366400 ex sub 8.096491 m ( #)
 gs 1 -1 sc sh gr
0.100000 slw
[] 0 sd
[0.400000] 0 sd
0 slc
n 10.366400 8.850000 m 10.366400 11.650000 l s
0.100000 slw
[] 0 sd
0 slj
0 slc
n 10.116400 10.850000 m 10.366400 11.650000 l 10.616400 10.850000 l s
10.366400 10.250000 m /Courier_e0 ff 0.800000 scf sf
("+&,&-$)
 gs 1 -1 sc sh gr
0.100000 slw
[] 0 sd
[] 0 sd
0 slj
0 slc
n 5.682800 7.900000 m 5.682800 7.900000 l 9.336800 7.900000 l 9.336800 7.900000 l s
1.000000 1.000000 1.000000 srgb
n 3.636800 11.750000 m 3.636800 13.650000 l 5.696000 13.650000 l 5.696000 11.750000 l f
0.100000 slw
[] 0 sd
[] 0 sd
0 slj
0.000000 0.000000 0.000000 srgb
n 3.636800 11.750000 m 3.636800 13.650000 l 5.696000 13.650000 l 5.696000 11.750000 l cp s
/Courier_e0 ff 0.800000 scf sf
( #) sw
2 div 4.666400 ex sub 12.896491 m ( #)
 gs 1 -1 sc sh gr
0.100000 slw
[] 0 sd
[0.400000] 0 sd
0 slc
n 4.666400 13.650000 m 4.666400 16.550000 l s
0.100000 slw
[] 0 sd
0 slj
0 slc
n 4.416400 15.750000 m 4.666400 16.550000 l 4.916400 15.750000 l s
4.666400 15.100000 m /Courier_e0 ff 0.800000 scf sf
("+&,&-$)
 gs 1 -1 sc sh gr
1.000000 1.000000 1.000000 srgb
n 3.834800 16.550000 m 3.834800 18.450000 l 5.498000 18.450000 l 5.498000 16.550000 l f
0.100000 slw
[] 0 sd
[] 0 sd
0 slj
0.000000 0.000000 0.000000 srgb
n 3.834800 16.550000 m 3.834800 18.450000 l 5.498000 18.450000 l 5.498000 16.550000 l cp s
/Courier_e0 ff 0.800000 scf sf
(./) sw
2 div 4.666400 ex sub 17.696491 m (./)
 gs 1 -1 sc sh gr
1.000000 1.000000 1.000000 srgb
n 9.350000 11.650000 m 9.350000 13.550000 l 11.382800 13.550000 l 11.382800 11.650000 l f
0.100000 slw
[] 0 sd
[] 0 sd
0 slj
0.000000 0.000000 0.000000 srgb
n 9.350000 11.650000 m 9.350000 13.550000 l 11.382800 13.550000 l 11.382800 11.650000 l cp s
/Courier_e0 ff 0.800000 scf sf
( !) sw
2 div 10.366400 ex sub 12.796491 m ( !)
 gs 1 -1 sc sh gr
0.100000 slw
[] 0 sd
[0.400000] 0 sd
0 slc
n 10.366400 13.550000 m 10.357106 16.650000 l s
0.100000 slw
[] 0 sd
0 slj
0 slc
n 10.109506 15.849254 m 10.357106 16.650000 l 10.609503 15.850753 l s
10.361753 15.100000 m /Courier_e0 ff 0.800000 scf sf
("%$)
 gs 1 -1 sc sh gr
0.756863 0.756863 0.756863 srgb
n 10.357106 16.650000 m 11.564212 17.857106 l 10.357106 19.064212 l 9.150000 17.857106 l f
0.100000 slw
[] 0 sd
[] 0 sd
0 slj
0.000000 0.000000 0.000000 srgb
n 10.357106 16.650000 m 11.564212 17.857106 l 10.357106 19.064212 l 9.150000 17.857106 l cp s
/Courier_e0 ff 0.800000 scf sf
(01234541267893:1;<6) sw
2 div 16.800000 ex sub 18.100000 m (01234541267893:1;<6)
 gs 1 -1 sc sh gr
(956') sw
2 div 16.800000 ex sub 18.900000 m (956')
 gs 1 -1 sc sh gr
showpage
