%!PS-Adobe-2.0 EPSF-2.0
%%Title: /home/zboris/semesterarbeit/doku/rollbacknet.fig
%%Creator: fig2dev Version 3.2 Patchlevel 4
%%CreationDate: Tue Mar 15 22:21:58 2005
%%For: zboris@linux (Boris Z.)
%%BoundingBox: 0 0 287 503
%%Magnification: 1.0000
%%EndComments
/$F2psDict 200 dict def
$F2psDict begin
$F2psDict /mtrx matrix put
/col-1 {0 setgray} bind def
/col0 {0.000 0.000 0.000 srgb} bind def
/col1 {0.000 0.000 1.000 srgb} bind def
/col2 {0.000 1.000 0.000 srgb} bind def
/col3 {0.000 1.000 1.000 srgb} bind def
/col4 {1.000 0.000 0.000 srgb} bind def
/col5 {1.000 0.000 1.000 srgb} bind def
/col6 {1.000 1.000 0.000 srgb} bind def
/col7 {1.000 1.000 1.000 srgb} bind def
/col8 {0.000 0.000 0.560 srgb} bind def
/col9 {0.000 0.000 0.690 srgb} bind def
/col10 {0.000 0.000 0.820 srgb} bind def
/col11 {0.530 0.810 1.000 srgb} bind def
/col12 {0.000 0.560 0.000 srgb} bind def
/col13 {0.000 0.690 0.000 srgb} bind def
/col14 {0.000 0.820 0.000 srgb} bind def
/col15 {0.000 0.560 0.560 srgb} bind def
/col16 {0.000 0.690 0.690 srgb} bind def
/col17 {0.000 0.820 0.820 srgb} bind def
/col18 {0.560 0.000 0.000 srgb} bind def
/col19 {0.690 0.000 0.000 srgb} bind def
/col20 {0.820 0.000 0.000 srgb} bind def
/col21 {0.560 0.000 0.560 srgb} bind def
/col22 {0.690 0.000 0.690 srgb} bind def
/col23 {0.820 0.000 0.820 srgb} bind def
/col24 {0.500 0.190 0.000 srgb} bind def
/col25 {0.630 0.250 0.000 srgb} bind def
/col26 {0.750 0.380 0.000 srgb} bind def
/col27 {1.000 0.500 0.500 srgb} bind def
/col28 {1.000 0.630 0.630 srgb} bind def
/col29 {1.000 0.750 0.750 srgb} bind def
/col30 {1.000 0.880 0.880 srgb} bind def
/col31 {1.000 0.840 0.000 srgb} bind def

end
save
newpath 0 503 moveto 0 0 lineto 287 0 lineto 287 503 lineto closepath clip newpath
-28.3 578.3 translate
1 -1 scale

/cp {closepath} bind def
/ef {eofill} bind def
/gr {grestore} bind def
/gs {gsave} bind def
/sa {save} bind def
/rs {restore} bind def
/l {lineto} bind def
/m {moveto} bind def
/rm {rmoveto} bind def
/n {newpath} bind def
/s {stroke} bind def
/sh {show} bind def
/slc {setlinecap} bind def
/slj {setlinejoin} bind def
/slw {setlinewidth} bind def
/srgb {setrgbcolor} bind def
/rot {rotate} bind def
/sc {scale} bind def
/sd {setdash} bind def
/ff {findfont} bind def
/sf {setfont} bind def
/scf {scalefont} bind def
/sw {stringwidth} bind def
/tr {translate} bind def
/tnt {dup dup currentrgbcolor
  4 -2 roll dup 1 exch sub 3 -1 roll mul add
  4 -2 roll dup 1 exch sub 3 -1 roll mul add
  4 -2 roll dup 1 exch sub 3 -1 roll mul add srgb}
  bind def
/shd {dup dup currentrgbcolor 4 -2 roll mul 4 -2 roll mul
  4 -2 roll mul srgb} bind def
/reencdict 12 dict def /ReEncode { reencdict begin
/newcodesandnames exch def /newfontname exch def /basefontname exch def
/basefontdict basefontname findfont def /newfont basefontdict maxlength dict def
basefontdict { exch dup /FID ne { dup /Encoding eq
{ exch dup length array copy newfont 3 1 roll put }
{ exch newfont 3 1 roll put } ifelse } { pop pop } ifelse } forall
newfont /FontName newfontname put newcodesandnames aload pop
128 1 255 { newfont /Encoding get exch /.notdef put } for
newcodesandnames length 2 idiv { newfont /Encoding get 3 1 roll put } repeat
newfontname newfont definefont pop end } def
/isovec [
8#055 /minus 8#200 /grave 8#201 /acute 8#202 /circumflex 8#203 /tilde
8#204 /macron 8#205 /breve 8#206 /dotaccent 8#207 /dieresis
8#210 /ring 8#211 /cedilla 8#212 /hungarumlaut 8#213 /ogonek 8#214 /caron
8#220 /dotlessi 8#230 /oe 8#231 /OE
8#240 /space 8#241 /exclamdown 8#242 /cent 8#243 /sterling
8#244 /currency 8#245 /yen 8#246 /brokenbar 8#247 /section 8#250 /dieresis
8#251 /copyright 8#252 /ordfeminine 8#253 /guillemotleft 8#254 /logicalnot
8#255 /hyphen 8#256 /registered 8#257 /macron 8#260 /degree 8#261 /plusminus
8#262 /twosuperior 8#263 /threesuperior 8#264 /acute 8#265 /mu 8#266 /paragraph
8#267 /periodcentered 8#270 /cedilla 8#271 /onesuperior 8#272 /ordmasculine
8#273 /guillemotright 8#274 /onequarter 8#275 /onehalf
8#276 /threequarters 8#277 /questiondown 8#300 /Agrave 8#301 /Aacute
8#302 /Acircumflex 8#303 /Atilde 8#304 /Adieresis 8#305 /Aring
8#306 /AE 8#307 /Ccedilla 8#310 /Egrave 8#311 /Eacute
8#312 /Ecircumflex 8#313 /Edieresis 8#314 /Igrave 8#315 /Iacute
8#316 /Icircumflex 8#317 /Idieresis 8#320 /Eth 8#321 /Ntilde 8#322 /Ograve
8#323 /Oacute 8#324 /Ocircumflex 8#325 /Otilde 8#326 /Odieresis 8#327 /multiply
8#330 /Oslash 8#331 /Ugrave 8#332 /Uacute 8#333 /Ucircumflex
8#334 /Udieresis 8#335 /Yacute 8#336 /Thorn 8#337 /germandbls 8#340 /agrave
8#341 /aacute 8#342 /acircumflex 8#343 /atilde 8#344 /adieresis 8#345 /aring
8#346 /ae 8#347 /ccedilla 8#350 /egrave 8#351 /eacute
8#352 /ecircumflex 8#353 /edieresis 8#354 /igrave 8#355 /iacute
8#356 /icircumflex 8#357 /idieresis 8#360 /eth 8#361 /ntilde 8#362 /ograve
8#363 /oacute 8#364 /ocircumflex 8#365 /otilde 8#366 /odieresis 8#367 /divide
8#370 /oslash 8#371 /ugrave 8#372 /uacute 8#373 /ucircumflex
8#374 /udieresis 8#375 /yacute 8#376 /thorn 8#377 /ydieresis] def
/Helvetica /Helvetica-iso isovec ReEncode
/Times-Bold /Times-Bold-iso isovec ReEncode
/$F2psBegin {$F2psDict begin /$F2psEnteredState save def} def
/$F2psEnd {$F2psEnteredState restore end} def

$F2psBegin
10 setmiterlimit
0 slj 0 slc
 0.06299 0.06299 sc
%
% Fig objects follow
%
% 
% here starts figure with depth 50
% Polyline
7.500 slw
n 1575 1215 m 4725 1215 l 4725 1485 l 1575 1485 l
 cp gs col0 s gr 
% Polyline
n 1575 1665 m 4725 1665 l 4725 1935 l 1575 1935 l
 cp gs col0 s gr 
/Helvetica-iso ff 180.00 scf sf
450 1845 m
gs 1 -1 sc (Writecache) col0 sh gr
/Helvetica-iso ff 180.00 scf sf
450 1395 m
gs 1 -1 sc (Readcache) col0 sh gr
% Polyline
gs  clippath
2220 8250 m 2280 8250 l 2280 8149 l 2250 8224 l 2220 8149 l cp
eoclip
n 2250 8055 m
 2250 8235 l gs col0 s gr gr

% arrowhead
n 2220 8149 m 2250 8224 l 2280 8149 l 2220 8149 l  cp gs 0.00 setgray ef gr  col0 s
% Polyline
gs  clippath
3180 8940 m 3120 8940 l 3120 9041 l 3150 8966 l 3180 9041 l cp
eoclip
n 3150 8955 m
 3150 9135 l gs col0 s gr gr

% arrowhead
n 3180 9041 m 3150 8966 l 3120 9041 l 3180 9041 l  cp gs 0.00 setgray ef gr  col0 s
/Helvetica-iso ff 180.00 scf sf
450 8865 m
gs 1 -1 sc (Writecache) col0 sh gr
/Helvetica-iso ff 180.00 scf sf
450 8415 m
gs 1 -1 sc (Readcache) col0 sh gr
/Helvetica-iso ff 150.00 scf sf
3195 9180 m
gs 1 -1 sc (Write-MS1) col0 sh gr
/Helvetica-iso ff 150.00 scf sf
1485 8145 m
gs 1 -1 sc (Read-MS1) col0 sh gr
% Polyline
n 1575 4635 m 4725 4635 l 4725 4905 l 1575 4905 l
 cp gs col0 s gr 
% Polyline
n 1575 4635 m 2250 4635 l 2250 4905 l 1575 4905 l
 cp gs 0.30 setgray ef gr gs col0 s gr 
% Polyline
n 1575 8235 m 2250 8235 l 2250 8505 l 1575 8505 l
 cp gs 0.30 setgray ef gr gs col0 s gr 
% Polyline
gs  clippath
2985 2985 m 3045 2985 l 3045 2834 l 3015 2954 l 2985 2834 l cp
eoclip
n 3015 2025 m
 3015 2970 l gs col0 s gr gr

% arrowhead
n 2985 2834 m 3015 2954 l 3045 2834 l 2985 2834 l  cp gs 0.00 setgray ef gr  col0 s
% Polyline
gs  clippath
2985 4560 m 3045 4560 l 3045 4409 l 3015 4529 l 2985 4409 l cp
eoclip
n 3015 3870 m
 3015 4545 l gs col0 s gr gr

% arrowhead
n 2985 4409 m 3015 4529 l 3045 4409 l 2985 4409 l  cp gs 0.00 setgray ef gr  col0 s
% Polyline
n 1575 6525 m 2250 6525 l 2250 6795 l 1575 6795 l
 cp gs 0.30 setgray ef gr gs col0 s gr 
% Polyline
n 1575 6975 m 2025 6975 l 2025 7245 l 1575 7245 l
 cp gs 0.60 setgray ef gr gs col0 s gr 
% Polyline
n 2025 6975 m 3150 6975 l 3150 7245 l 2025 7245 l
 cp gs 0.50 setgray ef gr gs col0 s gr 
% Polyline
n 1575 6975 m 4725 6975 l 4725 7245 l 1575 7245 l
 cp gs col0 s gr 
% Polyline
n 1575 3060 m 2250 3060 l 2250 3330 l 1575 3330 l
 cp gs 0.30 setgray ef gr gs col0 s gr 
% Polyline
n 1575 3510 m 2025 3510 l 2025 3780 l 1575 3780 l
 cp gs 0.60 setgray ef gr gs col0 s gr 
% Polyline
n 2025 3510 m 3150 3510 l 3150 3780 l 2025 3780 l
 cp gs 0.50 setgray ef gr gs col0 s gr 
% Polyline
n 1575 3060 m 4725 3060 l 4725 3330 l 1575 3330 l
 cp gs col0 s gr 
% Polyline
n 2250 6525 m 2700 6525 l 2700 6795 l 2250 6795 l
 cp gs 0.40 setgray ef gr gs col0 s gr 
% Polyline
gs  clippath
2985 6450 m 3045 6450 l 3045 6299 l 3015 6419 l 2985 6299 l cp
eoclip
n 3015 5445 m
 3015 6435 l gs col0 s gr gr

% arrowhead
n 2985 6299 m 3015 6419 l 3045 6299 l 2985 6299 l  cp gs 0.00 setgray ef gr  col0 s
% Polyline
gs  clippath
2985 8025 m 3045 8025 l 3045 7874 l 3015 7994 l 2985 7874 l cp
eoclip
n 3015 7335 m
 3015 8010 l gs col0 s gr gr

% arrowhead
n 2985 7874 m 3015 7994 l 3045 7874 l 2985 7874 l  cp gs 0.00 setgray ef gr  col0 s
% Polyline
n 1575 8235 m 4725 8235 l 4725 8505 l 1575 8505 l
 cp gs col0 s gr 
% Polyline
n 1575 8685 m 4725 8685 l 4725 8955 l 1575 8955 l
 cp gs col0 s gr 
% Polyline
gs  clippath
2220 6540 m 2280 6540 l 2280 6439 l 2250 6514 l 2220 6439 l cp
eoclip
n 2250 6345 m
 2250 6525 l gs col0 s gr gr

% arrowhead
n 2220 6439 m 2250 6514 l 2280 6439 l 2220 6439 l  cp gs 0.00 setgray ef gr  col0 s
% Polyline
gs  clippath
3180 7230 m 3120 7230 l 3120 7331 l 3150 7256 l 3180 7331 l cp
eoclip
n 3150 7245 m
 3150 7425 l gs col0 s gr gr

% arrowhead
n 3180 7331 m 3150 7256 l 3120 7331 l 3180 7331 l  cp gs 0.00 setgray ef gr  col0 s
% Polyline
gs  clippath
3180 5340 m 3120 5340 l 3120 5441 l 3150 5366 l 3180 5441 l cp
eoclip
n 3150 5355 m
 3150 5535 l gs col0 s gr gr

% arrowhead
n 3180 5441 m 3150 5366 l 3120 5441 l 3180 5441 l  cp gs 0.00 setgray ef gr  col0 s
% Polyline
gs  clippath
2220 4650 m 2280 4650 l 2280 4549 l 2250 4624 l 2220 4549 l cp
eoclip
n 2250 4455 m
 2250 4635 l gs col0 s gr gr

% arrowhead
n 2220 4549 m 2250 4624 l 2280 4549 l 2220 4549 l  cp gs 0.00 setgray ef gr  col0 s
% Polyline
n 1575 5085 m 2025 5085 l 2025 5355 l 1575 5355 l
 cp gs 0.60 setgray ef gr gs col0 s gr 
% Polyline
n 2025 5085 m 3150 5085 l 3150 5355 l 2025 5355 l
 cp gs 0.50 setgray ef gr gs col0 s gr 
% Polyline
n 1575 5085 m 4725 5085 l 4725 5355 l 1575 5355 l
 cp gs col0 s gr 
% Polyline
n 1575 3510 m 4725 3510 l 4725 3780 l 1575 3780 l
 cp gs col0 s gr 
% Polyline
n 1575 8685 m 2025 8685 l 2025 8955 l 1575 8955 l
 cp gs 0.75 setgray ef gr gs col0 s gr 
% Polyline
n 1575 6525 m 4725 6525 l 4725 6795 l 1575 6795 l
 cp gs col0 s gr 
% Polyline
n 2025 8685 m 3150 8685 l 3150 8955 l 2025 8955 l
 cp gs 0.50 setgray ef gr gs col0 s gr 
% Polyline
n 3150 6975 m 3600 6975 l 3600 7245 l 3150 7245 l
 cp gs 0.60 setgray ef gr gs col0 s gr 
% Polyline
n 1575 8685 m 2025 8685 l 2025 8955 l 1575 8955 l
 cp gs 0.60 setgray ef gr gs col0 s gr 
% Polyline
n 2250 8235 m 2700 8235 l 2700 8505 l 2250 8505 l
 cp gs 0.90 setgray ef gr gs col0 s gr 
% Polyline
n 3150 8685 m 3600 8685 l 3600 8955 l 3150 8955 l
 cp gs 0.90 setgray ef gr gs col0 s gr 
/Helvetica-iso ff 180.00 scf sf
3150 2880 m
gs 1 -1 sc (Write 50 Bytes) col0 sh gr
/Helvetica-iso ff 180.00 scf sf
3150 2565 m
gs 1 -1 sc (Read 30 Bytes) col0 sh gr
/Helvetica-iso ff 180.00 scf sf
3150 2250 m
gs 1 -1 sc (Write 20 Bytes) col0 sh gr
/Helvetica-iso ff 180.00 scf sf
3150 5895 m
gs 1 -1 sc (Write 20 Bytes) col0 sh gr
/Helvetica-iso ff 180.00 scf sf
450 3690 m
gs 1 -1 sc (Writecache) col0 sh gr
/Helvetica-iso ff 180.00 scf sf
450 3240 m
gs 1 -1 sc (Readcache) col0 sh gr
/Helvetica-iso ff 180.00 scf sf
3150 6165 m
gs 1 -1 sc (Read 20 Bytes) col0 sh gr
/Helvetica-iso ff 180.00 scf sf
450 7155 m
gs 1 -1 sc (Writecache) col0 sh gr
/Helvetica-iso ff 180.00 scf sf
450 6705 m
gs 1 -1 sc (Readcache) col0 sh gr
/Helvetica-iso ff 150.00 scf sf
1485 6435 m
gs 1 -1 sc (Read-MS1) col0 sh gr
/Helvetica-iso ff 150.00 scf sf
3195 5580 m
gs 1 -1 sc (Write-MS1) col0 sh gr
/Helvetica-iso ff 150.00 scf sf
1530 4500 m
gs 1 -1 sc (Read-MS1) col0 sh gr
/Helvetica-iso ff 180.00 scf sf
450 4815 m
gs 1 -1 sc (Readcache) col0 sh gr
/Helvetica-iso ff 180.00 scf sf
450 5265 m
gs 1 -1 sc (Writecache) col0 sh gr
/Helvetica-iso ff 150.00 scf sf
3195 7470 m
gs 1 -1 sc (Write-MS1) col0 sh gr
/Times-Bold-iso ff 180.00 scf sf
3150 4230 m
gs 1 -1 sc (Set Milestone 1) col-1 sh gr
/Times-Bold-iso ff 180.00 scf sf
3150 7875 m
gs 1 -1 sc (Rollback to Milestone 1) col0 sh gr
% here ends figure;
$F2psEnd
rs
showpage
