#FIG 3.2
Portrait
Center
Inches
Letter  
100.00
Single
-2
1200 2
5 1 0 1 -1 7 0 0 -1 0.000 0 0 1 0 3187.500 4612.500 1950 3975 2550 3375 3075 3225
	1 1 1.00 60.00 120.00
5 1 0 1 -1 7 0 0 -1 0.000 0 0 1 0 3225.000 3300.000 3150 4275 2700 4125 2400 3825
	1 1 1.00 60.00 120.00
5 1 0 1 -1 7 0 0 -1 0.000 0 0 1 0 2554.167 3512.500 2175 2625 2625 2550 3075 2700
	1 1 1.00 60.00 120.00
5 1 0 1 -1 7 0 0 -1 0.000 0 0 1 0 2554.167 2912.500 2175 2025 2625 1950 3075 2100
	1 1 1.00 60.00 120.00
5 1 0 1 -1 7 0 0 -1 0.000 0 0 1 0 4505.147 2602.206 5775 3825 5250 4200 4275 4350
	1 1 1.00 60.00 120.00
5 1 0 1 -1 7 0 0 -1 0.000 0 0 1 0 4050.000 4829.167 1725 1500 3375 825 4725 825
	1 1 1.00 60.00 120.00
5 1 0 1 -1 7 0 0 -1 0.000 0 0 1 0 4468.750 3652.344 4725 3075 5100 3675 4575 4275
	1 1 1.00 60.00 120.00
5 1 0 1 -1 7 0 0 -1 0.000 0 0 1 0 4500.000 1950.000 5625 1200 5775 1500 5850 1875
	1 1 1.00 60.00 120.00
6 4125 1950 4575 3300
4 0 -1 0 0 16 12 0.0000 4 135 390 4125 2400 false\001
4 0 -1 0 0 16 12 0.0000 4 135 390 4125 2100 false\001
4 0 -1 0 0 16 12 0.0000 4 135 315 4125 2700 true\001
4 0 -1 0 0 16 12 0.0000 4 135 315 4125 3300 true\001
-6
6 5550 2025 6150 2400
4 0 -1 0 0 16 12 0.0000 4 135 390 5550 2400 state\001
4 0 -1 0 0 16 12 0.0000 4 180 600 5550 2175 System\001
-6
6 5550 4125 6225 4575
4 0 -1 0 0 16 12 0.0000 4 135 420 5550 4275 State\001
4 0 -1 0 0 16 12 0.0000 4 180 630 5550 4500 change\001
-6
6 2625 3525 3300 3975
4 0 -1 0 0 16 12 0.0000 4 180 675 2625 3900 interrupt\001
4 0 -1 0 0 16 12 0.0000 4 135 390 2625 3675 Task\001
-6
6 4425 3525 4950 3900
4 0 -1 0 0 16 12 0.0000 4 135 465 4425 3900 event\001
4 0 -1 0 0 16 12 0.0000 4 135 405 4425 3675 Lock\001
-6
6 2250 2700 3000 3150
4 0 -1 0 0 16 12 0.0000 4 135 405 2250 2850 Lock\001
4 0 -1 0 0 16 12 0.0000 4 180 690 2250 3075 property\001
-6
6 1650 600 2550 975
4 0 -1 0 0 16 12 0.0000 4 135 600 1650 750 Control\001
4 0 -1 0 0 16 12 0.0000 4 135 885 1650 975 commands\001
-6
1 1 0 1 -1 7 0 0 -1 0.000 1 0.0000 1650 2100 450 225 1650 2100 2100 2325
1 1 0 1 -1 7 0 0 -1 0.000 1 0.0000 1650 2700 450 225 1650 2700 2100 2925
1 1 0 1 -1 7 0 0 -1 0.000 1 0.0000 1650 4275 450 225 1650 4275 2100 4500
1 1 0 1 -1 7 0 0 -1 0.000 1 0.0000 3750 4275 450 225 3750 4275 4200 4500
1 1 0 1 -1 7 0 0 -1 0.000 1 0.0000 5850 2625 450 75 5850 2625 6300 2700
1 1 0 1 -1 7 0 0 -1 0.000 1 0.0000 5850 3675 450 75 5850 3675 6300 3750
2 1 0 1 -1 7 0 0 -1 0.000 0 0 -1 0 0 2
	 5400 3675 5400 2625
2 1 0 1 -1 7 0 0 -1 0.000 0 0 -1 0 0 2
	 6300 2625 6300 3675
2 2 0 1 -1 7 0 0 -1 0.000 0 0 -1 0 0 5
	 4800 900 5175 900 5175 1050 4800 1050 4800 900
2 2 0 1 -1 7 0 0 -1 0.000 0 0 -1 0 0 5
	 5550 900 5925 900 5925 1050 5550 1050 5550 900
2 2 0 1 -1 7 0 0 -1 0.000 0 0 -1 0 0 5
	 5250 675 5475 675 5475 1350 5250 1350 5250 675
2 1 0 1 -1 7 0 0 -1 0.000 0 0 -1 0 0 2
	 5175 975 5250 975
2 1 0 1 -1 7 0 0 -1 0.000 0 0 -1 0 0 2
	 5475 975 5550 975
2 2 0 1 -1 7 0 0 -1 0.000 0 0 -1 0 0 5
	 5325 1350 5400 1350 5400 1425 5325 1425 5325 1350
2 1 0 1 0 7 50 0 -1 0.000 0 0 -1 0 0 2
	 3225 2175 4575 2175
2 1 0 1 0 7 50 0 -1 0.000 0 0 -1 0 0 2
	 3225 2775 4575 2775
2 1 0 1 0 7 50 0 -1 0.000 0 0 -1 0 0 2
	 3225 2475 4575 2475
2 1 0 1 0 7 50 0 -1 0.000 0 0 -1 0 0 2
	 3225 3075 4575 3075
2 1 0 1 -1 7 0 0 -1 0.000 0 0 -1 0 0 2
	 3525 1875 3525 3375
2 1 0 1 0 7 50 0 -1 0.000 0 0 -1 0 0 2
	 4050 1875 4050 3375
2 2 0 1 0 7 50 0 -1 0.000 0 0 -1 0 0 5
	 3225 1875 4575 1875 4575 3375 3225 3375 3225 1875
4 0 -1 0 0 16 12 0.0000 4 135 720 5925 1575 Monitors\001
4 1 -1 0 0 16 12 0.0000 4 180 1575 3975 1725 Property lock table\001
4 1 -1 0 0 16 12 0.0000 4 135 120 3375 2400 B\001
4 0 -1 0 0 16 12 0.0000 4 135 285 3600 2400 ON\001
4 0 -1 0 0 16 12 0.0000 4 135 210 3600 2100 10\001
4 1 -1 0 0 16 12 0.0000 4 135 135 3375 2100 A\001
4 1 -1 0 0 16 12 0.0000 4 135 135 3375 2700 C\001
4 0 -1 0 0 16 12 0.0000 4 135 105 3600 2700 0\001
4 1 -1 0 0 16 12 0.0000 4 135 135 3375 3300 Z\001
4 0 -1 0 0 16 12 0.0000 4 135 390 3600 3300 OFF\001
4 1 -1 0 0 16 12 0.0000 4 135 480 1650 1800 Tasks\001
4 1 -1 0 0 16 12 0.0000 4 135 690 3750 4725 Daemon\001
4 1 -1 0 0 16 12 0.0000 4 180 900 5400 600 Spacecraft\001
4 0 -1 0 0 0 12 0.0000 4 15 45 1650 3450 .\001
4 0 -1 0 0 0 12 0.0000 4 15 45 1650 3675 .\001
4 0 -1 0 0 0 12 0.0000 4 15 45 1650 3225 .\001
