%!PS-Adobe-2.0 EPSF-2.0
%%Title: 3Darray.dia
%%Creator: Dia v0.90
%%CreationDate: Tue Jan 28 01:19:12 2003
%%For: pascal
%%Magnification: 1.0000
%%Orientation: Portrait
%%BoundingBox: 0 0 763 851
%%Pages: 1
%%EndComments
%%BeginProlog
/cp {closepath} bind def
/c {curveto} bind def
/f {fill} bind def
/a {arc} bind def
/ef {eofill} bind def
/ex {exch} bind def
/gr {grestore} bind def
/gs {gsave} bind def
/sa {save} bind def
/rs {restore} bind def
/l {lineto} bind def
/m {moveto} bind def
/rm {rmoveto} bind def
/n {newpath} bind def
/s {stroke} bind def
/sh {show} bind def
/slc {setlinecap} bind def
/slj {setlinejoin} bind def
/slw {setlinewidth} bind def
/srgb {setrgbcolor} bind def
/rot {rotate} bind def
/sc {scale} bind def
/sd {setdash} bind def
/ff {findfont} bind def
/sf {setfont} bind def
/scf {scalefont} bind def
/sw {stringwidth pop} bind def
/tr {translate} bind def

/ellipsedict 8 dict def
ellipsedict /mtrx matrix put
/ellipse
{ ellipsedict begin
   /endangle exch def
   /startangle exch def
   /yrad exch def
   /xrad exch def
   /y exch def
   /x exch def   /savematrix mtrx currentmatrix def
   x y tr xrad yrad sc
   0 0 1 startangle endangle arc
   savematrix setmatrix
   end
} def

/mergeprocs {
dup length
3 -1 roll
dup
length
dup
5 1 roll
3 -1 roll
add
array cvx
dup
3 -1 roll
0 exch
putinterval
dup
4 2 roll
putinterval
} bind def
%%EndProlog

%%BeginSetup
%%EndSetup
28.346000 -28.346000 scale
7.525180 -30.061520 translate

0.100000 slw
[0.200000] 0 sd
[0.200000] 0 sd
0 slj
0.000000 0.000000 0.000000 srgb
n -2.338840 0.805678 m -2.338840 21.176478 l 19.308260 21.176478 l 19.308260 0.805678 l cp s
0.717647 0.717647 0.717647 srgb
n 2.746800 2.050000 m 2.746800 3.950000 l 3.987600 3.950000 l 3.987600 2.050000 l f
0.100000 slw
[] 0 sd
[] 0 sd
0 slj
0.000000 0.000000 0.000000 srgb
n 2.746800 2.050000 m 2.746800 3.950000 l 3.987600 3.950000 l 3.987600 2.050000 l cp s
 [ /xi /xi /xi /xi /xi /xi /xi /xi /xi /xi /xi /xi /xi /xi /xi /xi
 /xi /xi /xi /xi /xi /xi /xi /xi /xi /xi /xi /xi /xi /xi /xi /xi
 /period /L /three /two /I /quotedbl /bracketleft /i /xi /xi /n /t /bracketright /xi /xi /xi
 /xi /xi /xi /xi /xi /xi /xi /xi /xi /xi /xi /xi /xi /xi /xi /xi
 /xi /xi /xi /xi /xi /xi /xi /xi /xi /xi /xi /xi /xi /xi /xi /xi
 /xi /xi /xi /xi /xi /xi /xi /xi /xi /xi /xi /xi /xi /xi /xi /xi
 /xi /xi /xi /xi /xi /xi /xi /xi /xi /xi /xi /xi /xi /xi /xi /xi
 /xi /xi /xi /xi /xi /xi /xi /xi /xi /xi /xi /xi /xi /xi /xi /xi
 /xi /xi /xi /xi /xi /xi /xi /xi /xi /xi /xi /xi /xi /xi /xi /xi
 /xi /xi /xi /xi /xi /xi /xi /xi /xi /xi /xi /xi /xi /xi /xi /xi
 /xi /xi /xi /xi /xi /xi /xi /xi /xi /xi /xi /xi /xi /xi /xi /xi
 /xi /xi /xi /xi /xi /xi /xi /xi /xi /xi /xi /xi /xi /xi /xi /xi
 /xi /xi /xi /xi /xi /xi /xi /xi /xi /xi /xi /xi /xi /xi /xi /xi
 /xi /xi /xi /xi /xi /xi /xi /xi /xi /xi /xi /xi /xi /xi /xi /xi
 /xi /xi /xi /xi /xi /xi /xi /xi /xi /xi /xi /xi /xi /xi /xi /xi
 /xi /xi /xi /xi /xi /xi /xi /xi /xi /xi /xi /xi /xi /xi /xi /xi
] /e0 exch def
/Courier_e0 undefinefont
/Courier_e0
  /Courier findfont
  dup length dict begin
  {1 index /FID ne {def} {pop pop} ifelse} forall
  /Encoding e0 def
  currentdict end
definefont pop
/Courier_e0 ff 0.800000 scf sf
( ) sw
2 div 3.367200 ex sub 3.196491 m ( )
 gs 1 -1 sc sh gr
1.000000 1.000000 1.000000 srgb
n 5.373200 2.050000 m 5.373200 3.950000 l 6.922000 3.950000 l 6.922000 2.050000 l f
0.100000 slw
[] 0 sd
[] 0 sd
0 slj
0.000000 0.000000 0.000000 srgb
n 5.373200 2.050000 m 5.373200 3.950000 l 6.922000 3.950000 l 6.922000 2.050000 l cp s
/Courier_e0 ff 0.800000 scf sf
(!) sw
2 div 6.147600 ex sub 3.196491 m (!)
 gs 1 -1 sc sh gr
1.000000 1.000000 1.000000 srgb
n 6.810000 2.050000 m 6.810000 3.950000 l 8.358800 3.950000 l 8.358800 2.050000 l f
0.100000 slw
[] 0 sd
[] 0 sd
0 slj
0.000000 0.000000 0.000000 srgb
n 6.810000 2.050000 m 6.810000 3.950000 l 8.358800 3.950000 l 8.358800 2.050000 l cp s
/Courier_e0 ff 0.800000 scf sf
(!) sw
2 div 7.584400 ex sub 3.196491 m (!)
 gs 1 -1 sc sh gr
1.000000 1.000000 1.000000 srgb
n 8.227200 2.050000 m 8.227200 3.950000 l 9.776000 3.950000 l 9.776000 2.050000 l f
0.100000 slw
[] 0 sd
[] 0 sd
0 slj
0.000000 0.000000 0.000000 srgb
n 8.227200 2.050000 m 8.227200 3.950000 l 9.776000 3.950000 l 9.776000 2.050000 l cp s
/Courier_e0 ff 0.800000 scf sf
(!) sw
2 div 9.001600 ex sub 3.196491 m (!)
 gs 1 -1 sc sh gr
0.717647 0.717647 0.717647 srgb
n 3.995600 2.050000 m 3.995600 3.950000 l 5.438800 3.950000 l 5.438800 2.050000 l f
0.100000 slw
[] 0 sd
[] 0 sd
0 slj
0.000000 0.000000 0.000000 srgb
n 3.995600 2.050000 m 3.995600 3.950000 l 5.438800 3.950000 l 5.438800 2.050000 l cp s
/Courier_e0 ff 0.800000 scf sf
(") sw
2 div 4.717200 ex sub 3.196491 m (")
 gs 1 -1 sc sh gr
0.717647 0.717647 0.717647 srgb
n -1.854400 6.200000 m -1.854400 8.100000 l -0.613600 8.100000 l -0.613600 6.200000 l f
0.100000 slw
[] 0 sd
[] 0 sd
0 slj
0.000000 0.000000 0.000000 srgb
n -1.854400 6.200000 m -1.854400 8.100000 l -0.613600 8.100000 l -0.613600 6.200000 l cp s
/Courier_e0 ff 0.800000 scf sf
( ) sw
2 div -1.234000 ex sub 7.346491 m ( )
 gs 1 -1 sc sh gr
1.000000 1.000000 1.000000 srgb
n 0.772000 6.200000 m 0.772000 8.100000 l 2.320800 8.100000 l 2.320800 6.200000 l f
0.100000 slw
[] 0 sd
[] 0 sd
0 slj
0.000000 0.000000 0.000000 srgb
n 0.772000 6.200000 m 0.772000 8.100000 l 2.320800 8.100000 l 2.320800 6.200000 l cp s
/Courier_e0 ff 0.800000 scf sf
(!) sw
2 div 1.546400 ex sub 7.346491 m (!)
 gs 1 -1 sc sh gr
1.000000 1.000000 1.000000 srgb
n 2.208800 6.200000 m 2.208800 8.100000 l 3.757600 8.100000 l 3.757600 6.200000 l f
0.100000 slw
[] 0 sd
[] 0 sd
0 slj
0.000000 0.000000 0.000000 srgb
n 2.208800 6.200000 m 2.208800 8.100000 l 3.757600 8.100000 l 3.757600 6.200000 l cp s
/Courier_e0 ff 0.800000 scf sf
(!) sw
2 div 2.983200 ex sub 7.346491 m (!)
 gs 1 -1 sc sh gr
0.717647 0.717647 0.717647 srgb
n -0.610000 6.200000 m -0.610000 8.100000 l 0.842000 8.100000 l 0.842000 6.200000 l f
0.100000 slw
[] 0 sd
[] 0 sd
0 slj
0.000000 0.000000 0.000000 srgb
n -0.610000 6.200000 m -0.610000 8.100000 l 0.842000 8.100000 l 0.842000 6.200000 l cp s
/Courier_e0 ff 0.800000 scf sf
(#) sw
2 div 0.116000 ex sub 7.346491 m (#)
 gs 1 -1 sc sh gr
0.717647 0.717647 0.717647 srgb
n 4.395600 6.200000 m 4.395600 8.100000 l 5.636400 8.100000 l 5.636400 6.200000 l f
0.100000 slw
[] 0 sd
[] 0 sd
0 slj
0.000000 0.000000 0.000000 srgb
n 4.395600 6.200000 m 4.395600 8.100000 l 5.636400 8.100000 l 5.636400 6.200000 l cp s
/Courier_e0 ff 0.800000 scf sf
( ) sw
2 div 5.016000 ex sub 7.346491 m ( )
 gs 1 -1 sc sh gr
1.000000 1.000000 1.000000 srgb
n 7.022000 6.200000 m 7.022000 8.100000 l 8.570800 8.100000 l 8.570800 6.200000 l f
0.100000 slw
[] 0 sd
[] 0 sd
0 slj
0.000000 0.000000 0.000000 srgb
n 7.022000 6.200000 m 7.022000 8.100000 l 8.570800 8.100000 l 8.570800 6.200000 l cp s
/Courier_e0 ff 0.800000 scf sf
(!) sw
2 div 7.796400 ex sub 7.346491 m (!)
 gs 1 -1 sc sh gr
1.000000 1.000000 1.000000 srgb
n 8.458800 6.200000 m 8.458800 8.100000 l 10.007600 8.100000 l 10.007600 6.200000 l f
0.100000 slw
[] 0 sd
[] 0 sd
0 slj
0.000000 0.000000 0.000000 srgb
n 8.458800 6.200000 m 8.458800 8.100000 l 10.007600 8.100000 l 10.007600 6.200000 l cp s
/Courier_e0 ff 0.800000 scf sf
(!) sw
2 div 9.233200 ex sub 7.346491 m (!)
 gs 1 -1 sc sh gr
0.717647 0.717647 0.717647 srgb
n 5.640000 6.200000 m 5.640000 8.100000 l 7.092000 8.100000 l 7.092000 6.200000 l f
0.100000 slw
[] 0 sd
[] 0 sd
0 slj
0.000000 0.000000 0.000000 srgb
n 5.640000 6.200000 m 5.640000 8.100000 l 7.092000 8.100000 l 7.092000 6.200000 l cp s
/Courier_e0 ff 0.800000 scf sf
(#) sw
2 div 6.366000 ex sub 7.346491 m (#)
 gs 1 -1 sc sh gr
0.717647 0.717647 0.717647 srgb
n 10.645600 6.200000 m 10.645600 8.100000 l 11.886400 8.100000 l 11.886400 6.200000 l f
0.100000 slw
[] 0 sd
[] 0 sd
0 slj
0.000000 0.000000 0.000000 srgb
n 10.645600 6.200000 m 10.645600 8.100000 l 11.886400 8.100000 l 11.886400 6.200000 l cp s
/Courier_e0 ff 0.800000 scf sf
( ) sw
2 div 11.266000 ex sub 7.346491 m ( )
 gs 1 -1 sc sh gr
1.000000 1.000000 1.000000 srgb
n 13.272000 6.200000 m 13.272000 8.100000 l 14.820800 8.100000 l 14.820800 6.200000 l f
0.100000 slw
[] 0 sd
[] 0 sd
0 slj
0.000000 0.000000 0.000000 srgb
n 13.272000 6.200000 m 13.272000 8.100000 l 14.820800 8.100000 l 14.820800 6.200000 l cp s
/Courier_e0 ff 0.800000 scf sf
(!) sw
2 div 14.046400 ex sub 7.346491 m (!)
 gs 1 -1 sc sh gr
1.000000 1.000000 1.000000 srgb
n 14.708800 6.200000 m 14.708800 8.100000 l 16.257600 8.100000 l 16.257600 6.200000 l f
0.100000 slw
[] 0 sd
[] 0 sd
0 slj
0.000000 0.000000 0.000000 srgb
n 14.708800 6.200000 m 14.708800 8.100000 l 16.257600 8.100000 l 16.257600 6.200000 l cp s
/Courier_e0 ff 0.800000 scf sf
(!) sw
2 div 15.483200 ex sub 7.346491 m (!)
 gs 1 -1 sc sh gr
0.717647 0.717647 0.717647 srgb
n 11.890000 6.200000 m 11.890000 8.100000 l 13.342000 8.100000 l 13.342000 6.200000 l f
0.100000 slw
[] 0 sd
[] 0 sd
0 slj
0.000000 0.000000 0.000000 srgb
n 11.890000 6.200000 m 11.890000 8.100000 l 13.342000 8.100000 l 13.342000 6.200000 l cp s
/Courier_e0 ff 0.800000 scf sf
(#) sw
2 div 12.616000 ex sub 7.346491 m (#)
 gs 1 -1 sc sh gr
0.100000 slw
[] 0 sd
[] 0 sd
0 slj
0 slc
n 6.147600 3.950000 m 6.147600 5.000000 l -1.234000 5.000000 l -1.234000 6.200000 l s
0.100000 slw
[] 0 sd
0 slj
0 slc
n -1.634000 5.400000 m -1.234000 6.200000 l -0.834000 5.400000 l s
0.100000 slw
[] 0 sd
[] 0 sd
0 slj
0 slc
n 7.584400 3.950000 m 7.584400 5.300000 l 5.016000 5.300000 l 5.016000 6.200000 l s
0.100000 slw
[] 0 sd
0 slj
0 slc
n 4.616000 5.400000 m 5.016000 6.200000 l 5.416000 5.400000 l s
0.100000 slw
[] 0 sd
[] 0 sd
0 slj
0 slc
n 9.001600 3.950000 m 9.001600 5.050000 l 11.266000 5.050000 l 11.266000 6.200000 l s
0.100000 slw
[] 0 sd
0 slj
0 slc
n 10.866000 5.400000 m 11.266000 6.200000 l 11.666000 5.400000 l s
1.000000 1.000000 1.000000 srgb
n 2.635200 14.800000 m 2.635200 16.700000 l 4.096000 16.700000 l 4.096000 14.800000 l f
0.100000 slw
[] 0 sd
[] 0 sd
0 slj
0.000000 0.000000 0.000000 srgb
n 2.635200 14.800000 m 2.635200 16.700000 l 4.096000 16.700000 l 4.096000 14.800000 l cp s
/Courier_e0 ff 0.800000 scf sf
($) sw
2 div 3.365600 ex sub 15.946491 m ($)
 gs 1 -1 sc sh gr
1.000000 1.000000 1.000000 srgb
n 2.635200 16.700000 m 2.635200 18.600000 l 4.096000 18.600000 l 4.096000 16.700000 l f
0.100000 slw
[] 0 sd
[] 0 sd
0 slj
0.000000 0.000000 0.000000 srgb
n 2.635200 16.700000 m 2.635200 18.600000 l 4.096000 18.600000 l 4.096000 16.700000 l cp s
/Courier_e0 ff 0.800000 scf sf
($) sw
2 div 3.365600 ex sub 17.846491 m ($)
 gs 1 -1 sc sh gr
1.000000 1.000000 1.000000 srgb
n 2.585200 18.600000 m 2.585200 20.500000 l 4.046000 20.500000 l 4.046000 18.600000 l f
0.100000 slw
[] 0 sd
[] 0 sd
0 slj
0.000000 0.000000 0.000000 srgb
n 2.585200 18.600000 m 2.585200 20.500000 l 4.046000 20.500000 l 4.046000 18.600000 l cp s
/Courier_e0 ff 0.800000 scf sf
($) sw
2 div 3.315600 ex sub 19.746491 m ($)
 gs 1 -1 sc sh gr
0.694118 0.694118 0.694118 srgb
n 2.650000 10.850000 m 2.650000 12.850000 l 4.100000 12.850000 l 4.100000 10.850000 l f
0.100000 slw
[] 0 sd
[] 0 sd
0 slj
0.003922 0.003922 0.003922 srgb
n 2.650000 10.850000 m 2.650000 12.850000 l 4.100000 12.850000 l 4.100000 10.850000 l cp s
0.694118 0.694118 0.694118 srgb
n 2.650000 12.850000 m 2.650000 14.850000 l 4.100000 14.850000 l 4.100000 12.850000 l f
0.100000 slw
[] 0 sd
[] 0 sd
0 slj
0.003922 0.003922 0.003922 srgb
n 2.650000 12.850000 m 2.650000 14.850000 l 4.100000 14.850000 l 4.100000 12.850000 l cp s
0.000000 0.000000 0.000000 srgb
/Courier_e0 ff 0.800000 scf sf
(") sw
2 div 3.300000 ex sub 14.050000 m (")
 gs 1 -1 sc sh gr
1.000000 1.000000 1.000000 srgb
n 0.445600 14.800000 m 0.445600 16.700000 l 1.906400 16.700000 l 1.906400 14.800000 l f
0.100000 slw
[] 0 sd
[] 0 sd
0 slj
0.000000 0.000000 0.000000 srgb
n 0.445600 14.800000 m 0.445600 16.700000 l 1.906400 16.700000 l 1.906400 14.800000 l cp s
/Courier_e0 ff 0.800000 scf sf
($) sw
2 div 1.176000 ex sub 15.946491 m ($)
 gs 1 -1 sc sh gr
1.000000 1.000000 1.000000 srgb
n 0.445600 16.700000 m 0.445600 18.600000 l 1.906400 18.600000 l 1.906400 16.700000 l f
0.100000 slw
[] 0 sd
[] 0 sd
0 slj
0.000000 0.000000 0.000000 srgb
n 0.445600 16.700000 m 0.445600 18.600000 l 1.906400 18.600000 l 1.906400 16.700000 l cp s
/Courier_e0 ff 0.800000 scf sf
($) sw
2 div 1.176000 ex sub 17.846491 m ($)
 gs 1 -1 sc sh gr
1.000000 1.000000 1.000000 srgb
n 0.395600 18.600000 m 0.395600 20.500000 l 1.856400 20.500000 l 1.856400 18.600000 l f
0.100000 slw
[] 0 sd
[] 0 sd
0 slj
0.000000 0.000000 0.000000 srgb
n 0.395600 18.600000 m 0.395600 20.500000 l 1.856400 20.500000 l 1.856400 18.600000 l cp s
/Courier_e0 ff 0.800000 scf sf
($) sw
2 div 1.126000 ex sub 19.746491 m ($)
 gs 1 -1 sc sh gr
0.694118 0.694118 0.694118 srgb
n 0.460400 10.850000 m 0.460400 12.850000 l 1.910400 12.850000 l 1.910400 10.850000 l f
0.100000 slw
[] 0 sd
[] 0 sd
0 slj
0.003922 0.003922 0.003922 srgb
n 0.460400 10.850000 m 0.460400 12.850000 l 1.910400 12.850000 l 1.910400 10.850000 l cp s
0.694118 0.694118 0.694118 srgb
n 0.460400 12.850000 m 0.460400 14.850000 l 1.910400 14.850000 l 1.910400 12.850000 l f
0.100000 slw
[] 0 sd
[] 0 sd
0 slj
0.003922 0.003922 0.003922 srgb
n 0.460400 12.850000 m 0.460400 14.850000 l 1.910400 14.850000 l 1.910400 12.850000 l cp s
0.000000 0.000000 0.000000 srgb
/Courier_e0 ff 0.800000 scf sf
(") sw
2 div 1.110400 ex sub 14.050000 m (")
 gs 1 -1 sc sh gr
1.000000 1.000000 1.000000 srgb
n 8.885200 14.800000 m 8.885200 16.700000 l 10.346000 16.700000 l 10.346000 14.800000 l f
0.100000 slw
[] 0 sd
[] 0 sd
0 slj
0.000000 0.000000 0.000000 srgb
n 8.885200 14.800000 m 8.885200 16.700000 l 10.346000 16.700000 l 10.346000 14.800000 l cp s
/Courier_e0 ff 0.800000 scf sf
($) sw
2 div 9.615600 ex sub 15.946491 m ($)
 gs 1 -1 sc sh gr
1.000000 1.000000 1.000000 srgb
n 8.885200 16.700000 m 8.885200 18.600000 l 10.346000 18.600000 l 10.346000 16.700000 l f
0.100000 slw
[] 0 sd
[] 0 sd
0 slj
0.000000 0.000000 0.000000 srgb
n 8.885200 16.700000 m 8.885200 18.600000 l 10.346000 18.600000 l 10.346000 16.700000 l cp s
/Courier_e0 ff 0.800000 scf sf
($) sw
2 div 9.615600 ex sub 17.846491 m ($)
 gs 1 -1 sc sh gr
1.000000 1.000000 1.000000 srgb
n 8.835200 18.600000 m 8.835200 20.500000 l 10.296000 20.500000 l 10.296000 18.600000 l f
0.100000 slw
[] 0 sd
[] 0 sd
0 slj
0.000000 0.000000 0.000000 srgb
n 8.835200 18.600000 m 8.835200 20.500000 l 10.296000 20.500000 l 10.296000 18.600000 l cp s
/Courier_e0 ff 0.800000 scf sf
($) sw
2 div 9.565600 ex sub 19.746491 m ($)
 gs 1 -1 sc sh gr
0.694118 0.694118 0.694118 srgb
n 8.900000 10.850000 m 8.900000 12.850000 l 10.350000 12.850000 l 10.350000 10.850000 l f
0.100000 slw
[] 0 sd
[] 0 sd
0 slj
0.003922 0.003922 0.003922 srgb
n 8.900000 10.850000 m 8.900000 12.850000 l 10.350000 12.850000 l 10.350000 10.850000 l cp s
0.694118 0.694118 0.694118 srgb
n 8.900000 12.850000 m 8.900000 14.850000 l 10.350000 14.850000 l 10.350000 12.850000 l f
0.100000 slw
[] 0 sd
[] 0 sd
0 slj
0.003922 0.003922 0.003922 srgb
n 8.900000 12.850000 m 8.900000 14.850000 l 10.350000 14.850000 l 10.350000 12.850000 l cp s
0.000000 0.000000 0.000000 srgb
/Courier_e0 ff 0.800000 scf sf
(") sw
2 div 9.550000 ex sub 14.050000 m (")
 gs 1 -1 sc sh gr
1.000000 1.000000 1.000000 srgb
n 6.695600 14.800000 m 6.695600 16.700000 l 8.156400 16.700000 l 8.156400 14.800000 l f
0.100000 slw
[] 0 sd
[] 0 sd
0 slj
0.000000 0.000000 0.000000 srgb
n 6.695600 14.800000 m 6.695600 16.700000 l 8.156400 16.700000 l 8.156400 14.800000 l cp s
/Courier_e0 ff 0.800000 scf sf
($) sw
2 div 7.426000 ex sub 15.946491 m ($)
 gs 1 -1 sc sh gr
1.000000 1.000000 1.000000 srgb
n 6.695600 16.700000 m 6.695600 18.600000 l 8.156400 18.600000 l 8.156400 16.700000 l f
0.100000 slw
[] 0 sd
[] 0 sd
0 slj
0.000000 0.000000 0.000000 srgb
n 6.695600 16.700000 m 6.695600 18.600000 l 8.156400 18.600000 l 8.156400 16.700000 l cp s
/Courier_e0 ff 0.800000 scf sf
($) sw
2 div 7.426000 ex sub 17.846491 m ($)
 gs 1 -1 sc sh gr
1.000000 1.000000 1.000000 srgb
n 6.645600 18.600000 m 6.645600 20.500000 l 8.106400 20.500000 l 8.106400 18.600000 l f
0.100000 slw
[] 0 sd
[] 0 sd
0 slj
0.000000 0.000000 0.000000 srgb
n 6.645600 18.600000 m 6.645600 20.500000 l 8.106400 20.500000 l 8.106400 18.600000 l cp s
/Courier_e0 ff 0.800000 scf sf
($) sw
2 div 7.376000 ex sub 19.746491 m ($)
 gs 1 -1 sc sh gr
0.694118 0.694118 0.694118 srgb
n 6.710400 10.850000 m 6.710400 12.850000 l 8.160400 12.850000 l 8.160400 10.850000 l f
0.100000 slw
[] 0 sd
[] 0 sd
0 slj
0.003922 0.003922 0.003922 srgb
n 6.710400 10.850000 m 6.710400 12.850000 l 8.160400 12.850000 l 8.160400 10.850000 l cp s
0.694118 0.694118 0.694118 srgb
n 6.710400 12.850000 m 6.710400 14.850000 l 8.160400 14.850000 l 8.160400 12.850000 l f
0.100000 slw
[] 0 sd
[] 0 sd
0 slj
0.003922 0.003922 0.003922 srgb
n 6.710400 12.850000 m 6.710400 14.850000 l 8.160400 14.850000 l 8.160400 12.850000 l cp s
0.000000 0.000000 0.000000 srgb
/Courier_e0 ff 0.800000 scf sf
(") sw
2 div 7.360400 ex sub 14.050000 m (")
 gs 1 -1 sc sh gr
1.000000 1.000000 1.000000 srgb
n 15.135200 14.800000 m 15.135200 16.700000 l 16.596000 16.700000 l 16.596000 14.800000 l f
0.100000 slw
[] 0 sd
[] 0 sd
0 slj
0.000000 0.000000 0.000000 srgb
n 15.135200 14.800000 m 15.135200 16.700000 l 16.596000 16.700000 l 16.596000 14.800000 l cp s
/Courier_e0 ff 0.800000 scf sf
($) sw
2 div 15.865600 ex sub 15.946491 m ($)
 gs 1 -1 sc sh gr
1.000000 1.000000 1.000000 srgb
n 15.135200 16.700000 m 15.135200 18.600000 l 16.596000 18.600000 l 16.596000 16.700000 l f
0.100000 slw
[] 0 sd
[] 0 sd
0 slj
0.000000 0.000000 0.000000 srgb
n 15.135200 16.700000 m 15.135200 18.600000 l 16.596000 18.600000 l 16.596000 16.700000 l cp s
/Courier_e0 ff 0.800000 scf sf
($) sw
2 div 15.865600 ex sub 17.846491 m ($)
 gs 1 -1 sc sh gr
1.000000 1.000000 1.000000 srgb
n 15.085200 18.600000 m 15.085200 20.500000 l 16.546000 20.500000 l 16.546000 18.600000 l f
0.100000 slw
[] 0 sd
[] 0 sd
0 slj
0.000000 0.000000 0.000000 srgb
n 15.085200 18.600000 m 15.085200 20.500000 l 16.546000 20.500000 l 16.546000 18.600000 l cp s
/Courier_e0 ff 0.800000 scf sf
($) sw
2 div 15.815600 ex sub 19.746491 m ($)
 gs 1 -1 sc sh gr
0.694118 0.694118 0.694118 srgb
n 15.150000 10.850000 m 15.150000 12.850000 l 16.600000 12.850000 l 16.600000 10.850000 l f
0.100000 slw
[] 0 sd
[] 0 sd
0 slj
0.003922 0.003922 0.003922 srgb
n 15.150000 10.850000 m 15.150000 12.850000 l 16.600000 12.850000 l 16.600000 10.850000 l cp s
0.694118 0.694118 0.694118 srgb
n 15.150000 12.850000 m 15.150000 14.850000 l 16.600000 14.850000 l 16.600000 12.850000 l f
0.100000 slw
[] 0 sd
[] 0 sd
0 slj
0.003922 0.003922 0.003922 srgb
n 15.150000 12.850000 m 15.150000 14.850000 l 16.600000 14.850000 l 16.600000 12.850000 l cp s
0.000000 0.000000 0.000000 srgb
/Courier_e0 ff 0.800000 scf sf
(") sw
2 div 15.800000 ex sub 14.050000 m (")
 gs 1 -1 sc sh gr
1.000000 1.000000 1.000000 srgb
n 12.945600 14.800000 m 12.945600 16.700000 l 14.406400 16.700000 l 14.406400 14.800000 l f
0.100000 slw
[] 0 sd
[] 0 sd
0 slj
0.000000 0.000000 0.000000 srgb
n 12.945600 14.800000 m 12.945600 16.700000 l 14.406400 16.700000 l 14.406400 14.800000 l cp s
/Courier_e0 ff 0.800000 scf sf
($) sw
2 div 13.676000 ex sub 15.946491 m ($)
 gs 1 -1 sc sh gr
1.000000 1.000000 1.000000 srgb
n 12.945600 16.700000 m 12.945600 18.600000 l 14.406400 18.600000 l 14.406400 16.700000 l f
0.100000 slw
[] 0 sd
[] 0 sd
0 slj
0.000000 0.000000 0.000000 srgb
n 12.945600 16.700000 m 12.945600 18.600000 l 14.406400 18.600000 l 14.406400 16.700000 l cp s
/Courier_e0 ff 0.800000 scf sf
($) sw
2 div 13.676000 ex sub 17.846491 m ($)
 gs 1 -1 sc sh gr
1.000000 1.000000 1.000000 srgb
n 12.895600 18.600000 m 12.895600 20.500000 l 14.356400 20.500000 l 14.356400 18.600000 l f
0.100000 slw
[] 0 sd
[] 0 sd
0 slj
0.000000 0.000000 0.000000 srgb
n 12.895600 18.600000 m 12.895600 20.500000 l 14.356400 20.500000 l 14.356400 18.600000 l cp s
/Courier_e0 ff 0.800000 scf sf
($) sw
2 div 13.626000 ex sub 19.746491 m ($)
 gs 1 -1 sc sh gr
0.694118 0.694118 0.694118 srgb
n 12.960400 10.850000 m 12.960400 12.850000 l 14.410400 12.850000 l 14.410400 10.850000 l f
0.100000 slw
[] 0 sd
[] 0 sd
0 slj
0.003922 0.003922 0.003922 srgb
n 12.960400 10.850000 m 12.960400 12.850000 l 14.410400 12.850000 l 14.410400 10.850000 l cp s
0.694118 0.694118 0.694118 srgb
n 12.960400 12.850000 m 12.960400 14.850000 l 14.410400 14.850000 l 14.410400 12.850000 l f
0.100000 slw
[] 0 sd
[] 0 sd
0 slj
0.003922 0.003922 0.003922 srgb
n 12.960400 12.850000 m 12.960400 14.850000 l 14.410400 14.850000 l 14.410400 12.850000 l cp s
0.000000 0.000000 0.000000 srgb
/Courier_e0 ff 0.800000 scf sf
(") sw
2 div 13.610400 ex sub 14.050000 m (")
 gs 1 -1 sc sh gr
0.100000 slw
[] 0 sd
[] 0 sd
0 slj
0 slc
n 1.546400 8.100000 m 1.546400 9.450000 l 1.185400 9.450000 l 1.185400 10.850000 l s
0.100000 slw
[] 0 sd
0 slj
0 slc
n 0.785400 10.050000 m 1.185400 10.850000 l 1.585400 10.050000 l s
0.100000 slw
[] 0 sd
[] 0 sd
0 slj
0 slc
n 2.983200 8.100000 m 2.983200 9.450000 l 3.375000 9.450000 l 3.375000 10.850000 l s
0.100000 slw
[] 0 sd
0 slj
0 slc
n 2.975000 10.050000 m 3.375000 10.850000 l 3.775000 10.050000 l s
0.100000 slw
[] 0 sd
[] 0 sd
0 slj
0 slc
n 7.796400 8.100000 m 7.796400 9.450000 l 7.435400 9.450000 l 7.435400 10.850000 l s
0.100000 slw
[] 0 sd
0 slj
0 slc
n 7.035400 10.050000 m 7.435400 10.850000 l 7.835400 10.050000 l s
0.100000 slw
[] 0 sd
[] 0 sd
0 slj
0 slc
n 9.233200 8.100000 m 9.233200 9.450000 l 9.625000 9.450000 l 9.625000 10.850000 l s
0.100000 slw
[] 0 sd
0 slj
0 slc
n 9.225000 10.050000 m 9.625000 10.850000 l 10.025000 10.050000 l s
0.100000 slw
[] 0 sd
[] 0 sd
0 slj
0 slc
n 14.046400 8.100000 m 14.046400 9.450000 l 13.685400 9.450000 l 13.685400 10.850000 l s
0.100000 slw
[] 0 sd
0 slj
0 slc
n 13.285400 10.050000 m 13.685400 10.850000 l 14.085400 10.050000 l s
0.100000 slw
[] 0 sd
[] 0 sd
0 slj
0 slc
n 15.483200 8.100000 m 15.483200 9.450000 l 15.875000 9.450000 l 15.875000 10.850000 l s
0.100000 slw
[] 0 sd
0 slj
0 slc
n 15.475000 10.050000 m 15.875000 10.850000 l 16.275000 10.050000 l s
0.100000 slw
[] 0 sd
1.000000 1.000000 1.000000 srgb
n -7.475180 2.058820 m -7.475180 3.858820 l -3.535980 3.858820 l -3.535980 2.058820 l f
0.000000 0.000000 0.000000 srgb
n -7.475180 2.058820 m -7.475180 3.858820 l -3.535980 3.858820 l -3.535980 2.058820 l cp s
/Helvetica_e0 undefinefont
/Helvetica_e0
  /Helvetica findfont
  dup length dict begin
  {1 index /FID ne {def} {pop pop} ifelse} forall
  /Encoding e0 def
  currentdict end
definefont pop
/Helvetica_e0 ff 0.800000 scf sf
(%&&&$%) sw
2 div -5.505580 ex sub 3.155311 m (%&&&$%)
 gs 1 -1 sc sh gr
0.050000 slw
n -6.975180 3.358820 m -4.035980 3.358820 l s
0.100000 slw
[] 0 sd
1.000000 1.000000 1.000000 srgb
n -6.766350 10.344100 m -6.766350 12.144100 l -3.363950 12.144100 l -3.363950 10.344100 l f
0.000000 0.000000 0.000000 srgb
n -6.766350 10.344100 m -6.766350 12.144100 l -3.363950 12.144100 l -3.363950 10.344100 l cp s
/Helvetica_e0 ff 0.800000 scf sf
(%&&$%) sw
2 div -5.065150 ex sub 11.440591 m (%&&$%)
 gs 1 -1 sc sh gr
0.050000 slw
n -6.266350 11.644100 m -3.863950 11.644100 l s
0.100000 slw
[] 0 sd
1.000000 1.000000 1.000000 srgb
n 7.057180 22.697100 m 7.057180 24.497100 l 9.922780 24.497100 l 9.922780 22.697100 l f
0.000000 0.000000 0.000000 srgb
n 7.057180 22.697100 m 7.057180 24.497100 l 9.922780 24.497100 l 9.922780 22.697100 l cp s
/Helvetica_e0 ff 0.800000 scf sf
(%&$%) sw
2 div 8.489980 ex sub 23.793591 m (%&$%)
 gs 1 -1 sc sh gr
0.050000 slw
n 7.557180 23.997100 m 9.422780 23.997100 l s
0.100000 slw
[] 0 sd
[] 0 sd
0 slc
n 2.751200 3.000000 m -3.571180 2.958820 l s
0.100000 slw
[] 0 sd
0 slj
0 slc
n -2.768592 2.564039 m -3.571180 2.958820 l -2.773802 3.364022 l s
0.100000 slw
[] 0 sd
[] 0 sd
0 slj
0 slc
n 11.266000 8.100000 m 11.266000 8.705880 l -5.078350 8.705880 l -5.078350 10.344100 l s
0.100000 slw
[] 0 sd
0 slj
0 slc
n -5.478350 9.544100 m -5.078350 10.344100 l -4.678350 9.544100 l s
0.100000 slw
[] 0 sd
[] 0 sd
0 slj
0 slc
n 5.016000 8.100000 m 5.016000 8.714710 l -5.078350 8.714710 l -5.078350 10.344100 l s
0.100000 slw
[] 0 sd
0 slj
0 slc
n -5.478350 9.544100 m -5.078350 10.344100 l -4.678350 9.544100 l s
0.100000 slw
[] 0 sd
[] 0 sd
0 slj
0 slc
n -1.234000 8.100000 m -1.234000 8.714710 l -5.078350 8.714710 l -5.078350 10.344100 l s
0.100000 slw
[] 0 sd
0 slj
0 slc
n -5.478350 9.544100 m -5.078350 10.344100 l -4.678350 9.544100 l s
0.100000 slw
[] 0 sd
[] 0 sd
0 slj
0 slc
n 1.910400 11.850000 m 1.910400 11.705900 l 8.481180 11.705900 l 8.481180 22.697100 l s
0.100000 slw
[] 0 sd
0 slj
0 slc
n 8.081180 21.897100 m 8.481180 22.697100 l 8.881180 21.897100 l s
0.100000 slw
[] 0 sd
[] 0 sd
0 slj
0 slc
n 4.072920 12.294100 m 4.072920 12.117600 l 8.481180 12.117600 l 8.481180 22.697100 l s
0.100000 slw
[] 0 sd
0 slj
0 slc
n 8.081180 21.897100 m 8.481180 22.697100 l 8.881180 21.897100 l s
0.100000 slw
[] 0 sd
[] 0 sd
0 slj
0 slc
n 8.131750 11.294100 m 8.131750 11.285300 l 8.481180 11.285300 l 8.481180 22.697100 l s
0.100000 slw
[] 0 sd
0 slj
0 slc
n 8.081180 21.897100 m 8.481180 22.697100 l 8.881180 21.897100 l s
0.100000 slw
[] 0 sd
[] 0 sd
0 slj
0 slc
n 8.837630 11.352900 m 8.837630 11.294100 l 8.481180 11.294100 l 8.481180 22.697100 l s
0.100000 slw
[] 0 sd
0 slj
0 slc
n 8.081180 21.897100 m 8.481180 22.697100 l 8.881180 21.897100 l s
0.100000 slw
[] 0 sd
[] 0 sd
0 slj
0 slc
n 12.960400 11.850000 m 12.960400 11.705900 l 8.481180 11.705900 l 8.481180 22.697100 l s
0.100000 slw
[] 0 sd
0 slj
0 slc
n 8.081180 21.897100 m 8.481180 22.697100 l 8.881180 21.897100 l s
0.100000 slw
[] 0 sd
[] 0 sd
0 slj
0 slc
n 15.150000 12.850000 m 15.150000 12.117600 l 8.481180 12.117600 l 8.481180 22.697100 l s
0.100000 slw
[] 0 sd
0 slj
0 slc
n 8.081180 21.897100 m 8.481180 22.697100 l 8.881180 21.897100 l s
/Courier_e0 ff 0.800000 scf sf
('*+&",&#,&",) sw
2 div 0.484689 ex sub 0.658544 m ('*+&",&#,&",)
 gs 1 -1 sc sh gr
0.717647 0.717647 0.717647 srgb
n 5.747940 27.473200 m 5.747940 29.373200 l 6.988740 29.373200 l 6.988740 27.473200 l f
0.100000 slw
[] 0 sd
[] 0 sd
0 slj
0.000000 0.000000 0.000000 srgb
n 5.747940 27.473200 m 5.747940 29.373200 l 6.988740 29.373200 l 6.988740 27.473200 l cp s
/Courier_e0 ff 0.800000 scf sf
( ) sw
2 div 6.368340 ex sub 28.619691 m ( )
 gs 1 -1 sc sh gr
1.000000 1.000000 1.000000 srgb
n 8.418340 27.473200 m 8.418340 29.373200 l 9.879140 29.373200 l 9.879140 27.473200 l f
0.100000 slw
[] 0 sd
[] 0 sd
0 slj
0.000000 0.000000 0.000000 srgb
n 8.418340 27.473200 m 8.418340 29.373200 l 9.879140 29.373200 l 9.879140 27.473200 l cp s
/Courier_e0 ff 0.800000 scf sf
($) sw
2 div 9.148740 ex sub 28.619691 m ($)
 gs 1 -1 sc sh gr
1.000000 1.000000 1.000000 srgb
n 9.855140 27.473200 m 9.855140 29.373200 l 11.315940 29.373200 l 11.315940 27.473200 l f
0.100000 slw
[] 0 sd
[] 0 sd
0 slj
0.000000 0.000000 0.000000 srgb
n 9.855140 27.473200 m 9.855140 29.373200 l 11.315940 29.373200 l 11.315940 27.473200 l cp s
/Courier_e0 ff 0.800000 scf sf
($) sw
2 div 10.585540 ex sub 28.619691 m ($)
 gs 1 -1 sc sh gr
0.717647 0.717647 0.717647 srgb
n 6.992340 27.473200 m 6.992340 29.373200 l 8.444340 29.373200 l 8.444340 27.473200 l f
0.100000 slw
[] 0 sd
[] 0 sd
0 slj
0.000000 0.000000 0.000000 srgb
n 6.992340 27.473200 m 6.992340 29.373200 l 8.444340 29.373200 l 8.444340 27.473200 l cp s
/Courier_e0 ff 0.800000 scf sf
(#) sw
2 div 7.718340 ex sub 28.619691 m (#)
 gs 1 -1 sc sh gr
0.100000 slw
[0.200000] 0 sd
[0.200000] 0 sd
0 slj
n 5.273030 26.952700 m 5.273030 30.011520 l 11.887740 30.011520 l 11.887740 26.952700 l cp s
0.100000 slw
[] 0 sd
[] 0 sd
0 slj
0 slc
n 6.368340 27.473200 m 6.368340 26.188000 l 8.481180 26.188000 l 8.481180 24.497100 l s
0.100000 slw
[] 0 sd
0 slj
0 slc
n 8.881180 25.297100 m 8.481180 24.497100 l 8.081180 25.297100 l s
/Courier_e0 ff 0.800000 scf sf
('*+&#,) sw
2 div 10.534800 ex sub 26.658500 m ('*+&#,)
 gs 1 -1 sc sh gr
showpage
