(classPool
(JNukeClass "Dup2_1" "Dup2_1.java"
  (JNukeVar "D" "m00")
  (JNukeVar "D" "m11")
  (JNukeMethod "Dup2_1.<init>" (JNukeSignature "V" (JNukeVector))
  (JNukeByteCodes
    (JNukeRByteCode 1 "     InvokeSpecial" (JNukeMethod "java/lang/Object.<init>" (JNukeSignature "V" (JNukeVector))) l0) (begin_of_basic_block 0) (end_of_basic_block (next_bb 2))
    (JNukeRByteCode 2 "r0 = Get" l0 (line 4)) (begin_of_basic_block 2)
    (JNukeRByteCode 3 "r1 = Get" l0)
    (JNukeRByteCode 4 "<r2, r3> = Const" double 1)
    (JNukeVector (JNukeRByteCode 5 "<r4, r5> = Get" r2 r3) (JNukeRByteCode 5 "r3 = Get" r1) (JNukeRByteCode 5 "<r1, r2> = Get" r4 r5))
    (JNukeRByteCode 6 "     PutField" "Dup2_1" (pair "m11" "D") r3 r4 r5) (end_of_basic_block (next_bb 7))
    (JNukeRByteCode 7 "     PutField" "Dup2_1" (pair "m00" "D") r0 r1 r2) (begin_of_basic_block 7) (end_of_basic_block (next_bb 8))
    (JNukeRByteCode 8 "     Return" void (line 5)) (begin_of_basic_block 8) (end_of_basic_block)
))
)
)
