%!PS-Adobe-2.0 EPSF-2.0
%%Title: revlockexample.dia
%%Creator: Dia v0.90
%%CreationDate: Fri Feb 28 17:14:55 2003
%%For: pascal
%%Magnification: 1.0000
%%Orientation: Portrait
%%BoundingBox: 0 0 1033 334
%%Pages: 1
%%EndComments
%%BeginProlog
/cp {closepath} bind def
/c {curveto} bind def
/f {fill} bind def
/a {arc} bind def
/ef {eofill} bind def
/ex {exch} bind def
/gr {grestore} bind def
/gs {gsave} bind def
/sa {save} bind def
/rs {restore} bind def
/l {lineto} bind def
/m {moveto} bind def
/rm {rmoveto} bind def
/n {newpath} bind def
/s {stroke} bind def
/sh {show} bind def
/slc {setlinecap} bind def
/slj {setlinejoin} bind def
/slw {setlinewidth} bind def
/srgb {setrgbcolor} bind def
/rot {rotate} bind def
/sc {scale} bind def
/sd {setdash} bind def
/ff {findfont} bind def
/sf {setfont} bind def
/scf {scalefont} bind def
/sw {stringwidth pop} bind def
/tr {translate} bind def

/ellipsedict 8 dict def
ellipsedict /mtrx matrix put
/ellipse
{ ellipsedict begin
   /endangle exch def
   /startangle exch def
   /yrad exch def
   /xrad exch def
   /y exch def
   /x exch def   /savematrix mtrx currentmatrix def
   x y tr xrad yrad sc
   0 0 1 startangle endangle arc
   savematrix setmatrix
   end
} def

/mergeprocs {
dup length
3 -1 roll
dup
length
dup
5 1 roll
3 -1 roll
add
array cvx
dup
3 -1 roll
0 exch
putinterval
dup
4 2 roll
putinterval
} bind def
%%EndProlog

%%BeginSetup
%%EndSetup
28.346000 -28.346000 scale
6.647600 -13.753509 translate

1.000000 1.000000 1.000000 srgb
n 11.800000 3.050000 1.000000 1.000000 0 360 ellipse f
0.100000 slw
[] 0 sd
[] 0 sd
0 slj
0.000000 0.000000 0.000000 srgb
n 11.800000 3.050000 1.000000 1.000000 0 360 ellipse cp s
 [ /xi /xi /xi /xi /xi /xi /xi /xi /xi /xi /xi /xi /xi /xi /xi /xi
 /xi /xi /xi /xi /xi /xi /xi /xi /xi /xi /xi /xi /xi /xi /xi /xi
 /a /b /T /h /r /e /d /space /xi /xi /zero /l /o /c /k /parenleft
 /parenright /s /t /underscore /one /L /u /n /i /xi /xi /xi /xi /xi /xi /xi
 /xi /xi /xi /xi /xi /xi /xi /xi /xi /xi /xi /xi /xi /xi /xi /xi
 /xi /xi /xi /xi /xi /xi /xi /xi /xi /xi /xi /xi /xi /xi /xi /xi
 /xi /xi /xi /xi /xi /xi /xi /xi /xi /xi /xi /xi /xi /xi /xi /xi
 /xi /xi /xi /xi /xi /xi /xi /xi /xi /xi /xi /xi /xi /xi /xi /xi
 /xi /xi /xi /xi /xi /xi /xi /xi /xi /xi /xi /xi /xi /xi /xi /xi
 /xi /xi /xi /xi /xi /xi /xi /xi /xi /xi /xi /xi /xi /xi /xi /xi
 /xi /xi /xi /xi /xi /xi /xi /xi /xi /xi /xi /xi /xi /xi /xi /xi
 /xi /xi /xi /xi /xi /xi /xi /xi /xi /xi /xi /xi /xi /xi /xi /xi
 /xi /xi /xi /xi /xi /xi /xi /xi /xi /xi /xi /xi /xi /xi /xi /xi
 /xi /xi /xi /xi /xi /xi /xi /xi /xi /xi /xi /xi /xi /xi /xi /xi
 /xi /xi /xi /xi /xi /xi /xi /xi /xi /xi /xi /xi /xi /xi /xi /xi
 /xi /xi /xi /xi /xi /xi /xi /xi /xi /xi /xi /xi /xi /xi /xi /xi
] /e0 exch def
/Courier_e0 undefinefont
/Courier_e0
  /Courier findfont
  dup length dict begin
  {1 index /FID ne {def} {pop pop} ifelse} forall
  /Encoding e0 def
  currentdict end
definefont pop
/Courier_e0 ff 0.800000 scf sf
( ) sw
2 div 11.800000 ex sub 3.246491 m ( )
 gs 1 -1 sc sh gr
1.000000 1.000000 1.000000 srgb
n 11.850035 7.350005 1.011035 1.011035 0 360 ellipse f
0.100000 slw
[] 0 sd
[] 0 sd
0 slj
0.000000 0.000000 0.000000 srgb
n 11.850035 7.350005 1.011035 1.011035 0 360 ellipse cp s
/Courier_e0 ff 0.800000 scf sf
(!) sw
2 div 11.850035 ex sub 7.546496 m (!)
 gs 1 -1 sc sh gr
0.100000 slw
[] 0 sd
1.000000 1.000000 1.000000 srgb
n -6.150000 3.250000 m -6.150000 4.650000 l 3.857200 4.650000 l 3.857200 3.250000 l f
0.000000 0.000000 0.000000 srgb
n -6.150000 3.250000 m -6.150000 4.650000 l 3.857200 4.650000 l 3.857200 3.250000 l cp s
/Helvetica-Bold_e0 undefinefont
/Helvetica-Bold_e0
  /Helvetica-Bold findfont
  dup length dict begin
  {1 index /FID ne {def} {pop pop} ifelse} forall
  /Encoding e0 def
  currentdict end
definefont pop
/Helvetica-Bold_e0 ff 1.000000 scf sf
("#$% &'*) sw
2 div -1.146400 ex sub 4.250000 m ("#$% &'*)
 gs 1 -1 sc sh gr
1.000000 1.000000 1.000000 srgb
n -6.150000 4.650000 m -6.150000 5.650000 l 3.857200 5.650000 l 3.857200 4.650000 l f
0.000000 0.000000 0.000000 srgb
n -6.150000 4.650000 m -6.150000 5.650000 l 3.857200 5.650000 l 3.857200 4.650000 l cp s
-6.000000 5.346491 m /Courier_e0 ff 0.800000 scf sf
('+,-./ 0)
 gs 1 -1 sc sh gr
1.000000 1.000000 1.000000 srgb
n -6.150000 5.650000 m -6.150000 6.650000 l 3.857200 6.650000 l 3.857200 5.650000 l f
0.000000 0.000000 0.000000 srgb
n -6.150000 5.650000 m -6.150000 6.650000 l 3.857200 6.650000 l 3.857200 5.650000 l cp s
-6.000000 6.346491 m /Courier-Oblique_e0 undefinefont
/Courier-Oblique_e0
  /Courier-Oblique findfont
  dup length dict begin
  {1 index /FID ne {def} {pop pop} ifelse} forall
  /Encoding e0 def
  currentdict end
definefont pop
/Courier-Oblique_e0 ff 0.800000 scf sf
('+ 123#%+&3+,-./!0)
 gs 1 -1 sc sh gr
0.100000 slw
0 slc
[] 0 sd
n 10.800000 3.050000 m 3.857200 5.150000 l s
0 slj
n 10.106641 3.520907 m 10.800000 3.050000 l 9.961882 3.042321 l f
0.100000 slw
[] 0 sd
1.000000 1.000000 1.000000 srgb
n 20.240000 3.150000 m 20.240000 4.550000 l 29.710400 4.550000 l 29.710400 3.150000 l f
0.000000 0.000000 0.000000 srgb
n 20.240000 3.150000 m 20.240000 4.550000 l 29.710400 4.550000 l 29.710400 3.150000 l cp s
/Helvetica-Bold_e0 ff 1.000000 scf sf
("#$% &'4) sw
2 div 24.975200 ex sub 4.150000 m ("#$% &'4)
 gs 1 -1 sc sh gr
1.000000 1.000000 1.000000 srgb
n 20.240000 4.550000 m 20.240000 5.550000 l 29.710400 5.550000 l 29.710400 4.550000 l f
0.000000 0.000000 0.000000 srgb
n 20.240000 4.550000 m 20.240000 5.550000 l 29.710400 5.550000 l 29.710400 4.550000 l cp s
20.390000 5.246491 m /Courier_e0 ff 0.800000 scf sf
('+,-./!0)
 gs 1 -1 sc sh gr
1.000000 1.000000 1.000000 srgb
n 20.240000 5.550000 m 20.240000 6.550000 l 29.710400 6.550000 l 29.710400 5.550000 l f
0.000000 0.000000 0.000000 srgb
n 20.240000 5.550000 m 20.240000 6.550000 l 29.710400 6.550000 l 29.710400 5.550000 l cp s
20.390000 6.246491 m /Courier-Oblique_e0 ff 0.800000 scf sf
('+ 123#%+&3+,-./0)
 gs 1 -1 sc sh gr
0.100000 slw
0 slc
[] 0 sd
n 12.861000 7.350000 m 20.240000 5.050000 l s
0 slj
n 13.550365 6.873265 m 12.861000 7.350000 l 13.699153 7.350615 l f
0.100000 slw
0 slc
[] 0 sd
[0.400000] 0 sd
n 12.800000 3.050000 m 20.240000 3.850000 l s
0 slj
n 13.622143 2.886961 m 12.800000 3.050000 l 13.568687 3.384096 l f
0.100000 slw
0 slc
[0.400000] 0 sd
[0.400000] 0 sd
n 5.900000 9.800010 m -6.050000 9.850010 l s
0 slj
n 5.101053 10.053355 m 5.900000 9.800010 l 5.098961 9.553359 l f
/Helvetica_e0 undefinefont
/Helvetica_e0
  /Helvetica findfont
  dup length dict begin
  {1 index /FID ne {def} {pop pop} ifelse} forall
  /Encoding e0 def
  currentdict end
definefont pop
/Helvetica_e0 ff 0.800000 scf sf
(5,-.'-,6+&'7,2'!%',!2 87%&) sw
2 div 0.300000 ex sub 10.800000 m (5,-.'-,6+&'7,2'!%',!2 87%&)
 gs 1 -1 sc sh gr
0.100000 slw
[0.080000] 0 sd
[0.200000] 0 sd
0 slc
n 3.857200 6.150000 m 10.839000 7.350005 l s
0 slj
n 9.982804 7.608711 m 10.839000 7.350005 l 10.118318 6.820272 l f
0.100000 slw
[0.200000] 0 sd
[0.200000] 0 sd
0 slc
n -5.939853 12.507747 m 5.952400 12.450000 l s
0 slj
n 5.154352 12.853880 m 5.952400 12.450000 l 5.150467 12.053889 l f
/Courier_e0 ff 0.800000 scf sf
(5 12'#%+&'+,-.) sw
2 div -0.547600 ex sub 13.450000 m (5 12'#%+&'+,-.)
 gs 1 -1 sc sh gr
showpage
