#FIG 3.2
Landscape
Center
Metric
A4      
100.00
Single
-2
1200 2
2 5 0 1 0 -1 50 0 -1 0.000 0 0 -1 0 0 5
	0 ../bytecode/try-finally.eps
	 3158 3015 4365 3015 4365 5333 3158 5333 3158 3015
2 2 0 0 0 6 150 0 20 0.000 0 0 -1 0 0 5
	 3105 4410 4410 4410 4410 4995 3105 4995 3105 4410
4 0 0 50 0 12 44 0.0000 4 480 390 2835 3510 {\001
4 0 0 50 0 14 12 1.5708 4 165 315 2880 3510 try\001
4 0 0 50 0 12 54 0.0000 4 600 480 2790 4230 {\001
4 0 0 50 0 14 12 1.5708 4 135 525 2880 4320 catch\001
