%!PS-Adobe-2.0 EPSF-2.0
%%Title: fork_exec.fig
%%Creator: fig2dev Version 3.2 Patchlevel 4
%%CreationDate: Sun Mar 20 19:53:37 2005
%%For: zboris@linux (Boris Z.)
%%BoundingBox: 0 0 220 227
%%Magnification: 1.0000
%%EndComments
/$F2psDict 200 dict def
$F2psDict begin
$F2psDict /mtrx matrix put
/col-1 {0 setgray} bind def
/col0 {0.000 0.000 0.000 srgb} bind def
/col1 {0.000 0.000 1.000 srgb} bind def
/col2 {0.000 1.000 0.000 srgb} bind def
/col3 {0.000 1.000 1.000 srgb} bind def
/col4 {1.000 0.000 0.000 srgb} bind def
/col5 {1.000 0.000 1.000 srgb} bind def
/col6 {1.000 1.000 0.000 srgb} bind def
/col7 {1.000 1.000 1.000 srgb} bind def
/col8 {0.000 0.000 0.560 srgb} bind def
/col9 {0.000 0.000 0.690 srgb} bind def
/col10 {0.000 0.000 0.820 srgb} bind def
/col11 {0.530 0.810 1.000 srgb} bind def
/col12 {0.000 0.560 0.000 srgb} bind def
/col13 {0.000 0.690 0.000 srgb} bind def
/col14 {0.000 0.820 0.000 srgb} bind def
/col15 {0.000 0.560 0.560 srgb} bind def
/col16 {0.000 0.690 0.690 srgb} bind def
/col17 {0.000 0.820 0.820 srgb} bind def
/col18 {0.560 0.000 0.000 srgb} bind def
/col19 {0.690 0.000 0.000 srgb} bind def
/col20 {0.820 0.000 0.000 srgb} bind def
/col21 {0.560 0.000 0.560 srgb} bind def
/col22 {0.690 0.000 0.690 srgb} bind def
/col23 {0.820 0.000 0.820 srgb} bind def
/col24 {0.500 0.190 0.000 srgb} bind def
/col25 {0.630 0.250 0.000 srgb} bind def
/col26 {0.750 0.380 0.000 srgb} bind def
/col27 {1.000 0.500 0.500 srgb} bind def
/col28 {1.000 0.630 0.630 srgb} bind def
/col29 {1.000 0.750 0.750 srgb} bind def
/col30 {1.000 0.880 0.880 srgb} bind def
/col31 {1.000 0.840 0.000 srgb} bind def

end
save
newpath 0 227 moveto 0 0 lineto 220 0 lineto 220 227 lineto closepath clip newpath
-104.1 332.4 translate
1 -1 scale

/cp {closepath} bind def
/ef {eofill} bind def
/gr {grestore} bind def
/gs {gsave} bind def
/sa {save} bind def
/rs {restore} bind def
/l {lineto} bind def
/m {moveto} bind def
/rm {rmoveto} bind def
/n {newpath} bind def
/s {stroke} bind def
/sh {show} bind def
/slc {setlinecap} bind def
/slj {setlinejoin} bind def
/slw {setlinewidth} bind def
/srgb {setrgbcolor} bind def
/rot {rotate} bind def
/sc {scale} bind def
/sd {setdash} bind def
/ff {findfont} bind def
/sf {setfont} bind def
/scf {scalefont} bind def
/sw {stringwidth} bind def
/tr {translate} bind def
/tnt {dup dup currentrgbcolor
  4 -2 roll dup 1 exch sub 3 -1 roll mul add
  4 -2 roll dup 1 exch sub 3 -1 roll mul add
  4 -2 roll dup 1 exch sub 3 -1 roll mul add srgb}
  bind def
/shd {dup dup currentrgbcolor 4 -2 roll mul 4 -2 roll mul
  4 -2 roll mul srgb} bind def
/$F2psBegin {$F2psDict begin /$F2psEnteredState save def} def
/$F2psEnd {$F2psEnteredState restore end} def

$F2psBegin
10 setmiterlimit
0 slj 0 slc
 0.06299 0.06299 sc
%
% Fig objects follow
%
% 
% here starts figure with depth 50
% Polyline
15.000 slw
gs  clippath
3030 2985 m 3090 2985 l 3090 2818 l 3060 2938 l 3030 2818 l cp
eoclip
n 3060 2115 m
 3060 2970 l gs col0 s gr gr

% arrowhead
n 3030 2818 m 3060 2938 l 3090 2818 l 3030 2818 l  cp gs 0.00 setgray ef gr  col0 s
% Polyline
gs  clippath
2008 4685 m 2055 4722 l 2158 4589 l 2061 4666 l 2110 4552 l cp
eoclip
n 2986 3477 m
 2041 4692 l gs col0 s gr gr

% arrowhead
n 2110 4552 m 2061 4666 l 2158 4589 l 2110 4552 l  cp gs 0.00 setgray ef gr  col0 s
% Polyline
gs  clippath
4098 4721 m 4145 4684 l 4043 4551 l 4093 4665 l 3995 4588 l cp
eoclip
n 3168 3476 m
 4113 4691 l gs col0 s gr gr

% arrowhead
n 3995 4588 m 4093 4665 l 4043 4551 l 3995 4588 l  cp gs 0.00 setgray ef gr  col0 s
% Polyline
 [60] 0 sd
gs  clippath
3795 4575 m 3795 4515 l 3644 4515 l 3764 4545 l 3644 4575 l cp
2325 4515 m 2325 4575 l 2476 4575 l 2356 4545 l 2476 4515 l cp
eoclip
n 2340 4545 m
 3780 4545 l gs col0 s gr gr
 [] 0 sd
% arrowhead
7.500 slw
n 2476 4515 m 2356 4545 l 2476 4575 l 2476 4515 l  cp gs 0.00 setgray ef gr  col0 s
% arrowhead
n 3644 4575 m 3764 4545 l 3644 4515 l 3644 4575 l  cp gs 0.00 setgray ef gr  col0 s
% Polyline
 [15 45] 45 sd
n 1665 1890 m 5130 1890 l 5130 5265 l 1665 5265 l
 cp gs col0 s gr  [] 0 sd
/Helvetica ff 180.00 scf sf
2880 3150 m
gs 1 -1 sc (fork\(\)) col0 sh gr
/Helvetica ff 180.00 scf sf
2880 3420 m
gs 1 -1 sc (exec\(\)) col0 sh gr
/Helvetica ff 180.00 scf sf
2475 2475 m
gs 1 -1 sc (JNuke) col0 sh gr
/Helvetica ff 180.00 scf sf
3510 3870 m
gs 1 -1 sc ("remote" Program) col0 sh gr
/Helvetica ff 180.00 scf sf
2115 3870 m
gs 1 -1 sc (JNuke) col0 sh gr
/Helvetica ff 180.00 scf sf
2700 4770 m
gs 1 -1 sc (Netzwerk) col0 sh gr
/Helvetica ff 180.00 scf sf
2475 4995 m
gs 1 -1 sc (Kommunikation) col0 sh gr
/Helvetica ff 180.00 scf sf
1710 1800 m
gs 1 -1 sc (Ein Computer) col0 sh gr
% here ends figure;
$F2psEnd
rs
showpage
