(JNukeVirtualTable "SimpleClass"
  (JNukeVTableEntry (java) (JNukeMethod "SimpleClass.<init>" (JNukeSignature "V" (JNukeVector))))
  (JNukeVTableEntry (java) (JNukeMethod "SimpleClass.func_a" (JNukeSignature "I" (JNukeVector "I" "I"))))
  (JNukeVTableEntry (java) (JNukeMethod "SimpleClass.func_a" (JNukeSignature "I" (JNukeVector "I" "I" "I"))))
  (JNukeVTableEntry (java) (JNukeMethod "SimpleClass.func_b" (JNukeSignature "I" (JNukeVector "I" "I" "J"))))
  (JNukeVTableEntry (java) (JNukeMethod "SimpleClass.func_b" (JNukeSignature "I" (JNukeVector "I" "I" "LSimpleClass;"))))
  (JNukeVTableEntry (java) (JNukeMethod "SimpleClass.func_c" (JNukeSignature "I" (JNukeVector "I" "C" "[LSimpleClass;"))))
  (JNukeVTableEntry (java) (JNukeMethod "SimpleClass.func_c" (JNukeSignature "I" (JNukeVector "I" "[LSimpleClass;"))))
)
