%!PS-Adobe-2.0 EPSF-2.0
%%Title: milestone-ex.dia
%%Creator: Dia v0.90
%%CreationDate: Sat Mar  8 16:39:38 2003
%%For: pascal
%%Magnification: 1.0000
%%Orientation: Portrait
%%BoundingBox: 0 0 676 688
%%Pages: 1
%%EndComments
%%BeginProlog
/cp {closepath} bind def
/c {curveto} bind def
/f {fill} bind def
/a {arc} bind def
/ef {eofill} bind def
/ex {exch} bind def
/gr {grestore} bind def
/gs {gsave} bind def
/sa {save} bind def
/rs {restore} bind def
/l {lineto} bind def
/m {moveto} bind def
/rm {rmoveto} bind def
/n {newpath} bind def
/s {stroke} bind def
/sh {show} bind def
/slc {setlinecap} bind def
/slj {setlinejoin} bind def
/slw {setlinewidth} bind def
/srgb {setrgbcolor} bind def
/rot {rotate} bind def
/sc {scale} bind def
/sd {setdash} bind def
/ff {findfont} bind def
/sf {setfont} bind def
/scf {scalefont} bind def
/sw {stringwidth pop} bind def
/tr {translate} bind def

/ellipsedict 8 dict def
ellipsedict /mtrx matrix put
/ellipse
{ ellipsedict begin
   /endangle exch def
   /startangle exch def
   /yrad exch def
   /xrad exch def
   /y exch def
   /x exch def   /savematrix mtrx currentmatrix def
   x y tr xrad yrad sc
   0 0 1 startangle endangle arc
   savematrix setmatrix
   end
} def

/mergeprocs {
dup length
3 -1 roll
dup
length
dup
5 1 roll
3 -1 roll
add
array cvx
dup
3 -1 roll
0 exch
putinterval
dup
4 2 roll
putinterval
} bind def
%%EndProlog

%%BeginSetup
%%EndSetup
28.346000 -28.346000 scale
-0.599477 -26.863509 translate

0.100000 slw
[] 0 sd
[] 0 sd
0 slc
0.000000 0.000000 0.000000 srgb
n 7.750000 4.450000 m 7.675000 8.840000 l s
0 slj
1.000000 1.000000 1.000000 srgb
n 7.288724 8.033284 m 7.675000 8.840000 l 8.088607 8.046949 l f
0.100000 slw
[] 0 sd
0 slj
0.000000 0.000000 0.000000 srgb
n 7.288724 8.033284 m 7.675000 8.840000 l 8.088607 8.046949 l cp s
0.100000 slw
[] 0 sd
[] 0 sd
0 slc
0 slj
0 slc
0 slj
[] 0 sd
1.000000 1.000000 1.000000 srgb
n 8.308333 24.640000 m 10.141667 24.640000 l 10.394797 24.640000 10.600000 24.999764 10.600000 25.443555 c 10.600000 25.887346 10.394797 26.247110 10.141667 26.247110 c 8.308333 26.247110 l 8.055203 26.247110 7.850000 25.887346 7.850000 25.443555 c 7.850000 24.999764 8.055203 24.640000 8.308333 24.640000 c f
0.000000 0.000000 0.000000 srgb
n 8.308333 24.640000 m 10.141667 24.640000 l 10.394797 24.640000 10.600000 24.999764 10.600000 25.443555 c 10.600000 25.887346 10.394797 26.247110 10.141667 26.247110 c 8.308333 26.247110 l 8.055203 26.247110 7.850000 25.887346 7.850000 25.443555 c 7.850000 24.999764 8.055203 24.640000 8.308333 24.640000 c s
0.100000 slw
[] 0 sd
[] 0 sd
0 slc
0 slj
0 slc
0 slj
[] 0 sd
1.000000 1.000000 1.000000 srgb
n 6.758333 8.840000 m 8.591667 8.840000 l 8.844797 8.840000 9.050000 9.199764 9.050000 9.643555 c 9.050000 10.087346 8.844797 10.447110 8.591667 10.447110 c 6.758333 10.447110 l 6.505203 10.447110 6.300000 10.087346 6.300000 9.643555 c 6.300000 9.199764 6.505203 8.840000 6.758333 8.840000 c f
0.000000 0.000000 0.000000 srgb
n 6.758333 8.840000 m 8.591667 8.840000 l 8.844797 8.840000 9.050000 9.199764 9.050000 9.643555 c 9.050000 10.087346 8.844797 10.447110 8.591667 10.447110 c 6.758333 10.447110 l 6.505203 10.447110 6.300000 10.087346 6.300000 9.643555 c 6.300000 9.199764 6.505203 8.840000 6.758333 8.840000 c s
 [ /xi /xi /xi /xi /xi /xi /xi /xi /xi /xi /xi /xi /xi /xi /xi /xi
 /xi /xi /xi /xi /xi /xi /xi /xi /xi /xi /xi /xi /xi /xi /xi /xi
 /M /i /l /e /s /t /o /n /xi /xi /E /x /c /u /R /b
 /a /k /S /r /one /period /two /three /four /five /six /space /m /v /xi /xi
 /xi /xi /xi /xi /xi /xi /xi /xi /xi /xi /xi /xi /xi /xi /xi /xi
 /xi /xi /xi /xi /xi /xi /xi /xi /xi /xi /xi /xi /xi /xi /xi /xi
 /xi /xi /xi /xi /xi /xi /xi /xi /xi /xi /xi /xi /xi /xi /xi /xi
 /xi /xi /xi /xi /xi /xi /xi /xi /xi /xi /xi /xi /xi /xi /xi /xi
 /xi /xi /xi /xi /xi /xi /xi /xi /xi /xi /xi /xi /xi /xi /xi /xi
 /xi /xi /xi /xi /xi /xi /xi /xi /xi /xi /xi /xi /xi /xi /xi /xi
 /xi /xi /xi /xi /xi /xi /xi /xi /xi /xi /xi /xi /xi /xi /xi /xi
 /xi /xi /xi /xi /xi /xi /xi /xi /xi /xi /xi /xi /xi /xi /xi /xi
 /xi /xi /xi /xi /xi /xi /xi /xi /xi /xi /xi /xi /xi /xi /xi /xi
 /xi /xi /xi /xi /xi /xi /xi /xi /xi /xi /xi /xi /xi /xi /xi /xi
 /xi /xi /xi /xi /xi /xi /xi /xi /xi /xi /xi /xi /xi /xi /xi /xi
 /xi /xi /xi /xi /xi /xi /xi /xi /xi /xi /xi /xi /xi /xi /xi /xi
] /e0 exch def
/Courier_e0 undefinefont
/Courier_e0
  /Courier findfont
  dup length dict begin
  {1 index /FID ne {def} {pop pop} ifelse} forall
  /Encoding e0 def
  currentdict end
definefont pop
/Courier_e0 ff 0.800000 scf sf
( !"#$%&'#) sw
2 div 13.500000 ex sub 25.650000 m ( !"#$%&'#)
 gs 1 -1 sc sh gr
0.100000 slw
[] 0 sd
[] 0 sd
0 slc
n 7.675000 10.447100 m 7.675000 14.830800 l s
0 slj
1.000000 1.000000 1.000000 srgb
n 7.275000 14.030800 m 7.675000 14.830800 l 8.075000 14.030800 l f
0.100000 slw
[] 0 sd
0 slj
0.000000 0.000000 0.000000 srgb
n 7.275000 14.030800 m 7.675000 14.830800 l 8.075000 14.030800 l cp s
0.100000 slw
[] 0 sd
[] 0 sd
0 slc
0 slj
0 slc
0 slj
[] 0 sd
1.000000 1.000000 1.000000 srgb
n 6.758333 14.830800 m 8.591667 14.830800 l 8.844797 14.830800 9.050000 15.190564 9.050000 15.634355 c 9.050000 16.078146 8.844797 16.437910 8.591667 16.437910 c 6.758333 16.437910 l 6.505203 16.437910 6.300000 16.078146 6.300000 15.634355 c 6.300000 15.190564 6.505203 14.830800 6.758333 14.830800 c f
0.000000 0.000000 0.000000 srgb
n 6.758333 14.830800 m 8.591667 14.830800 l 8.844797 14.830800 9.050000 15.190564 9.050000 15.634355 c 9.050000 16.078146 8.844797 16.437910 8.591667 16.437910 c 6.758333 16.437910 l 6.505203 16.437910 6.300000 16.078146 6.300000 15.634355 c 6.300000 15.190564 6.505203 14.830800 6.758333 14.830800 c s
0.100000 slw
[] 0 sd
[] 0 sd
0 slc
n 7.675000 16.438000 m 7.675000 21.050000 l s
0 slj
1.000000 1.000000 1.000000 srgb
n 7.275000 20.250000 m 7.675000 21.050000 l 8.075000 20.250000 l f
0.100000 slw
[] 0 sd
0 slj
0.000000 0.000000 0.000000 srgb
n 7.275000 20.250000 m 7.675000 21.050000 l 8.075000 20.250000 l cp s
0.100000 slw
[] 0 sd
[] 0 sd
0 slj
0 slc
n 7.175000 21.600000 m 5.375000 20.350000 4.200000 19.250000 6.300000 15.634400 c s
0 slj
1.000000 1.000000 1.000000 srgb
n 6.244093 16.527078 m 6.300000 15.634400 l 5.552313 16.125281 l f
0.100000 slw
[] 0 sd
0 slj
0.000000 0.000000 0.000000 srgb
n 6.244093 16.527078 m 6.300000 15.634400 l 5.552313 16.125281 l cp s
0.100000 slw
[] 0 sd
[] 0 sd
0 slc
n 9.050000 15.634400 m 11.950000 21.040000 l s
0 slj
1.000000 1.000000 1.000000 srgb
n 11.219324 20.524139 m 11.950000 21.040000 l 11.924283 20.145943 l f
0.100000 slw
[] 0 sd
0 slj
0.000000 0.000000 0.000000 srgb
n 11.219324 20.524139 m 11.950000 21.040000 l 11.924283 20.145943 l cp s
0.100000 slw
[] 0 sd
[] 0 sd
0 slj
0 slc
n 12.450000 21.590000 m 13.976100 19.970400 12.700000 15.650000 9.050000 15.634400 c s
0 slj
1.000000 1.000000 1.000000 srgb
n 9.851702 15.237823 m 9.050000 15.634400 l 9.848283 16.037815 l f
0.100000 slw
[] 0 sd
0 slj
0.000000 0.000000 0.000000 srgb
n 9.851702 15.237823 m 9.050000 15.634400 l 9.848283 16.037815 l cp s
0.100000 slw
[] 0 sd
[] 0 sd
0 slj
0 slc
n 6.300000 15.634400 m 6.416200 15.634400 3.600000 13.159200 6.300000 9.643550 c s
0 slj
1.000000 1.000000 1.000000 srgb
n 6.129963 10.521666 m 6.300000 9.643550 l 5.495485 10.034390 l f
0.100000 slw
[] 0 sd
0 slj
0.000000 0.000000 0.000000 srgb
n 6.129963 10.521666 m 6.300000 9.643550 l 5.495485 10.034390 l cp s
0.100000 slw
[] 0 sd
[] 0 sd
0 slc
n 1.375700 24.440800 m 1.400000 26.550000 l s
0 slj
1.000000 1.000000 1.000000 srgb
n 0.990810 25.754661 m 1.400000 26.550000 l 1.790757 25.745445 l f
0.100000 slw
[] 0 sd
0 slj
0.000000 0.000000 0.000000 srgb
n 0.990810 25.754661 m 1.400000 26.550000 l 1.790757 25.745445 l cp s
0.100000 slw
[] 0 sd
[] 0 sd
0 slc
n 17.176300 23.740600 m 17.140000 25.713509 l s
0 slj
1.000000 1.000000 1.000000 srgb
n 17.561515 24.547823 m 17.176300 23.740600 l 16.761651 24.533106 l f
0.100000 slw
[] 0 sd
0 slj
0.000000 0.000000 0.000000 srgb
n 17.561515 24.547823 m 17.176300 23.740600 l 16.761651 24.533106 l cp s
/Courier_e0 ff 0.800000 scf sf
(*+#,-%!&') sw
2 div 4.698000 ex sub 25.686500 m (*+#,-%!&')
 gs 1 -1 sc sh gr
/Courier_e0 ff 0.800000 scf sf
(.&""/0,1) sw
2 div 20.380400 ex sub 25.586500 m (.&""/0,1)
 gs 1 -1 sc sh gr
/Courier_e0 ff 0.800000 scf sf
(2%03%) sw
2 div 7.700000 ex sub 4.000000 m (2%03%)
 gs 1 -1 sc sh gr
/Courier_e0 ff 0.800000 scf sf
(45) sw
2 div 7.900000 ex sub 9.850000 m (45)
 gs 1 -1 sc sh gr
/Courier_e0 ff 0.800000 scf sf
(65) sw
2 div 7.900000 ex sub 15.950000 m (65)
 gs 1 -1 sc sh gr
1.000000 1.000000 1.000000 srgb
n 7.675000 21.600000 0.500000 0.550000 0 360 ellipse f
0.100000 slw
[] 0 sd
[] 0 sd
0.000000 0.000000 0.000000 srgb
n 7.675000 21.600000 0.500000 0.550000 0 360 ellipse cp s
1.000000 1.000000 1.000000 srgb
n 11.950000 21.590000 0.500000 0.550000 0 360 ellipse f
0.100000 slw
[] 0 sd
[] 0 sd
0.000000 0.000000 0.000000 srgb
n 11.950000 21.590000 0.500000 0.550000 0 360 ellipse cp s
/Courier_e0 ff 0.800000 scf sf
(75) sw
2 div 4.700000 ex sub 19.950000 m (75)
 gs 1 -1 sc sh gr
/Courier_e0 ff 0.800000 scf sf
(85) sw
2 div 13.500000 ex sub 18.050000 m (85)
 gs 1 -1 sc sh gr
/Courier_e0 ff 0.800000 scf sf
(95) sw
2 div 4.500000 ex sub 13.150000 m (95)
 gs 1 -1 sc sh gr
1.000000 1.000000 1.000000 srgb
n 14.950000 15.790000 0.500000 0.550000 0 360 ellipse f
0.100000 slw
[] 0 sd
[] 0 sd
0.000000 0.000000 0.000000 srgb
n 14.950000 15.790000 0.500000 0.550000 0 360 ellipse cp s
0.100000 slw
[] 0 sd
[] 0 sd
0 slc
n 8.915750 10.211700 m 14.450000 15.790000 l s
0 slj
1.000000 1.000000 1.000000 srgb
n 13.602600 15.503796 m 14.450000 15.790000 l 14.170523 14.940357 l f
0.100000 slw
[] 0 sd
0 slj
0.000000 0.000000 0.000000 srgb
n 13.602600 15.503796 m 14.450000 15.790000 l 14.170523 14.940357 l cp s
0.100000 slw
[] 0 sd
[] 0 sd
0 slj
0 slc
n 15.450000 15.790000 m 15.300000 11.150000 12.700000 9.659150 9.050000 9.643550 c s
0 slj
1.000000 1.000000 1.000000 srgb
n 9.851702 9.246973 m 9.050000 9.643550 l 9.848283 10.046965 l f
0.100000 slw
[] 0 sd
0 slj
0.000000 0.000000 0.000000 srgb
n 9.851702 9.246973 m 9.050000 9.643550 l 9.848283 10.046965 l cp s
/Courier_e0 ff 0.800000 scf sf
(:5) sw
2 div 14.200000 ex sub 10.950000 m (:5)
 gs 1 -1 sc sh gr
14.800000 3.200000 m /Courier_e0 ff 0.800000 scf sf
(45;$#% !"#$%&'#)
 gs 1 -1 sc sh gr
14.800000 4.000000 m (65;$#% !"#$%&'#)
 gs 1 -1 sc sh gr
14.800000 4.800000 m (75;3&""/0,1)
 gs 1 -1 sc sh gr
14.800000 5.600000 m (85;3&""/0,1)
 gs 1 -1 sc sh gr
14.800000 6.400000 m (;;;3#<&=# !"#$%&'#)
 gs 1 -1 sc sh gr
14.800000 7.200000 m (95;3&""/0,1)
 gs 1 -1 sc sh gr
14.800000 8.000000 m (:5;3&""/0,1)
 gs 1 -1 sc sh gr
1.000000 1.000000 1.000000 srgb
n 17.140000 26.263509 0.500000 0.550000 0 360 ellipse f
0.100000 slw
[] 0 sd
[] 0 sd
0.000000 0.000000 0.000000 srgb
n 17.140000 26.263509 0.500000 0.550000 0 360 ellipse cp s
showpage
