#FIG 3.2
Landscape
Center
Metric
A4      
100.00
Single
-2
1200 2
5 1 0 1 0 7 50 -1 -1 0.000 0 0 1 0 5440.109 5316.114 5310 5940 4860 5580 4995 4860
	1 1 1.00 60.00 120.00
5 1 0 1 0 7 50 -1 -1 0.000 0 1 1 0 6947.500 6432.500 7110 6570 7155 6480 7065 6255
	1 1 1.00 60.00 120.00
5 1 0 1 0 7 50 -1 -1 0.000 0 1 1 0 5897.852 4876.003 7200 4635 6570 3735 5805 3555
	1 1 1.00 60.00 120.00
5 1 0 1 0 7 50 -1 -1 0.000 0 1 1 0 7159.891 5316.114 7290 5940 7740 5580 7605 4860
	1 1 1.00 60.00 120.00
5 1 0 1 0 7 50 -1 -1 0.000 0 0 1 0 5542.500 4252.500 4995 4860 4725 4230 4995 3645
	1 1 1.00 60.00 120.00
6 4995 3420 5805 3870
2 4 0 1 0 7 50 -1 -1 0.000 0 0 7 0 0 5
	 5805 3870 4995 3870 4995 3420 5805 3420 5805 3870
4 1 0 50 -1 4 12 0.0000 0 135 390 5400 3690 MS1\001
-6
6 4995 4635 5805 5085
2 4 0 1 0 7 50 -1 -1 0.000 0 0 7 0 0 5
	 5805 5085 4995 5085 4995 4635 5805 4635 5805 5085
4 1 0 50 -1 4 12 0.0000 0 135 390 5400 4905 MS2\001
-6
6 5355 5085 6165 5850
2 1 0 1 0 7 50 -1 -1 0.000 0 0 -1 1 0 2
	1 1 1.00 60.00 120.00
	 5400 5085 5400 5850
4 0 0 50 -1 4 12 0.0000 0 180 645 5490 5535 open(y)\001
-6
6 5355 3870 6165 4635
2 1 0 1 0 7 50 -1 -1 0.000 0 0 -1 1 0 2
	1 1 1.00 60.00 120.00
	 5400 3870 5400 4635
4 0 0 50 -1 4 12 0.0000 0 180 660 5490 4365 close(x)\001
-6
6 5355 2700 6120 3420
2 1 0 1 0 7 50 -1 -1 0.000 0 0 -1 1 0 2
	1 1 1.00 60.00 120.00
	 5400 2700 5400 3420
4 0 0 50 -1 4 12 0.0000 0 180 630 5490 3060 open(x)\001
-6
6 6795 4635 7605 5085
2 4 0 1 0 7 50 -1 -1 0.000 0 0 7 0 0 5
	 7605 5085 6795 5085 6795 4635 7605 4635 7605 5085
4 1 0 50 -1 4 12 0.0000 0 135 435 7200 4905 MS2'\001
-6
1 3 0 1 0 7 50 -1 -1 0.000 1 0.0000 5400 5940 101 101 5400 5940 5490 5985
1 3 0 1 0 7 50 -1 -1 0.000 1 0.0000 7110 6660 101 101 7110 6660 7200 6705
1 3 0 1 0 7 50 -1 -1 0.000 1 0.0000 7200 5940 101 101 7200 5940 7290 5985
2 1 0 1 0 7 50 -1 -1 0.000 0 0 -1 1 0 2
	1 1 1.00 60.00 120.00
	 5805 3735 7200 4635
2 4 0 1 0 7 50 -1 -1 0.000 0 0 7 0 0 5
	 5895 6660 5895 6300 5355 6300 5355 6660 5895 6660
2 1 0 1 0 7 50 -1 -1 0.000 0 0 -1 1 0 2
	1 1 1.00 60.00 120.00
	 4140 6300 4140 6705
2 1 0 1 0 7 50 -1 -1 0.000 0 0 -1 1 0 2
	1 1 1.00 60.00 120.00
	 7200 5085 7200 5850
4 0 0 50 -1 4 12 0.0000 0 135 150 5220 4185 1\001
4 0 0 50 -1 4 12 0.0000 0 135 150 5220 5355 2\001
4 0 0 50 -1 4 12 0.0000 0 135 810 6030 6570 Milestone\001
4 0 0 50 -1 4 12 0.0000 0 135 825 4320 6570 Execution\001
4 0 0 50 -1 4 12 0.0000 0 135 720 7290 6570 Rollback\001
4 0 0 50 -1 4 12 0.0000 0 135 375 5175 2610 Start\001
4 0 0 50 -1 4 12 0.0000 0 180 645 6480 5535 open(y)\001
4 0 0 50 -1 4 12 0.0000 0 180 660 6885 3870 close(x)\001
4 0 0 50 -1 4 12 0.0000 0 135 150 6570 3645 8\001
4 0 0 50 -1 4 12 0.0000 0 135 150 6435 4095 5\001
4 0 0 50 -1 4 12 0.0000 0 135 150 7290 5310 6\001
4 0 0 50 -1 4 12 0.0000 0 135 150 7875 5310 7\001
4 0 0 50 -1 4 12 0.0000 0 135 150 4590 5355 3\001
4 0 0 50 -1 4 12 0.0000 0 135 150 4545 4185 4\001
