C.<init>:5:Write access to field C.c by thread 0 (holding 0 locks)
C.<init>:5:Write access to field C.c by thread 0 (holding 0 locks)
C.run:9:Read access to field C.c by thread 1 (holding 0 locks)
Const.getC:15:Read access to field Const.c by thread 1 (holding 0 locks)
C.run:9:Read access to field C.c by thread 2 (holding 0 locks)
Const.getC:15:Read access to field Const.c by thread 2 (holding 0 locks)
