%!PS-Adobe-2.0 EPSF-2.0
%%Title: iosubsystem.fig
%%Creator: fig2dev Version 3.2 Patchlevel 4
%%CreationDate: Tue Mar 22 23:27:48 2005
%%For: zboris@linux (Boris Z.)
%%BoundingBox: 0 0 339 269
%%Magnification: 1.0000
%%EndComments
/$F2psDict 200 dict def
$F2psDict begin
$F2psDict /mtrx matrix put
/col-1 {0 setgray} bind def
/col0 {0.000 0.000 0.000 srgb} bind def
/col1 {0.000 0.000 1.000 srgb} bind def
/col2 {0.000 1.000 0.000 srgb} bind def
/col3 {0.000 1.000 1.000 srgb} bind def
/col4 {1.000 0.000 0.000 srgb} bind def
/col5 {1.000 0.000 1.000 srgb} bind def
/col6 {1.000 1.000 0.000 srgb} bind def
/col7 {1.000 1.000 1.000 srgb} bind def
/col8 {0.000 0.000 0.560 srgb} bind def
/col9 {0.000 0.000 0.690 srgb} bind def
/col10 {0.000 0.000 0.820 srgb} bind def
/col11 {0.530 0.810 1.000 srgb} bind def
/col12 {0.000 0.560 0.000 srgb} bind def
/col13 {0.000 0.690 0.000 srgb} bind def
/col14 {0.000 0.820 0.000 srgb} bind def
/col15 {0.000 0.560 0.560 srgb} bind def
/col16 {0.000 0.690 0.690 srgb} bind def
/col17 {0.000 0.820 0.820 srgb} bind def
/col18 {0.560 0.000 0.000 srgb} bind def
/col19 {0.690 0.000 0.000 srgb} bind def
/col20 {0.820 0.000 0.000 srgb} bind def
/col21 {0.560 0.000 0.560 srgb} bind def
/col22 {0.690 0.000 0.690 srgb} bind def
/col23 {0.820 0.000 0.820 srgb} bind def
/col24 {0.500 0.190 0.000 srgb} bind def
/col25 {0.630 0.250 0.000 srgb} bind def
/col26 {0.750 0.380 0.000 srgb} bind def
/col27 {1.000 0.500 0.500 srgb} bind def
/col28 {1.000 0.630 0.630 srgb} bind def
/col29 {1.000 0.750 0.750 srgb} bind def
/col30 {1.000 0.880 0.880 srgb} bind def
/col31 {1.000 0.840 0.000 srgb} bind def

end
save
newpath 0 269 moveto 0 0 lineto 339 0 lineto 339 269 lineto closepath clip newpath
-141.0 377.8 translate
1 -1 scale

/cp {closepath} bind def
/ef {eofill} bind def
/gr {grestore} bind def
/gs {gsave} bind def
/sa {save} bind def
/rs {restore} bind def
/l {lineto} bind def
/m {moveto} bind def
/rm {rmoveto} bind def
/n {newpath} bind def
/s {stroke} bind def
/sh {show} bind def
/slc {setlinecap} bind def
/slj {setlinejoin} bind def
/slw {setlinewidth} bind def
/srgb {setrgbcolor} bind def
/rot {rotate} bind def
/sc {scale} bind def
/sd {setdash} bind def
/ff {findfont} bind def
/sf {setfont} bind def
/scf {scalefont} bind def
/sw {stringwidth} bind def
/tr {translate} bind def
/tnt {dup dup currentrgbcolor
  4 -2 roll dup 1 exch sub 3 -1 roll mul add
  4 -2 roll dup 1 exch sub 3 -1 roll mul add
  4 -2 roll dup 1 exch sub 3 -1 roll mul add srgb}
  bind def
/shd {dup dup currentrgbcolor 4 -2 roll mul 4 -2 roll mul
  4 -2 roll mul srgb} bind def
/$F2psBegin {$F2psDict begin /$F2psEnteredState save def} def
/$F2psEnd {$F2psEnteredState restore end} def

$F2psBegin
10 setmiterlimit
0 slj 0 slc
 0.06299 0.06299 sc
%
% Fig objects follow
%
% 
% here starts figure with depth 50
% Polyline
7.500 slw
n 5580 1890 m 6120 1890 l 6120 2385 l 5580 2385 l
 cp gs col0 s gr 
% Polyline
n 2340 1890 m 2880 1890 l 2880 2385 l 2340 2385 l
 cp gs col0 s gr 
% Polyline
n 3420 1890 m 3960 1890 l 3960 2385 l 3420 2385 l
 cp gs col0 s gr 
% Polyline
n 4500 1890 m 5040 1890 l 5040 2385 l 4500 2385 l
 cp gs col0 s gr 
% Polyline
n 4095 3150 m 4635 3150 l 4635 3645 l 4095 3645 l
 cp gs col0 s gr 
% Polyline
n 4635 3150 m 5175 3150 l 5175 3645 l 4635 3645 l
 cp gs col0 s gr 
% Polyline
n 5175 3150 m 5715 3150 l 5715 3645 l 5175 3645 l
 cp gs col0 s gr 
% Polyline
n 5715 3150 m 6255 3150 l 6255 3645 l 5715 3645 l
 cp gs col0 s gr 
% Polyline
n 2880 1890 m 3420 1890 l 3420 2385 l 2880 2385 l
 cp gs col0 s gr 
% Polyline
n 5040 1890 m 5580 1890 l 5580 2385 l 5040 2385 l
 cp gs col0 s gr 
% Polyline
n 3960 1890 m 4500 1890 l 4500 2385 l 3960 2385 l
 cp gs col0 s gr 
% Polyline
 [60] 0 sd
n 2295 3465 m
 2340 2385 l gs col0 s gr  [] 0 sd
% Polyline
 [60] 0 sd
n 2880 2385 m
 3600 3465 l gs col0 s gr  [] 0 sd
% Polyline
gs  clippath
4116 3400 m 4102 3342 l 3955 3377 l 4079 3379 l 3969 3435 l cp
eoclip
n 3150 3600 m
 4095 3375 l gs col0 s gr gr

% arrowhead
n 3969 3435 m 4079 3379 l 3955 3377 l 3969 3435 l  cp gs 0.00 setgray ef gr  col0 s
% Polyline
n 4950 4140 m 6255 4140 l 6255 4950 l 4950 4950 l
 cp gs col0 s gr 
% Polyline
 [60] 0 sd
n 5220 3645 m
 4950 4140 l gs col0 s gr  [] 0 sd
% Polyline
 [60] 0 sd
n 5715 3645 m
 6255 4140 l gs col0 s gr  [] 0 sd
% Polyline
n 2250 5175 m 3555 5175 l 3555 5985 l 2250 5985 l
 cp gs col0 s gr 
% Polyline
n 2295 3465 m 3600 3465 l 3600 4365 l 2295 4365 l
 cp gs col0 s gr 
% Polyline
gs  clippath
2717 5194 m 2776 5185 l 2755 5035 l 2743 5159 l 2696 5044 l cp
eoclip
n 2610 4230 m
 2745 5175 l gs col0 s gr gr

% arrowhead
n 2696 5044 m 2743 5159 l 2755 5035 l 2696 5044 l  cp gs 0.00 setgray ef gr  col0 s
% Polyline
n 4185 5535 m 7605 5535 l 7605 5715 l 4185 5715 l
 cp gs col0 s gr 
% Polyline
n 4185 5805 m 7605 5805 l 7605 5985 l 4185 5985 l
 cp gs col0 s gr 
% Polyline
gs  clippath
4201 5654 m 4198 5594 l 4047 5602 l 4169 5626 l 4050 5662 l cp
eoclip
n 3330 5670 m
 4185 5625 l gs col0 s gr gr

% arrowhead
n 4050 5662 m 4169 5626 l 4047 5602 l 4050 5662 l  cp gs 0.00 setgray ef gr  col0 s
% Polyline
gs  clippath
4198 5925 m 4201 5865 l 4050 5857 l 4169 5894 l 4047 5916 l cp
eoclip
n 3420 5850 m
 4185 5895 l gs col0 s gr gr

% arrowhead
n 4047 5916 m 4169 5894 l 4050 5857 l 4047 5916 l  cp gs 0.00 setgray ef gr  col0 s
/Courier ff 180.00 scf sf
2385 3645 m
gs 1 -1 sc (MSlist) col0 sh gr
/Courier ff 180.00 scf sf
2385 3840 m
gs 1 -1 sc (type) col0 sh gr
/Courier ff 180.00 scf sf
2385 4230 m
gs 1 -1 sc (socketcache) col0 sh gr
/Courier ff 180.00 scf sf
5040 4320 m
gs 1 -1 sc (position) col0 sh gr
/Courier ff 180.00 scf sf
5040 4545 m
gs 1 -1 sc (position2) col0 sh gr
/Courier ff 180.00 scf sf
5040 4770 m
gs 1 -1 sc (...) col0 sh gr
/Courier ff 180.00 scf sf
2385 4050 m
gs 1 -1 sc (...) col0 sh gr
/Courier ff 180.00 scf sf
5040 4095 m
gs 1 -1 sc (Milestone) col0 sh gr
/Courier ff 180.00 scf sf
2385 3420 m
gs 1 -1 sc (FdInfo) col0 sh gr
/Courier ff 180.00 scf sf
2385 1845 m
gs 1 -1 sc (activeFD) col0 sh gr
/Courier ff 180.00 scf sf
2295 5355 m
gs 1 -1 sc (readPos) col0 sh gr
/Courier ff 180.00 scf sf
2295 5535 m
gs 1 -1 sc (...) col0 sh gr
/Courier ff 180.00 scf sf
2295 5715 m
gs 1 -1 sc (readCache) col0 sh gr
/Courier ff 180.00 scf sf
2295 5895 m
gs 1 -1 sc (writeCache) col0 sh gr
% here ends figure;
$F2psEnd
rs
showpage
