#FIG 3.2
Landscape
Center
Metric
A4      
100.00
Single
-2
1200 2
6 2250 3105 7380 3600
2 2 0 1 0 7 50 -1 -1 0.000 0 0 -1 0 0 5
	 2835 3375 4230 3375 4230 3105 2835 3105 2835 3375
2 1 0 1 0 7 50 -1 -1 0.000 0 0 -1 0 0 2
	 2250 3375 7380 3375
2 2 0 1 0 7 50 -1 -1 0.000 0 0 -1 0 0 5
	 5580 3375 6975 3375 6975 3105 5580 3105 5580 3375
4 0 0 50 -1 4 12 0.0000 0 135 210 2745 3600 10\001
4 0 0 50 -1 4 12 0.0000 0 135 210 4140 3600 30\001
4 0 0 50 -1 4 12 0.0000 0 135 210 5490 3600 50\001
4 0 0 50 -1 4 12 0.0000 0 135 210 6885 3600 70\001
-6
2 2 0 1 0 7 50 -1 -1 0.000 0 0 -1 0 0 5
	 2835 4545 5175 4545 5175 4275 2835 4275 2835 4545
2 2 0 1 0 7 50 -1 -1 0.000 0 0 -1 0 0 5
	 2835 4860 4230 4860 4230 4590 2835 4590 2835 4860
2 1 0 1 0 7 50 -1 -1 0.000 0 0 -1 0 0 2
	 2250 4860 7380 4860
2 2 0 1 0 7 50 -1 -1 0.000 0 0 -1 0 0 5
	 5580 4860 6975 4860 6975 4590 5580 4590 5580 4860
2 2 0 1 0 7 50 -1 -1 0.000 0 0 -1 0 0 5
	 6300 4545 7200 4545 7200 4275 6300 4275 6300 4545
2 1 0 1 0 7 50 0 -1 0.000 0 0 -1 0 0 2
	 2250 2160 2250 2430
2 1 0 1 0 7 50 0 -1 0.000 0 0 -1 0 0 2
	 2250 3240 2250 3510
2 1 0 1 0 7 50 0 -1 0.000 0 0 -1 0 0 2
	 2250 4725 2250 4995
2 1 0 5 0 7 50 -1 -1 0.000 0 0 -1 0 0 2
	 2250 2295 7380 2295
2 1 0 5 0 7 50 0 -1 0.000 0 0 -1 0 0 2
	 5580 3105 6975 3105
2 1 0 5 0 7 50 0 -1 0.000 0 0 -1 0 0 2
	 6975 3375 7380 3375
2 1 0 5 0 7 50 0 -1 0.000 0 0 -1 0 0 2
	 4230 3375 5580 3375
2 1 0 5 0 7 50 0 -1 0.000 0 0 -1 0 0 2
	 2835 3105 4230 3105
2 1 0 5 0 7 50 -1 -1 0.000 0 0 -1 0 0 2
	 2250 3375 2835 3375
2 1 0 5 0 7 50 -1 -1 0.000 0 0 -1 0 0 2
	 2250 4860 2835 4860
2 1 0 5 0 7 50 -1 -1 0.000 0 0 -1 0 0 2
	 2835 4275 5175 4275
2 1 0 5 0 7 50 -1 -1 0.000 0 0 -1 0 0 2
	 5220 4860 5580 4860
2 1 0 5 0 7 50 -1 -1 0.000 0 0 -1 0 0 2
	 5580 4590 6300 4590
2 1 0 5 0 7 50 -1 -1 0.000 0 0 -1 0 0 2
	 6300 4275 7200 4275
2 1 0 5 0 7 50 0 -1 0.000 0 0 -1 0 0 2
	 7200 4860 7380 4860
4 0 0 50 -1 4 12 0.0000 0 135 210 2745 2520 10\001
4 0 0 50 -1 4 12 0.0000 0 135 210 4140 2520 30\001
4 0 0 50 -1 4 12 0.0000 0 135 210 6885 2520 70\001
4 0 0 50 -1 4 12 0.0000 0 135 210 5490 2520 50\001
4 0 0 50 -1 4 12 0.0000 0 135 210 2745 5085 10\001
4 0 0 50 -1 4 12 0.0000 0 135 210 4140 5085 30\001
4 0 0 50 -1 4 12 0.0000 0 135 210 5490 5085 50\001
4 0 0 50 -1 4 12 0.0000 0 135 210 6885 5085 70\001
4 0 0 50 -1 4 12 0.0000 0 135 390 1620 4455 MS2\001
4 0 0 50 -1 4 12 0.0000 0 135 390 1620 3285 MS1\001
4 0 0 50 -1 4 12 0.0000 0 135 390 1620 4770 MS1\001
