%!PS-Adobe-3.0 EPSF-3.0 
%%BoundingBox: 0 0 729 473
%%Pages: 0
%%Creator: Sun Microsystems, Inc.
%%Title: none
%%CreationDate: none
%%LanguageLevel: 2
%%EndComments
%%BeginProlog
%%BeginResource: SDRes
/b4_inc_state save def
/dict_count countdictstack def
/op_count count 1 sub def
userdict begin
0 setgray 0 setlinecap 1 setlinewidth 0 setlinejoin 10 setmiterlimit[] 0 setdash newpath
/languagelevel where {pop languagelevel 1 ne {false setstrokeadjust false setoverprint} if} if
/bdef {bind def} bind def
/c {setrgbcolor} bdef
/l {neg lineto} bdef
/rl {neg rlineto} bdef
/cl {currentlinewidth currentdash currentlinecap 2 setlinecap} bdef
/lc {setlinecap} bdef
/lw {setlinewidth} bdef
/ld {setdash} bdef
/m {neg moveto} bdef
/ct {6 2 roll neg 6 2 roll neg 6 2 roll neg curveto} bdef
/r {rotate} bdef
/t {neg translate} bdef
/s {scale} bdef
/sw {show} bdef
/gs {gsave} bdef
/gr {grestore} bdef
/f {findfont dup length dict begin
{1 index /FID ne {def} {pop pop} ifelse} forall /Encoding ISOLatin1Encoding def
currentdict end /NFont exch definefont pop /NFont findfont} bdef
/p {closepath} bdef
/sf {scalefont setfont} bdef
/ef {eofill}bdef
/pc {closepath stroke}bdef
/ps {stroke}bdef
/pum {matrix currentmatrix}bdef
/pom {setmatrix}bdef
/bs {/aString exch def /nXOfs exch def /nWidth exch def currentpoint nXOfs 0 rmoveto pum nWidth aString stringwidth pop div 1 scale aString show pom moveto} bdef
%%EndResource
%%EndProlog
%%BeginSetup
%%EndSetup
%%Page: 1 1
%%BeginPageSetup
%%EndPageSetup
pum
0.28365 0.28323 s 
0 -1670 t 
gs
-63.5 -63.5 t 
63.5 63.5 m 2633.4 63.5 l 2633.4 1733.4 l 63.5 1733.4 l 63.5 63.5 l
eoclip newpath
gs
92.9 97.4 m 2583.1 97.4 l 2583.1 1710.3 l 92.9 1710.3 l 92.9 97.4 l
eoclip newpath
gs
92.89253 97.38792 t 
0 0 m 2490.00002 0 l 2490.00002 1612.70003 l 0 1612.70003 l 0 0 l eoclip newpath
gs
gr
0.003 0.003 0.003 c 217.98249 1500.61393 m  2081.13286 1500.61393 l  ps
217.98249 1355.13197 m  2081.13286 1355.13197 l  ps
217.98249 1209.65001 m  2081.13286 1209.65001 l  ps
217.98249 1064.16805 m  2081.13286 1064.16805 l  ps
217.98249 918.68608 m  2081.13286 918.68608 l  ps
217.98249 773.20412 m  2081.13286 773.20412 l  ps
217.98249 627.72216 m  2081.13286 627.72216 l  ps
217.98249 482.2402 m  2081.13286 482.2402 l  ps
217.98249 336.75824 m  2081.13286 336.75824 l  ps
217.98249 191.27628 m  2081.13286 191.27628 l  ps
217.98249 45.69433 m  2081.13286 45.69433 l  ps
217.98249 1500.61393 m  2081.13286 1500.61393 l  ps
217.98249 1500.61393 m  2081.13286 1500.61393 l  ps
217.98249 1515.61207 m  217.98249 1500.61393 l  ps
gs
pum
383.36921 1524.41098 t 
0 58.49274 m  17.49859 12.19848 l  24.09806 12.19848 l  43.09653 58.49274 l 
36.0971 58.49274 l  30.69753 44.39449 l  11.29909 44.39449 l  6.29949 58.49274 l 
p
13.09894 39.4951 m  28.79768 39.4951 l  23.99807 26.5967 l  22.59818 22.69718 21.39828 19.59757 20.79832 16.99789 ct 
20.09838 19.99752 19.29845 22.89716 18.19853 25.89678 ct p ef
pom
pum
383.36921 1524.41098 t 
0 58.49274 m  17.49859 12.19848 l  24.09806 12.19848 l  43.09653 58.49274 l 
36.0971 58.49274 l  30.69753 44.39449 l  11.29909 44.39449 l  6.29949 58.49274 l 
p
13.09894 39.4951 m  28.79768 39.4951 l  23.99807 26.5967 l  22.59818 22.69718 21.39828 19.59757 20.79832 16.99789 ct 
20.09838 19.99752 19.29845 22.89716 18.19853 25.89678 ct p ef
pom
gr
590.55257 1515.61207 m  590.55257 1500.61393 l  ps
gs
pum
756.43924 1524.41098 t 
4.59963 58.49274 m  4.59963 12.19848 l  21.89824 12.19848 l  25.49795 12.19848 28.39771 12.59843 30.39755 13.49832 ct 
32.59738 14.4982 34.29724 15.99801 35.49714 17.89778 ct 36.59706 19.79754 37.297 21.89728 37.297 23.99702 ct 
37.297 25.89678 36.79704 27.89654 35.69713 29.49634 ct 34.59722 31.29611 32.99734 32.79593 30.79752 33.7958 ct 
33.69729 34.59571 35.69713 35.99553 37.297 38.09527 ct 38.79688 39.99504 39.49682 42.29475 39.49682 44.99442 ct 
39.49682 47.19414 39.09686 49.1939 38.19693 51.09366 ct 37.297 52.89344 36.0971 54.29326 34.7972 55.39313 ct 
33.39731 56.393 31.69745 57.1929 29.69761 57.69284 ct 27.69777 58.19278 25.09798 58.49274 22.2982 58.49274 ct 
p
10.69914 31.59608 m  20.79832 31.59608 l  23.49811 31.59608 25.39796 31.49609 26.59786 31.09614 ct 
28.09774 30.5962 29.29764 29.7963 30.09758 28.79642 ct 30.79752 27.69656 31.19749 26.29673 31.19749 24.79692 ct 
31.19749 23.19712 30.99751 21.79729 30.19757 20.59744 ct 29.39763 19.49758 28.39771 18.69768 26.99783 18.29773 ct 
25.69793 17.89778 23.29812 17.6978 19.99839 17.6978 ct 10.69914 17.6978 l 
p
10.69914 52.89344 m  22.2982 52.89344 l  24.19805 52.89344 25.69793 52.89344 26.39787 52.79345 ct 
27.89775 52.49349 28.99767 51.99355 29.89759 51.49361 ct 30.99751 50.89368 31.69745 50.09378 32.2974 48.89393 ct 
32.89735 47.79407 33.19733 46.49423 33.19733 44.99442 ct 33.19733 43.19464 32.79736 41.79481 31.89743 40.49497 ct 
30.99751 39.19514 29.7976 38.29525 28.19773 37.79531 ct 26.59786 37.29537 24.39804 36.99541 21.39828 36.99541 ct 
10.69914 36.99541 l  p ef
pom
pum
756.43924 1524.41098 t 
4.59963 58.49274 m  4.59963 12.19848 l  21.89824 12.19848 l  25.49795 12.19848 28.39771 12.59843 30.39755 13.49832 ct 
32.59738 14.4982 34.29724 15.99801 35.49714 17.89778 ct 36.59706 19.79754 37.297 21.89728 37.297 23.99702 ct 
37.297 25.89678 36.79704 27.89654 35.69713 29.49634 ct 34.59722 31.29611 32.99734 32.79593 30.79752 33.7958 ct 
33.69729 34.59571 35.69713 35.99553 37.297 38.09527 ct 38.79688 39.99504 39.49682 42.29475 39.49682 44.99442 ct 
39.49682 47.19414 39.09686 49.1939 38.19693 51.09366 ct 37.297 52.89344 36.0971 54.29326 34.7972 55.39313 ct 
33.39731 56.393 31.69745 57.1929 29.69761 57.69284 ct 27.69777 58.19278 25.09798 58.49274 22.2982 58.49274 ct 
p
10.69914 31.59608 m  20.79832 31.59608 l  23.49811 31.59608 25.39796 31.49609 26.59786 31.09614 ct 
28.09774 30.5962 29.29764 29.7963 30.09758 28.79642 ct 30.79752 27.69656 31.19749 26.29673 31.19749 24.79692 ct 
31.19749 23.19712 30.99751 21.79729 30.19757 20.59744 ct 29.39763 19.49758 28.39771 18.69768 26.99783 18.29773 ct 
25.69793 17.89778 23.29812 17.6978 19.99839 17.6978 ct 10.69914 17.6978 l 
p
10.69914 52.89344 m  22.2982 52.89344 l  24.19805 52.89344 25.69793 52.89344 26.39787 52.79345 ct 
27.89775 52.49349 28.99767 51.99355 29.89759 51.49361 ct 30.99751 50.89368 31.69745 50.09378 32.2974 48.89393 ct 
32.89735 47.79407 33.19733 46.49423 33.19733 44.99442 ct 33.19733 43.19464 32.79736 41.79481 31.89743 40.49497 ct 
30.99751 39.19514 29.7976 38.29525 28.19773 37.79531 ct 26.59786 37.29537 24.39804 36.99541 21.39828 36.99541 ct 
10.69914 36.99541 l  p ef
pom
gr
963.22264 1515.61207 m  963.22264 1500.61393 l  ps
gs
pum
1126.8095 1524.41098 t 
37.79696 42.19476 m  43.99646 43.69458 l  42.69657 48.79394 40.39675 52.69346 36.99702 55.19315 ct 
33.69729 57.79283 29.69761 59.29264 24.898 59.29264 ct 19.7984 59.29264 15.79873 58.19278 12.69898 56.19303 ct 
9.49923 54.09329 7.19942 51.19365 5.49955 47.39412 ct 3.99967 43.4946 3.09975 39.39511 3.09975 34.99566 ct 
3.09975 30.19625 4.09967 25.89678 5.89952 22.29723 ct 7.69938 18.79766 10.29917 16.098 13.79889 14.19823 ct 
17.09862 12.39846 20.89832 11.29859 24.898 11.29859 ct 29.49763 11.29859 33.39731 12.59843 36.59706 14.89815 ct 
39.69681 17.29785 41.89663 20.59744 43.19653 24.89691 ct 37.19701 26.29673 l 
36.0971 22.89716 34.59722 20.49745 32.49739 18.89765 ct 30.39755 17.39784 27.89775 16.59794 24.798 16.59794 ct 
21.29828 16.59794 18.29853 17.49783 15.79873 19.19761 ct 13.49891 20.8974 11.79905 23.19712 10.79913 25.99677 ct 
9.8992 28.89641 9.39924 31.89604 9.39924 34.99566 ct 9.39924 38.79518 9.99919 42.29475 11.1991 45.19439 ct 
12.19902 48.09403 13.99887 50.29376 16.49867 51.79357 ct 18.89848 53.1934 21.49827 53.9933 24.39804 53.9933 ct 
27.69777 53.9933 30.69753 52.89344 32.99734 50.99367 ct 35.39715 48.99392 l 
36.99702 46.09428 l  p ef
pom
pum
1126.8095 1524.41098 t 
37.79696 42.19476 m  43.99646 43.69458 l  42.69657 48.79394 40.39675 52.69346 36.99702 55.19315 ct 
33.69729 57.79283 29.69761 59.29264 24.898 59.29264 ct 19.7984 59.29264 15.79873 58.19278 12.69898 56.19303 ct 
9.49923 54.09329 7.19942 51.19365 5.49955 47.39412 ct 3.99967 43.4946 3.09975 39.39511 3.09975 34.99566 ct 
3.09975 30.19625 4.09967 25.89678 5.89952 22.29723 ct 7.69938 18.79766 10.29917 16.098 13.79889 14.19823 ct 
17.09862 12.39846 20.89832 11.29859 24.898 11.29859 ct 29.49763 11.29859 33.39731 12.59843 36.59706 14.89815 ct 
39.69681 17.29785 41.89663 20.59744 43.19653 24.89691 ct 37.19701 26.29673 l 
36.0971 22.89716 34.59722 20.49745 32.49739 18.89765 ct 30.39755 17.39784 27.89775 16.59794 24.798 16.59794 ct 
21.29828 16.59794 18.29853 17.49783 15.79873 19.19761 ct 13.49891 20.8974 11.79905 23.19712 10.79913 25.99677 ct 
9.8992 28.89641 9.39924 31.89604 9.39924 34.99566 ct 9.39924 38.79518 9.99919 42.29475 11.1991 45.19439 ct 
12.19902 48.09403 13.99887 50.29376 16.49867 51.79357 ct 18.89848 53.1934 21.49827 53.9933 24.39804 53.9933 ct 
27.69777 53.9933 30.69753 52.89344 32.99734 50.99367 ct 35.39715 48.99392 l 
36.99702 46.09428 l  p ef
pom
gr
1335.89271 1515.61207 m  1335.89271 1500.61393 l  ps
gs
pum
1499.87954 1524.41098 t 
4.8996 58.49274 m  4.8996 12.19848 l  20.79832 12.19848 l  24.39804 12.19848 27.09782 12.39846 28.99767 12.8984 ct 
31.69745 13.39833 33.89727 14.4982 35.89711 16.098 ct 38.19693 18.19774 40.09677 20.8974 41.29668 24.09701 ct 
42.49658 27.19662 43.09653 30.99615 43.09653 35.09564 ct 43.09653 38.59521 42.69657 41.69483 41.79664 44.39449 ct 
40.9967 47.09416 39.99678 49.29388 38.69689 51.09366 ct 37.39699 52.89344 35.9971 54.29326 34.39723 55.19315 ct 
32.99734 56.29302 31.0975 57.09292 28.99767 57.59285 ct 26.79784 58.09279 24.39804 58.49274 21.49827 58.49274 ct 
p
10.89912 52.89344 m  20.89832 52.89344 l  23.89808 52.89344 26.29788 52.69346 27.99775 52.09354 ct 
29.7976 51.49361 31.19749 50.69371 32.2974 49.69383 ct 33.69729 48.29401 34.69721 46.29425 35.59714 43.89455 ct 
36.39707 41.39486 36.79704 38.49522 36.79704 34.99566 ct 36.79704 30.09626 35.9971 26.39672 34.39723 23.89703 ct 
32.79736 21.09738 30.79752 19.49758 28.5977 18.59769 ct 26.99783 17.89778 24.39804 17.6978 20.79832 17.6978 ct 
10.89912 17.6978 l  p ef
pom
pum
1499.87954 1524.41098 t 
4.8996 58.49274 m  4.8996 12.19848 l  20.79832 12.19848 l  24.39804 12.19848 27.09782 12.39846 28.99767 12.8984 ct 
31.69745 13.39833 33.89727 14.4982 35.89711 16.098 ct 38.19693 18.19774 40.09677 20.8974 41.29668 24.09701 ct 
42.49658 27.19662 43.09653 30.99615 43.09653 35.09564 ct 43.09653 38.59521 42.69657 41.69483 41.79664 44.39449 ct 
40.9967 47.09416 39.99678 49.29388 38.69689 51.09366 ct 37.39699 52.89344 35.9971 54.29326 34.39723 55.19315 ct 
32.99734 56.29302 31.0975 57.09292 28.99767 57.59285 ct 26.79784 58.09279 24.39804 58.49274 21.49827 58.49274 ct 
p
10.89912 52.89344 m  20.89832 52.89344 l  23.89808 52.89344 26.29788 52.69346 27.99775 52.09354 ct 
29.7976 51.49361 31.19749 50.69371 32.2974 49.69383 ct 33.69729 48.29401 34.69721 46.29425 35.59714 43.89455 ct 
36.39707 41.39486 36.79704 38.49522 36.79704 34.99566 ct 36.79704 30.09626 35.9971 26.39672 34.39723 23.89703 ct 
32.79736 21.09738 30.79752 19.49758 28.5977 18.59769 ct 26.99783 17.89778 24.39804 17.6978 20.79832 17.6978 ct 
10.89912 17.6978 l  p ef
pom
gr
1708.56278 1515.61207 m  1708.56278 1500.61393 l  ps
gs
pum
1872.94958 1524.41098 t 
4.99959 58.49274 m  4.99959 12.19848 l  38.4969 12.19848 l  38.4969 17.6978 l 
11.0991 17.6978 l  11.0991 31.69606 l  36.59706 31.69606 l  36.59706 37.19538 l 
11.0991 37.19538 l  11.0991 52.89344 l  39.49682 52.89344 l  39.49682 58.49274 l 
p ef
pom
pum
1872.94958 1524.41098 t 
4.99959 58.49274 m  4.99959 12.19848 l  38.4969 12.19848 l  38.4969 17.6978 l 
11.0991 17.6978 l  11.0991 31.69606 l  36.59706 31.69606 l  36.59706 37.19538 l 
11.0991 37.19538 l  11.0991 52.89344 l  39.49682 52.89344 l  39.49682 58.49274 l 
p ef
pom
gr
0.601 0.601 0.800 c 311.07501 45.79432 m  497.36005 45.79432 l  497.36005 694.11393 l 
311.07501 694.11393 l  311.07501 45.79432 l  p ef
0.003 0.003 0.003 c 404.16754 694.11393 m  311.07501 694.11393 l  311.07501 45.79432 l 
497.36005 45.79432 l  497.36005 694.11393 l  404.16754 694.11393 l 
ps
0.601 0.601 0.800 c 683.64509 45.79432 m  869.93013 45.79432 l  869.93013 946.68261 l 
683.64509 946.68261 l  683.64509 45.79432 l  p ef
0.003 0.003 0.003 c 776.73761 946.68261 m  683.64509 946.68261 l  683.64509 45.79432 l 
869.93013 45.79432 l  869.93013 946.68261 l  776.73761 946.68261 l 
ps
0.601 0.601 0.800 c 1056.21517 45.79432 m  1242.50021 45.79432 l  1242.50021 231.97123 l 
1056.21517 231.97123 l  1056.21517 45.79432 l  p ef
0.003 0.003 0.003 c 1149.30769 231.97123 m  1056.21517 231.97123 l  1056.21517 45.79432 l 
1242.50021 45.79432 l  1242.50021 231.97123 l  1149.30769 231.97123 l 
ps
0.601 0.601 0.800 c 1428.78525 45.79432 m  1615.07029 45.79432 l  1615.07029 340.25781 l 
1428.78525 340.25781 l  1428.78525 45.79432 l  p ef
0.003 0.003 0.003 c 1521.87777 340.25781 m  1428.78525 340.25781 l  1428.78525 45.79432 l 
1615.07029 45.79432 l  1615.07029 340.25781 l  1521.87777 340.25781 l 
ps
0.601 0.601 0.800 c 1801.35533 45.79432 m  1987.64036 45.79432 l  1987.64036 205.07457 l 
1801.35533 205.07457 l  1801.35533 45.79432 l  p ef
0.003 0.003 0.003 c 1894.44785 205.07457 m  1801.35533 205.07457 l  1801.35533 45.79432 l 
1987.64036 45.79432 l  1987.64036 205.07457 l  1894.44785 205.07457 l 
ps
0.800 0.800 1.000 c 311.07501 694.11393 m  497.36005 694.11393 l  497.36005 931.38451 l 
311.07501 931.38451 l  311.07501 694.11393 l  p ef
0.003 0.003 0.003 c 404.16754 931.38451 m  311.07501 931.38451 l  311.07501 694.11393 l 
497.36005 694.11393 l  497.36005 931.38451 l  404.16754 931.38451 l 
ps
0.800 0.800 1.000 c 683.64509 946.68261 m  869.93013 946.68261 l  869.93013 1093.66439 l 
683.64509 1093.66439 l  683.64509 946.68261 l  p ef
0.003 0.003 0.003 c 776.73761 1093.66439 m  683.64509 1093.66439 l  683.64509 946.68261 l 
869.93013 946.68261 l  869.93013 1093.66439 l  776.73761 1093.66439 l 
ps
0.800 0.800 1.000 c 1056.21517 231.97123 m  1242.50021 231.97123 l 
1242.50021 594.52628 l  1056.21517 594.52628 l  1056.21517 231.97123 l 
p ef
0.003 0.003 0.003 c 1149.30769 594.52628 m  1056.21517 594.52628 l  1056.21517 231.97123 l 
1242.50021 231.97123 l  1242.50021 594.52628 l  1149.30769 594.52628 l 
ps
0.800 0.800 1.000 c 1428.78525 340.25781 m  1615.07029 340.25781 l 
1615.07029 679.51574 l  1428.78525 679.51574 l  1428.78525 340.25781 l 
p ef
0.003 0.003 0.003 c 1521.87777 679.51574 m  1428.78525 679.51574 l  1428.78525 340.25781 l 
1615.07029 340.25781 l  1615.07029 679.51574 l  1521.87777 679.51574 l 
ps
0.800 0.800 1.000 c 1801.35533 205.07457 m  1987.64036 205.07457 l 
1987.64036 569.92933 l  1801.35533 569.92933 l  1801.35533 205.07457 l 
p ef
0.003 0.003 0.003 c 1894.44785 569.92933 m  1801.35533 569.92933 l  1801.35533 205.07457 l 
1987.64036 205.07457 l  1987.64036 569.92933 l  1894.44785 569.92933 l 
ps
0.402 0.402 0.601 c 311.07501 931.38451 m  497.36005 931.38451 l  497.36005 1500.61393 l 
311.07501 1500.61393 l  311.07501 931.38451 l  p ef
0.003 0.003 0.003 c 404.16754 1500.61393 m  311.07501 1500.61393 l  311.07501 931.38451 l 
497.36005 931.38451 l  497.36005 1500.61393 l  404.16754 1500.61393 l 
ps
0.402 0.402 0.601 c 683.64509 1093.66439 m  869.93013 1093.66439 l 
869.93013 1500.61393 l  683.64509 1500.61393 l  683.64509 1093.66439 l 
p ef
0.003 0.003 0.003 c 776.73761 1500.61393 m  683.64509 1500.61393 l  683.64509 1093.66439 l 
869.93013 1093.66439 l  869.93013 1500.61393 l  776.73761 1500.61393 l 
ps
0.402 0.402 0.601 c 1056.21517 594.52628 m  1242.50021 594.52628 l 
1242.50021 1500.61393 l  1056.21517 1500.61393 l  1056.21517 594.52628 l 
p ef
0.003 0.003 0.003 c 1149.30769 1500.61393 m  1056.21517 1500.61393 l  1056.21517 594.52628 l 
1242.50021 594.52628 l  1242.50021 1500.61393 l  1149.30769 1500.61393 l 
ps
0.402 0.402 0.601 c 1428.78525 679.51574 m  1615.07029 679.51574 l 
1615.07029 1500.61393 l  1428.78525 1500.61393 l  1428.78525 679.51574 l 
p ef
0.003 0.003 0.003 c 1521.87777 1500.61393 m  1428.78525 1500.61393 l  1428.78525 679.51574 l 
1615.07029 679.51574 l  1615.07029 1500.61393 l  1521.87777 1500.61393 l 
ps
0.402 0.402 0.601 c 1801.35533 569.92933 m  1987.64036 569.92933 l 
1987.64036 1500.61393 l  1801.35533 1500.61393 l  1801.35533 569.92933 l 
p ef
0.003 0.003 0.003 c 1894.44785 1500.61393 m  1801.35533 1500.61393 l  1801.35533 569.92933 l 
1987.64036 569.92933 l  1987.64036 1500.61393 l  1894.44785 1500.61393 l 
ps
217.98249 1500.61393 m  217.98249 45.79432 l  ps
217.98249 1500.61393 m  217.98249 45.79432 l  ps
202.98369 1500.61393 m  217.98249 1500.61393 l  ps
gs
pum
100.29194 1463.51853 t 
2.49979 35.59558 m  2.49979 30.19625 3.19974 25.7968 4.19966 22.39722 ct 
5.39956 19.09763 7.09942 16.49795 9.29925 14.69817 ct 11.39908 12.8984 14.29885 11.99851 17.69857 11.99851 ct 
20.09838 11.99851 22.2982 12.49845 24.09806 13.49832 ct 25.99791 14.39821 27.59778 15.99801 28.79768 17.79779 ct 
30.09758 19.69755 30.99751 21.89728 31.69745 24.59695 ct 32.39739 27.29661 32.79736 31.09614 32.79736 35.59558 ct 
32.79736 40.99491 32.09742 45.39437 31.0975 48.79394 ct 29.89759 51.99355 28.19773 54.59323 25.99791 56.393 ct 
23.89808 58.29277 20.99831 59.29264 17.69857 59.29264 ct 13.09894 59.29264 9.59922 57.59285 7.19942 54.49324 ct 
4.09967 50.59372 l  2.49979 44.2945 l  p
8.29933 35.59558 m  8.29933 43.19464 9.29925 48.29401 11.0991 50.69371 ct 
12.89896 53.29339 15.09878 54.49324 17.69857 54.49324 ct 20.19837 54.49324 22.3982 53.29339 24.19805 50.69371 ct 
25.99791 48.29401 26.79784 43.19464 26.79784 35.59558 ct 26.79784 27.99652 25.99791 22.89716 24.19805 20.49745 ct 
22.3982 17.89778 20.19837 16.69792 17.49859 16.69792 ct 14.8988 16.69792 12.89896 17.79779 11.29909 19.99752 ct 
9.39924 22.79717 l  8.29933 27.99652 l  p ef
pom
pum
135.88908 1463.51853 t 
3.6997 23.29711 m  3.6997 19.99752 4.49963 17.09787 6.1995 14.79816 ct 
7.79937 12.49845 10.19918 11.29859 13.39892 11.29859 ct 16.19869 11.29859 18.69849 12.49845 20.59834 14.4982 ct 
22.3982 16.59794 23.49811 19.59757 23.49811 23.59707 ct 23.49811 27.49659 22.3982 30.5962 20.49835 32.59595 ct 
18.5985 34.79568 16.19869 35.89554 13.39892 35.89554 ct 10.69914 35.89554 8.29933 34.79568 6.39948 32.79593 ct 
4.59963 30.5962 l  3.6997 27.49659 l  p
13.49891 15.2981 m  12.09902 15.2981 10.89912 15.79804 9.99919 17.09787 ct 
9.09926 18.29773 8.5993 20.59744 8.5993 23.89703 ct 8.5993 26.79667 9.09926 28.89641 9.99919 30.09626 ct 
10.89912 31.29611 12.09902 31.89604 13.49891 31.89604 ct 14.8988 31.89604 16.0987 31.29611 16.99863 30.09626 ct 
17.99855 28.89641 18.39852 26.69668 18.39852 23.49708 ct 18.39852 20.39747 17.99855 18.29773 16.99863 17.09787 ct 
16.0987 15.79804 l  14.8988 15.2981 l  p
13.49891 60.19253 m  38.79688 11.29859 l  43.4965 11.29859 l  18.29853 60.19253 l 
p
33.4973 47.59409 m  33.4973 44.2945 34.29724 41.39486 35.9971 39.09515 ct 
37.69697 36.79543 40.09677 35.59558 43.19653 35.59558 ct 46.19628 35.59558 48.4961 36.59546 50.49594 38.79518 ct 
52.39579 40.89492 53.29571 43.89455 53.29571 47.89406 ct 53.29571 51.79357 52.39579 54.89319 50.49594 56.89294 ct 
48.4961 59.09267 46.19628 60.19253 43.39651 60.19253 ct 40.49674 60.19253 38.19693 59.09267 36.39707 56.89294 ct 
34.39723 54.89319 l  33.4973 51.79357 l  p
43.4965 39.59509 m  42.09661 39.59509 40.79672 40.09502 39.89679 41.39486 ct 
38.99686 42.59471 38.4969 44.89443 38.4969 48.09403 ct 38.4969 51.09366 38.99686 53.1934 39.89679 54.29326 ct 
40.89671 55.5931 42.09661 56.19303 43.39651 56.19303 ct 44.89639 56.19303 46.09629 55.5931 46.99622 54.29326 ct 
47.89615 53.1934 48.39611 50.99367 48.39611 47.59409 ct 48.39611 44.69445 47.89615 42.59471 46.99622 41.39486 ct 
46.09629 40.09502 l  44.89639 39.59509 l  p ef
pom
gr
202.98369 1355.13197 m  217.98249 1355.13197 l  ps
gs
pum
63.19492 1318.03657 t 
23.99807 58.49274 m  18.29853 58.49274 l  18.29853 22.19724 l  16.89864 23.59707 15.09878 24.89691 12.89896 26.19675 ct 
10.69914 27.49659 8.6993 28.39647 6.89944 28.9964 ct 6.89944 23.59707 l 
10.19918 21.99727 12.89896 20.19749 15.19877 18.19774 ct 17.69857 16.098 19.29845 13.99826 20.19837 11.99851 ct 
23.99807 11.99851 l  p ef
pom
pum
98.79206 1318.03657 t 
2.49979 35.59558 m  2.49979 30.19625 3.19974 25.7968 4.19966 22.39722 ct 
5.39956 19.09763 7.09942 16.49795 9.29925 14.69817 ct 11.39908 12.8984 14.29885 11.99851 17.69857 11.99851 ct 
20.09838 11.99851 22.2982 12.49845 24.09806 13.49832 ct 25.99791 14.39821 27.59778 15.99801 28.79768 17.79779 ct 
30.09758 19.69755 30.99751 21.89728 31.69745 24.59695 ct 32.39739 27.29661 32.79736 31.09614 32.79736 35.59558 ct 
32.79736 40.99491 32.09742 45.39437 31.0975 48.79394 ct 29.89759 51.99355 28.19773 54.59323 25.99791 56.393 ct 
23.89808 58.29277 20.99831 59.29264 17.69857 59.29264 ct 13.09894 59.29264 9.59922 57.59285 7.19942 54.49324 ct 
4.09967 50.59372 l  2.49979 44.2945 l  p
8.29933 35.59558 m  8.29933 43.19464 9.29925 48.29401 11.0991 50.69371 ct 
12.89896 53.29339 15.09878 54.49324 17.69857 54.49324 ct 20.19837 54.49324 22.3982 53.29339 24.19805 50.69371 ct 
25.99791 48.29401 26.79784 43.19464 26.79784 35.59558 ct 26.79784 27.99652 25.99791 22.89716 24.19805 20.49745 ct 
22.3982 17.89778 20.19837 16.69792 17.49859 16.69792 ct 14.8988 16.69792 12.89896 17.79779 11.29909 19.99752 ct 
9.39924 22.79717 l  8.29933 27.99652 l  p ef
pom
pum
134.28921 1318.03657 t 
3.6997 23.29711 m  3.6997 19.99752 4.49963 17.09787 6.1995 14.79816 ct 
7.79937 12.49845 10.19918 11.29859 13.39892 11.29859 ct 16.19869 11.29859 18.69849 12.49845 20.59834 14.4982 ct 
22.3982 16.59794 23.49811 19.59757 23.49811 23.59707 ct 23.49811 27.49659 22.3982 30.5962 20.49835 32.59595 ct 
18.5985 34.79568 16.19869 35.89554 13.39892 35.89554 ct 10.69914 35.89554 8.29933 34.79568 6.39948 32.79593 ct 
4.59963 30.5962 l  3.6997 27.49659 l  p
13.49891 15.2981 m  12.09902 15.2981 10.89912 15.79804 9.99919 17.09787 ct 
9.09926 18.29773 8.5993 20.59744 8.5993 23.89703 ct 8.5993 26.79667 9.09926 28.89641 9.99919 30.09626 ct 
10.89912 31.29611 12.09902 31.89604 13.49891 31.89604 ct 14.8988 31.89604 16.0987 31.29611 16.99863 30.09626 ct 
17.99855 28.89641 18.39852 26.69668 18.39852 23.49708 ct 18.39852 20.39747 17.99855 18.29773 16.99863 17.09787 ct 
16.0987 15.79804 l  14.8988 15.2981 l  p
13.49891 60.19253 m  38.79688 11.29859 l  43.4965 11.29859 l  18.29853 60.19253 l 
p
33.4973 47.59409 m  33.4973 44.2945 34.29724 41.39486 35.9971 39.09515 ct 
37.69697 36.79543 40.09677 35.59558 43.19653 35.59558 ct 46.19628 35.59558 48.4961 36.59546 50.49594 38.79518 ct 
52.39579 40.89492 53.29571 43.89455 53.29571 47.89406 ct 53.29571 51.79357 52.39579 54.89319 50.49594 56.89294 ct 
48.4961 59.09267 46.19628 60.19253 43.39651 60.19253 ct 40.49674 60.19253 38.19693 59.09267 36.39707 56.89294 ct 
34.39723 54.89319 l  33.4973 51.79357 l  p
43.4965 39.59509 m  42.09661 39.59509 40.79672 40.09502 39.89679 41.39486 ct 
38.99686 42.59471 38.4969 44.89443 38.4969 48.09403 ct 38.4969 51.09366 38.99686 53.1934 39.89679 54.29326 ct 
40.89671 55.5931 42.09661 56.19303 43.39651 56.19303 ct 44.89639 56.19303 46.09629 55.5931 46.99622 54.29326 ct 
47.89615 53.1934 48.39611 50.99367 48.39611 47.59409 ct 48.39611 44.69445 47.89615 42.59471 46.99622 41.39486 ct 
46.09629 40.09502 l  44.89639 39.59509 l  p ef
pom
gr
202.98369 1209.65001 m  217.98249 1209.65001 l  ps
gs
pum
63.19492 1172.45462 t 
32.39739 52.89344 m  32.39739 58.49274 l  1.89984 58.49274 l  1.79985 57.09292 1.99983 55.79308 2.49979 54.49324 ct 
3.29973 52.3935 4.49963 50.29376 6.29949 48.29401 ct 7.99935 46.29425 10.39916 43.99454 13.5989 41.29487 ct 
18.69849 37.19538 21.99823 33.89579 23.89808 31.49609 ct 25.69793 29.09639 26.59786 26.79667 26.59786 24.79692 ct 
26.59786 22.39722 25.69793 20.49745 24.09806 18.89765 ct 22.3982 17.39784 20.39836 16.69792 17.79857 16.69792 ct 
15.09878 16.69792 12.89896 17.49783 11.1991 19.19761 ct 9.59922 20.79742 8.6993 23.09713 8.6993 25.89678 ct 
2.89976 25.39685 l  3.29973 20.99739 4.8996 17.6978 7.3994 15.49807 ct 
9.99919 13.09837 13.49891 11.99851 17.89856 11.99851 ct 22.2982 11.99851 25.89792 13.29835 28.49771 15.69805 ct 
31.0975 18.19774 32.39739 21.09738 32.39739 24.79692 ct 32.39739 26.69668 31.99743 28.49646 31.19749 30.29624 ct 
30.39755 32.09602 29.09766 33.89579 27.49779 35.89554 ct 25.69793 37.8953 22.79816 40.59496 18.69849 43.99454 ct 
15.29877 46.99417 13.09894 48.89393 12.09902 49.79382 ct 11.1991 50.89368 10.39916 51.89356 9.79921 52.89344 ct 
p ef
pom
pum
98.79206 1172.45462 t 
2.49979 35.59558 m  2.49979 30.19625 3.19974 25.7968 4.19966 22.39722 ct 
5.39956 19.09763 7.09942 16.49795 9.29925 14.69817 ct 11.39908 12.8984 14.29885 11.99851 17.69857 11.99851 ct 
20.09838 11.99851 22.2982 12.49845 24.09806 13.49832 ct 25.99791 14.39821 27.59778 15.99801 28.79768 17.79779 ct 
30.09758 19.69755 30.99751 21.89728 31.69745 24.59695 ct 32.39739 27.29661 32.79736 31.09614 32.79736 35.59558 ct 
32.79736 40.99491 32.09742 45.39437 31.0975 48.79394 ct 29.89759 51.99355 28.19773 54.59323 25.99791 56.393 ct 
23.89808 58.29277 20.99831 59.29264 17.69857 59.29264 ct 13.09894 59.29264 9.59922 57.59285 7.19942 54.49324 ct 
4.09967 50.59372 l  2.49979 44.2945 l  p
8.29933 35.59558 m  8.29933 43.19464 9.29925 48.29401 11.0991 50.69371 ct 
12.89896 53.29339 15.09878 54.49324 17.69857 54.49324 ct 20.19837 54.49324 22.3982 53.29339 24.19805 50.69371 ct 
25.99791 48.29401 26.79784 43.19464 26.79784 35.59558 ct 26.79784 27.99652 25.99791 22.89716 24.19805 20.49745 ct 
22.3982 17.89778 20.19837 16.69792 17.49859 16.69792 ct 14.8988 16.69792 12.89896 17.79779 11.29909 19.99752 ct 
9.39924 22.79717 l  8.29933 27.99652 l  p ef
pom
pum
134.28921 1172.45462 t 
3.6997 23.29711 m  3.6997 19.99752 4.49963 17.09787 6.1995 14.79816 ct 
7.79937 12.49845 10.19918 11.29859 13.39892 11.29859 ct 16.19869 11.29859 18.69849 12.49845 20.59834 14.4982 ct 
22.3982 16.59794 23.49811 19.59757 23.49811 23.59707 ct 23.49811 27.49659 22.3982 30.5962 20.49835 32.59595 ct 
18.5985 34.79568 16.19869 35.89554 13.39892 35.89554 ct 10.69914 35.89554 8.29933 34.79568 6.39948 32.79593 ct 
4.59963 30.5962 l  3.6997 27.49659 l  p
13.49891 15.2981 m  12.09902 15.2981 10.89912 15.79804 9.99919 17.09787 ct 
9.09926 18.29773 8.5993 20.59744 8.5993 23.89703 ct 8.5993 26.79667 9.09926 28.89641 9.99919 30.09626 ct 
10.89912 31.29611 12.09902 31.89604 13.49891 31.89604 ct 14.8988 31.89604 16.0987 31.29611 16.99863 30.09626 ct 
17.99855 28.89641 18.39852 26.69668 18.39852 23.49708 ct 18.39852 20.39747 17.99855 18.29773 16.99863 17.09787 ct 
16.0987 15.79804 l  14.8988 15.2981 l  p
13.49891 60.19253 m  38.79688 11.29859 l  43.4965 11.29859 l  18.29853 60.19253 l 
p
33.4973 47.59409 m  33.4973 44.2945 34.29724 41.39486 35.9971 39.09515 ct 
37.69697 36.79543 40.09677 35.59558 43.19653 35.59558 ct 46.19628 35.59558 48.4961 36.59546 50.49594 38.79518 ct 
52.39579 40.89492 53.29571 43.89455 53.29571 47.89406 ct 53.29571 51.79357 52.39579 54.89319 50.49594 56.89294 ct 
48.4961 59.09267 46.19628 60.19253 43.39651 60.19253 ct 40.49674 60.19253 38.19693 59.09267 36.39707 56.89294 ct 
34.39723 54.89319 l  33.4973 51.79357 l  p
43.4965 39.59509 m  42.09661 39.59509 40.79672 40.09502 39.89679 41.39486 ct 
38.99686 42.59471 38.4969 44.89443 38.4969 48.09403 ct 38.4969 51.09366 38.99686 53.1934 39.89679 54.29326 ct 
40.89671 55.5931 42.09661 56.19303 43.39651 56.19303 ct 44.89639 56.19303 46.09629 55.5931 46.99622 54.29326 ct 
47.89615 53.1934 48.39611 50.99367 48.39611 47.59409 ct 48.39611 44.69445 47.89615 42.59471 46.99622 41.39486 ct 
46.09629 40.09502 l  44.89639 39.59509 l  p ef
pom
gr
202.98369 1064.16805 m  217.98249 1064.16805 l  ps
gs
pum
63.19492 1026.97266 t 
2.69978 46.19427 m  8.19934 45.39437 l  8.89928 48.69396 9.99919 50.99367 11.59906 52.3935 ct 
13.09894 53.79333 15.09878 54.49324 17.3986 54.49324 ct 19.99839 54.49324 22.2982 53.59335 24.09806 51.79357 ct 
25.89792 49.9938 26.79784 47.59409 26.79784 44.89443 ct 26.79784 42.29475 25.99791 40.09502 24.19805 38.49522 ct 
22.59818 36.79543 20.49835 35.89554 17.79857 35.89554 ct 16.69865 35.89554 15.49875 36.09552 13.79889 36.49547 ct 
14.39884 31.49609 l  14.79881 31.59608 15.09878 31.59608 15.29877 31.59608 ct 
17.79857 31.59608 19.99839 30.99615 21.89824 29.69631 ct 23.89808 28.49646 24.798 26.5967 24.798 23.89703 ct 
24.798 21.79729 24.09806 20.0975 22.69817 18.69768 ct 21.29828 17.39784 19.49843 16.59794 17.29861 16.59794 ct 
14.8988 16.59794 13.09894 17.39784 11.69906 18.69768 ct 10.19918 20.0975 9.29925 22.19724 8.89928 24.9969 ct 
3.19974 23.99702 l  3.79969 20.0975 5.39956 17.29785 7.99935 15.09812 ct 
10.39916 12.99838 13.39892 11.99851 17.09862 11.99851 ct 19.59842 11.99851 21.89824 12.49845 24.09806 13.59831 ct 
26.19789 14.69817 27.89775 16.19799 28.89767 17.99776 ct 30.09758 19.79754 30.59754 21.89728 30.59754 23.99702 ct 
30.59754 25.99677 30.09758 27.89654 28.99767 29.39635 ct 27.99775 31.09614 26.29788 32.39598 24.19805 33.39585 ct 
26.99783 34.09577 29.09766 35.39561 30.59754 37.29537 ct 32.09742 39.19514 32.89735 41.79481 32.89735 44.79444 ct 
32.89735 48.79394 31.29748 52.29351 28.49771 54.99318 ct 25.49795 57.79283 21.79824 59.29264 17.29861 59.29264 ct 
13.29893 59.29264 9.8992 57.9928 7.19942 55.5931 ct 4.49963 53.1934 l 
2.89976 50.09378 l  p ef
pom
pum
98.79206 1026.97266 t 
2.49979 35.59558 m  2.49979 30.19625 3.19974 25.7968 4.19966 22.39722 ct 
5.39956 19.09763 7.09942 16.49795 9.29925 14.69817 ct 11.39908 12.8984 14.29885 11.99851 17.69857 11.99851 ct 
20.09838 11.99851 22.2982 12.49845 24.09806 13.49832 ct 25.99791 14.39821 27.59778 15.99801 28.79768 17.79779 ct 
30.09758 19.69755 30.99751 21.89728 31.69745 24.59695 ct 32.39739 27.29661 32.79736 31.09614 32.79736 35.59558 ct 
32.79736 40.99491 32.09742 45.39437 31.0975 48.79394 ct 29.89759 51.99355 28.19773 54.59323 25.99791 56.393 ct 
23.89808 58.29277 20.99831 59.29264 17.69857 59.29264 ct 13.09894 59.29264 9.59922 57.59285 7.19942 54.49324 ct 
4.09967 50.59372 l  2.49979 44.2945 l  p
8.29933 35.59558 m  8.29933 43.19464 9.29925 48.29401 11.0991 50.69371 ct 
12.89896 53.29339 15.09878 54.49324 17.69857 54.49324 ct 20.19837 54.49324 22.3982 53.29339 24.19805 50.69371 ct 
25.99791 48.29401 26.79784 43.19464 26.79784 35.59558 ct 26.79784 27.99652 25.99791 22.89716 24.19805 20.49745 ct 
22.3982 17.89778 20.19837 16.69792 17.49859 16.69792 ct 14.8988 16.69792 12.89896 17.79779 11.29909 19.99752 ct 
9.39924 22.79717 l  8.29933 27.99652 l  p ef
pom
pum
134.28921 1026.97266 t 
3.6997 23.29711 m  3.6997 19.99752 4.49963 17.09787 6.1995 14.79816 ct 
7.79937 12.49845 10.19918 11.29859 13.39892 11.29859 ct 16.19869 11.29859 18.69849 12.49845 20.59834 14.4982 ct 
22.3982 16.59794 23.49811 19.59757 23.49811 23.59707 ct 23.49811 27.49659 22.3982 30.5962 20.49835 32.59595 ct 
18.5985 34.79568 16.19869 35.89554 13.39892 35.89554 ct 10.69914 35.89554 8.29933 34.79568 6.39948 32.79593 ct 
4.59963 30.5962 l  3.6997 27.49659 l  p
13.49891 15.2981 m  12.09902 15.2981 10.89912 15.79804 9.99919 17.09787 ct 
9.09926 18.29773 8.5993 20.59744 8.5993 23.89703 ct 8.5993 26.79667 9.09926 28.89641 9.99919 30.09626 ct 
10.89912 31.29611 12.09902 31.89604 13.49891 31.89604 ct 14.8988 31.89604 16.0987 31.29611 16.99863 30.09626 ct 
17.99855 28.89641 18.39852 26.69668 18.39852 23.49708 ct 18.39852 20.39747 17.99855 18.29773 16.99863 17.09787 ct 
16.0987 15.79804 l  14.8988 15.2981 l  p
13.49891 60.19253 m  38.79688 11.29859 l  43.4965 11.29859 l  18.29853 60.19253 l 
p
33.4973 47.59409 m  33.4973 44.2945 34.29724 41.39486 35.9971 39.09515 ct 
37.69697 36.79543 40.09677 35.59558 43.19653 35.59558 ct 46.19628 35.59558 48.4961 36.59546 50.49594 38.79518 ct 
52.39579 40.89492 53.29571 43.89455 53.29571 47.89406 ct 53.29571 51.79357 52.39579 54.89319 50.49594 56.89294 ct 
48.4961 59.09267 46.19628 60.19253 43.39651 60.19253 ct 40.49674 60.19253 38.19693 59.09267 36.39707 56.89294 ct 
34.39723 54.89319 l  33.4973 51.79357 l  p
43.4965 39.59509 m  42.09661 39.59509 40.79672 40.09502 39.89679 41.39486 ct 
38.99686 42.59471 38.4969 44.89443 38.4969 48.09403 ct 38.4969 51.09366 38.99686 53.1934 39.89679 54.29326 ct 
40.89671 55.5931 42.09661 56.19303 43.39651 56.19303 ct 44.89639 56.19303 46.09629 55.5931 46.99622 54.29326 ct 
47.89615 53.1934 48.39611 50.99367 48.39611 47.59409 ct 48.39611 44.69445 47.89615 42.59471 46.99622 41.39486 ct 
46.09629 40.09502 l  44.89639 39.59509 l  p ef
pom
gr
202.98369 918.68608 m  217.98249 918.68608 l  ps
gs
pum
63.19492 881.4907 t 
20.79832 58.49274 m  20.79832 47.39412 l  0.69994 47.39412 l  0.69994 42.19476 l 
21.79824 12.19848 l  26.39787 12.19848 l  26.39787 42.19476 l  32.59738 42.19476 l 
32.59738 47.39412 l  26.39787 47.39412 l  26.39787 58.49274 l  p
20.79832 42.19476 m  20.79832 21.29735 l  6.29949 42.19476 l  p ef
pom
pum
98.79206 881.4907 t 
2.49979 35.59558 m  2.49979 30.19625 3.19974 25.7968 4.19966 22.39722 ct 
5.39956 19.09763 7.09942 16.49795 9.29925 14.69817 ct 11.39908 12.8984 14.29885 11.99851 17.69857 11.99851 ct 
20.09838 11.99851 22.2982 12.49845 24.09806 13.49832 ct 25.99791 14.39821 27.59778 15.99801 28.79768 17.79779 ct 
30.09758 19.69755 30.99751 21.89728 31.69745 24.59695 ct 32.39739 27.29661 32.79736 31.09614 32.79736 35.59558 ct 
32.79736 40.99491 32.09742 45.39437 31.0975 48.79394 ct 29.89759 51.99355 28.19773 54.59323 25.99791 56.393 ct 
23.89808 58.29277 20.99831 59.29264 17.69857 59.29264 ct 13.09894 59.29264 9.59922 57.59285 7.19942 54.49324 ct 
4.09967 50.59372 l  2.49979 44.2945 l  p
8.29933 35.59558 m  8.29933 43.19464 9.29925 48.29401 11.0991 50.69371 ct 
12.89896 53.29339 15.09878 54.49324 17.69857 54.49324 ct 20.19837 54.49324 22.3982 53.29339 24.19805 50.69371 ct 
25.99791 48.29401 26.79784 43.19464 26.79784 35.59558 ct 26.79784 27.99652 25.99791 22.89716 24.19805 20.49745 ct 
22.3982 17.89778 20.19837 16.69792 17.49859 16.69792 ct 14.8988 16.69792 12.89896 17.79779 11.29909 19.99752 ct 
9.39924 22.79717 l  8.29933 27.99652 l  p ef
pom
pum
134.28921 881.4907 t 
3.6997 23.29711 m  3.6997 19.99752 4.49963 17.09787 6.1995 14.79816 ct 
7.79937 12.49845 10.19918 11.29859 13.39892 11.29859 ct 16.19869 11.29859 18.69849 12.49845 20.59834 14.4982 ct 
22.3982 16.59794 23.49811 19.59757 23.49811 23.59707 ct 23.49811 27.49659 22.3982 30.5962 20.49835 32.59595 ct 
18.5985 34.79568 16.19869 35.89554 13.39892 35.89554 ct 10.69914 35.89554 8.29933 34.79568 6.39948 32.79593 ct 
4.59963 30.5962 l  3.6997 27.49659 l  p
13.49891 15.2981 m  12.09902 15.2981 10.89912 15.79804 9.99919 17.09787 ct 
9.09926 18.29773 8.5993 20.59744 8.5993 23.89703 ct 8.5993 26.79667 9.09926 28.89641 9.99919 30.09626 ct 
10.89912 31.29611 12.09902 31.89604 13.49891 31.89604 ct 14.8988 31.89604 16.0987 31.29611 16.99863 30.09626 ct 
17.99855 28.89641 18.39852 26.69668 18.39852 23.49708 ct 18.39852 20.39747 17.99855 18.29773 16.99863 17.09787 ct 
16.0987 15.79804 l  14.8988 15.2981 l  p
13.49891 60.19253 m  38.79688 11.29859 l  43.4965 11.29859 l  18.29853 60.19253 l 
p
33.4973 47.59409 m  33.4973 44.2945 34.29724 41.39486 35.9971 39.09515 ct 
37.69697 36.79543 40.09677 35.59558 43.19653 35.59558 ct 46.19628 35.59558 48.4961 36.59546 50.49594 38.79518 ct 
52.39579 40.89492 53.29571 43.89455 53.29571 47.89406 ct 53.29571 51.79357 52.39579 54.89319 50.49594 56.89294 ct 
48.4961 59.09267 46.19628 60.19253 43.39651 60.19253 ct 40.49674 60.19253 38.19693 59.09267 36.39707 56.89294 ct 
34.39723 54.89319 l  33.4973 51.79357 l  p
43.4965 39.59509 m  42.09661 39.59509 40.79672 40.09502 39.89679 41.39486 ct 
38.99686 42.59471 38.4969 44.89443 38.4969 48.09403 ct 38.4969 51.09366 38.99686 53.1934 39.89679 54.29326 ct 
40.89671 55.5931 42.09661 56.19303 43.39651 56.19303 ct 44.89639 56.19303 46.09629 55.5931 46.99622 54.29326 ct 
47.89615 53.1934 48.39611 50.99367 48.39611 47.59409 ct 48.39611 44.69445 47.89615 42.59471 46.99622 41.39486 ct 
46.09629 40.09502 l  44.89639 39.59509 l  p ef
pom
gr
202.98369 773.20412 m  217.98249 773.20412 l  ps
gs
pum
63.19492 735.90875 t 
2.49979 46.29425 m  8.49931 45.79432 l  8.99927 48.69396 9.99919 50.89368 11.59906 52.3935 ct 
13.29893 53.79333 15.19877 54.49324 17.3986 54.49324 ct 20.09838 54.49324 22.3982 53.59335 24.39804 51.49361 ct 
26.29788 49.39387 27.19781 46.59422 27.19781 43.19464 ct 27.19781 39.99504 26.29788 37.39536 24.49803 35.59558 ct 
22.69817 33.69582 20.19837 32.79593 17.3986 32.79593 ct 15.49875 32.79593 13.89888 33.19588 12.399 34.09577 ct 
10.89912 34.79568 9.79921 35.89554 8.89928 37.29537 ct 3.59971 36.49547 l 
8.09934 12.69842 l  31.0975 12.69842 l  31.0975 18.19774 l  12.59898 18.19774 l 
10.19918 30.69619 l  12.89896 28.79642 15.79873 27.69656 18.79849 27.69656 ct 
22.79816 27.69656 26.29788 29.09639 28.99767 31.99603 ct 31.89743 34.69569 33.29732 38.29525 33.29732 42.6947 ct 
33.29732 46.99417 31.99743 50.59372 29.49763 53.59335 ct 26.59786 57.29289 22.59818 59.29264 17.3986 59.29264 ct 
13.29893 59.29264 9.79921 58.09279 7.19942 55.5931 ct 4.49963 53.29339 l 
2.89976 50.19377 l  p ef
pom
pum
98.79206 735.90875 t 
2.49979 35.59558 m  2.49979 30.19625 3.19974 25.7968 4.19966 22.39722 ct 
5.39956 19.09763 7.09942 16.49795 9.29925 14.69817 ct 11.39908 12.8984 14.29885 11.99851 17.69857 11.99851 ct 
20.09838 11.99851 22.2982 12.49845 24.09806 13.49832 ct 25.99791 14.39821 27.59778 15.99801 28.79768 17.79779 ct 
30.09758 19.69755 30.99751 21.89728 31.69745 24.59695 ct 32.39739 27.29661 32.79736 31.09614 32.79736 35.59558 ct 
32.79736 40.99491 32.09742 45.39437 31.0975 48.79394 ct 29.89759 51.99355 28.19773 54.59323 25.99791 56.393 ct 
23.89808 58.29277 20.99831 59.29264 17.69857 59.29264 ct 13.09894 59.29264 9.59922 57.59285 7.19942 54.49324 ct 
4.09967 50.59372 l  2.49979 44.2945 l  p
8.29933 35.59558 m  8.29933 43.19464 9.29925 48.29401 11.0991 50.69371 ct 
12.89896 53.29339 15.09878 54.49324 17.69857 54.49324 ct 20.19837 54.49324 22.3982 53.29339 24.19805 50.69371 ct 
25.99791 48.29401 26.79784 43.19464 26.79784 35.59558 ct 26.79784 27.99652 25.99791 22.89716 24.19805 20.49745 ct 
22.3982 17.89778 20.19837 16.69792 17.49859 16.69792 ct 14.8988 16.69792 12.89896 17.79779 11.29909 19.99752 ct 
9.39924 22.79717 l  8.29933 27.99652 l  p ef
pom
pum
134.28921 735.90875 t 
3.6997 23.29711 m  3.6997 19.99752 4.49963 17.09787 6.1995 14.79816 ct 
7.79937 12.49845 10.19918 11.29859 13.39892 11.29859 ct 16.19869 11.29859 18.69849 12.49845 20.59834 14.4982 ct 
22.3982 16.59794 23.49811 19.59757 23.49811 23.59707 ct 23.49811 27.49659 22.3982 30.5962 20.49835 32.59595 ct 
18.5985 34.79568 16.19869 35.89554 13.39892 35.89554 ct 10.69914 35.89554 8.29933 34.79568 6.39948 32.79593 ct 
4.59963 30.5962 l  3.6997 27.49659 l  p
13.49891 15.2981 m  12.09902 15.2981 10.89912 15.79804 9.99919 17.09787 ct 
9.09926 18.29773 8.5993 20.59744 8.5993 23.89703 ct 8.5993 26.79667 9.09926 28.89641 9.99919 30.09626 ct 
10.89912 31.29611 12.09902 31.89604 13.49891 31.89604 ct 14.8988 31.89604 16.0987 31.29611 16.99863 30.09626 ct 
17.99855 28.89641 18.39852 26.69668 18.39852 23.49708 ct 18.39852 20.39747 17.99855 18.29773 16.99863 17.09787 ct 
16.0987 15.79804 l  14.8988 15.2981 l  p
13.49891 60.19253 m  38.79688 11.29859 l  43.4965 11.29859 l  18.29853 60.19253 l 
p
33.4973 47.59409 m  33.4973 44.2945 34.29724 41.39486 35.9971 39.09515 ct 
37.69697 36.79543 40.09677 35.59558 43.19653 35.59558 ct 46.19628 35.59558 48.4961 36.59546 50.49594 38.79518 ct 
52.39579 40.89492 53.29571 43.89455 53.29571 47.89406 ct 53.29571 51.79357 52.39579 54.89319 50.49594 56.89294 ct 
48.4961 59.09267 46.19628 60.19253 43.39651 60.19253 ct 40.49674 60.19253 38.19693 59.09267 36.39707 56.89294 ct 
34.39723 54.89319 l  33.4973 51.79357 l  p
43.4965 39.59509 m  42.09661 39.59509 40.79672 40.09502 39.89679 41.39486 ct 
38.99686 42.59471 38.4969 44.89443 38.4969 48.09403 ct 38.4969 51.09366 38.99686 53.1934 39.89679 54.29326 ct 
40.89671 55.5931 42.09661 56.19303 43.39651 56.19303 ct 44.89639 56.19303 46.09629 55.5931 46.99622 54.29326 ct 
47.89615 53.1934 48.39611 50.99367 48.39611 47.59409 ct 48.39611 44.69445 47.89615 42.59471 46.99622 41.39486 ct 
46.09629 40.09502 l  44.89639 39.59509 l  p ef
pom
gr
202.98369 627.72216 m  217.98249 627.72216 l  ps
gs
pum
63.19492 590.42679 t 
31.99743 23.49708 m  26.39787 23.99702 l  25.89792 21.6973 25.09798 20.0975 24.19805 19.09763 ct 
22.69817 17.49783 20.79832 16.59794 18.5985 16.59794 ct 16.69865 16.59794 15.19877 17.09787 13.79889 18.19774 ct 
11.99903 19.49758 10.49915 21.39734 9.49923 23.89703 ct 8.49931 26.39672 7.99935 29.89629 7.99935 34.59571 ct 
9.39924 32.49597 11.0991 30.99615 12.99895 29.89629 ct 14.8988 28.89641 16.99863 28.39647 19.19845 28.39647 ct 
22.89816 28.39647 26.19789 29.7963 28.89767 32.59595 ct 31.49747 35.39561 32.89735 38.99516 32.89735 43.39461 ct 
32.89735 46.29425 32.2974 48.99392 30.99751 51.49361 ct 29.69761 53.9933 27.99775 55.89306 25.79792 57.1929 ct 
23.5981 58.49274 21.0983 59.29264 18.39852 59.29264 ct 13.5989 59.29264 9.79921 57.39288 6.79945 53.9933 ct 
3.79969 50.49373 2.29981 44.79444 2.29981 36.79543 ct 2.29981 27.89654 3.99967 21.39734 7.29941 17.29785 ct 
10.19918 13.79828 13.99887 11.99851 18.89848 11.99851 ct 22.59818 11.99851 25.49795 12.99838 27.89775 15.09812 ct 
30.19757 17.09787 l  31.59746 19.79754 l  p
8.89928 43.4946 m  8.89928 45.39437 9.29925 47.19414 9.99919 48.99392 ct 
10.89912 50.89368 12.09902 52.09354 13.49891 53.1934 ct 15.09878 54.09329 16.59866 54.49324 18.29853 54.49324 ct 
20.59834 54.49324 22.69817 53.59335 24.49803 51.5936 ct 26.19789 49.69383 27.09782 47.09416 27.09782 43.69458 ct 
27.09782 40.49497 26.19789 38.09527 24.49803 36.29549 ct 22.79816 34.29574 20.59834 33.39585 17.99855 33.39585 ct 
15.49875 33.39585 13.29893 34.29574 11.59906 36.29549 ct 9.79921 38.09527 l 
8.89928 40.39499 l  p ef
pom
pum
98.79206 590.42679 t 
2.49979 35.59558 m  2.49979 30.19625 3.19974 25.7968 4.19966 22.39722 ct 
5.39956 19.09763 7.09942 16.49795 9.29925 14.69817 ct 11.39908 12.8984 14.29885 11.99851 17.69857 11.99851 ct 
20.09838 11.99851 22.2982 12.49845 24.09806 13.49832 ct 25.99791 14.39821 27.59778 15.99801 28.79768 17.79779 ct 
30.09758 19.69755 30.99751 21.89728 31.69745 24.59695 ct 32.39739 27.29661 32.79736 31.09614 32.79736 35.59558 ct 
32.79736 40.99491 32.09742 45.39437 31.0975 48.79394 ct 29.89759 51.99355 28.19773 54.59323 25.99791 56.393 ct 
23.89808 58.29277 20.99831 59.29264 17.69857 59.29264 ct 13.09894 59.29264 9.59922 57.59285 7.19942 54.49324 ct 
4.09967 50.59372 l  2.49979 44.2945 l  p
8.29933 35.59558 m  8.29933 43.19464 9.29925 48.29401 11.0991 50.69371 ct 
12.89896 53.29339 15.09878 54.49324 17.69857 54.49324 ct 20.19837 54.49324 22.3982 53.29339 24.19805 50.69371 ct 
25.99791 48.29401 26.79784 43.19464 26.79784 35.59558 ct 26.79784 27.99652 25.99791 22.89716 24.19805 20.49745 ct 
22.3982 17.89778 20.19837 16.69792 17.49859 16.69792 ct 14.8988 16.69792 12.89896 17.79779 11.29909 19.99752 ct 
9.39924 22.79717 l  8.29933 27.99652 l  p ef
pom
pum
134.28921 590.42679 t 
3.6997 23.29711 m  3.6997 19.99752 4.49963 17.09787 6.1995 14.79816 ct 
7.79937 12.49845 10.19918 11.29859 13.39892 11.29859 ct 16.19869 11.29859 18.69849 12.49845 20.59834 14.4982 ct 
22.3982 16.59794 23.49811 19.59757 23.49811 23.59707 ct 23.49811 27.49659 22.3982 30.5962 20.49835 32.59595 ct 
18.5985 34.79568 16.19869 35.89554 13.39892 35.89554 ct 10.69914 35.89554 8.29933 34.79568 6.39948 32.79593 ct 
4.59963 30.5962 l  3.6997 27.49659 l  p
13.49891 15.2981 m  12.09902 15.2981 10.89912 15.79804 9.99919 17.09787 ct 
9.09926 18.29773 8.5993 20.59744 8.5993 23.89703 ct 8.5993 26.79667 9.09926 28.89641 9.99919 30.09626 ct 
10.89912 31.29611 12.09902 31.89604 13.49891 31.89604 ct 14.8988 31.89604 16.0987 31.29611 16.99863 30.09626 ct 
17.99855 28.89641 18.39852 26.69668 18.39852 23.49708 ct 18.39852 20.39747 17.99855 18.29773 16.99863 17.09787 ct 
16.0987 15.79804 l  14.8988 15.2981 l  p
13.49891 60.19253 m  38.79688 11.29859 l  43.4965 11.29859 l  18.29853 60.19253 l 
p
33.4973 47.59409 m  33.4973 44.2945 34.29724 41.39486 35.9971 39.09515 ct 
37.69697 36.79543 40.09677 35.59558 43.19653 35.59558 ct 46.19628 35.59558 48.4961 36.59546 50.49594 38.79518 ct 
52.39579 40.89492 53.29571 43.89455 53.29571 47.89406 ct 53.29571 51.79357 52.39579 54.89319 50.49594 56.89294 ct 
48.4961 59.09267 46.19628 60.19253 43.39651 60.19253 ct 40.49674 60.19253 38.19693 59.09267 36.39707 56.89294 ct 
34.39723 54.89319 l  33.4973 51.79357 l  p
43.4965 39.59509 m  42.09661 39.59509 40.79672 40.09502 39.89679 41.39486 ct 
38.99686 42.59471 38.4969 44.89443 38.4969 48.09403 ct 38.4969 51.09366 38.99686 53.1934 39.89679 54.29326 ct 
40.89671 55.5931 42.09661 56.19303 43.39651 56.19303 ct 44.89639 56.19303 46.09629 55.5931 46.99622 54.29326 ct 
47.89615 53.1934 48.39611 50.99367 48.39611 47.59409 ct 48.39611 44.69445 47.89615 42.59471 46.99622 41.39486 ct 
46.09629 40.09502 l  44.89639 39.59509 l  p ef
pom
gr
202.98369 482.2402 m  217.98249 482.2402 l  ps
gs
pum
63.19492 444.94483 t 
2.89976 18.19774 m  2.89976 12.69842 l  32.89735 12.69842 l  32.89735 17.09787 l 
29.89759 20.39747 27.09782 24.49696 24.09806 29.69631 ct 21.29828 34.79568 18.89848 40.295 17.3986 45.69433 ct 
16.19869 49.59385 15.59874 53.79333 15.19877 58.49274 ct 9.39924 58.49274 l 
9.49923 54.69321 10.19918 50.29376 11.59906 45.19439 ct 12.89896 40.09502 14.8988 35.09564 17.3986 30.29624 ct 
19.99839 25.49683 22.69817 21.49733 25.49795 18.19774 ct p ef
pom
pum
98.79206 444.94483 t 
2.49979 35.59558 m  2.49979 30.19625 3.19974 25.7968 4.19966 22.39722 ct 
5.39956 19.09763 7.09942 16.49795 9.29925 14.69817 ct 11.39908 12.8984 14.29885 11.99851 17.69857 11.99851 ct 
20.09838 11.99851 22.2982 12.49845 24.09806 13.49832 ct 25.99791 14.39821 27.59778 15.99801 28.79768 17.79779 ct 
30.09758 19.69755 30.99751 21.89728 31.69745 24.59695 ct 32.39739 27.29661 32.79736 31.09614 32.79736 35.59558 ct 
32.79736 40.99491 32.09742 45.39437 31.0975 48.79394 ct 29.89759 51.99355 28.19773 54.59323 25.99791 56.393 ct 
23.89808 58.29277 20.99831 59.29264 17.69857 59.29264 ct 13.09894 59.29264 9.59922 57.59285 7.19942 54.49324 ct 
4.09967 50.59372 l  2.49979 44.2945 l  p
8.29933 35.59558 m  8.29933 43.19464 9.29925 48.29401 11.0991 50.69371 ct 
12.89896 53.29339 15.09878 54.49324 17.69857 54.49324 ct 20.19837 54.49324 22.3982 53.29339 24.19805 50.69371 ct 
25.99791 48.29401 26.79784 43.19464 26.79784 35.59558 ct 26.79784 27.99652 25.99791 22.89716 24.19805 20.49745 ct 
22.3982 17.89778 20.19837 16.69792 17.49859 16.69792 ct 14.8988 16.69792 12.89896 17.79779 11.29909 19.99752 ct 
9.39924 22.79717 l  8.29933 27.99652 l  p ef
pom
pum
134.28921 444.94483 t 
3.6997 23.29711 m  3.6997 19.99752 4.49963 17.09787 6.1995 14.79816 ct 
7.79937 12.49845 10.19918 11.29859 13.39892 11.29859 ct 16.19869 11.29859 18.69849 12.49845 20.59834 14.4982 ct 
22.3982 16.59794 23.49811 19.59757 23.49811 23.59707 ct 23.49811 27.49659 22.3982 30.5962 20.49835 32.59595 ct 
18.5985 34.79568 16.19869 35.89554 13.39892 35.89554 ct 10.69914 35.89554 8.29933 34.79568 6.39948 32.79593 ct 
4.59963 30.5962 l  3.6997 27.49659 l  p
13.49891 15.2981 m  12.09902 15.2981 10.89912 15.79804 9.99919 17.09787 ct 
9.09926 18.29773 8.5993 20.59744 8.5993 23.89703 ct 8.5993 26.79667 9.09926 28.89641 9.99919 30.09626 ct 
10.89912 31.29611 12.09902 31.89604 13.49891 31.89604 ct 14.8988 31.89604 16.0987 31.29611 16.99863 30.09626 ct 
17.99855 28.89641 18.39852 26.69668 18.39852 23.49708 ct 18.39852 20.39747 17.99855 18.29773 16.99863 17.09787 ct 
16.0987 15.79804 l  14.8988 15.2981 l  p
13.49891 60.19253 m  38.79688 11.29859 l  43.4965 11.29859 l  18.29853 60.19253 l 
p
33.4973 47.59409 m  33.4973 44.2945 34.29724 41.39486 35.9971 39.09515 ct 
37.69697 36.79543 40.09677 35.59558 43.19653 35.59558 ct 46.19628 35.59558 48.4961 36.59546 50.49594 38.79518 ct 
52.39579 40.89492 53.29571 43.89455 53.29571 47.89406 ct 53.29571 51.79357 52.39579 54.89319 50.49594 56.89294 ct 
48.4961 59.09267 46.19628 60.19253 43.39651 60.19253 ct 40.49674 60.19253 38.19693 59.09267 36.39707 56.89294 ct 
34.39723 54.89319 l  33.4973 51.79357 l  p
43.4965 39.59509 m  42.09661 39.59509 40.79672 40.09502 39.89679 41.39486 ct 
38.99686 42.59471 38.4969 44.89443 38.4969 48.09403 ct 38.4969 51.09366 38.99686 53.1934 39.89679 54.29326 ct 
40.89671 55.5931 42.09661 56.19303 43.39651 56.19303 ct 44.89639 56.19303 46.09629 55.5931 46.99622 54.29326 ct 
47.89615 53.1934 48.39611 50.99367 48.39611 47.59409 ct 48.39611 44.69445 47.89615 42.59471 46.99622 41.39486 ct 
46.09629 40.09502 l  44.89639 39.59509 l  p ef
pom
gr
202.98369 336.75824 m  217.98249 336.75824 l  ps
gs
pum
63.19492 299.36288 t 
11.29909 33.29587 m  8.99927 32.49597 7.19942 31.19613 5.99951 29.69631 ct 
4.99959 27.99652 4.29965 26.19675 4.29965 23.89703 ct 4.29965 20.49745 5.59955 17.6978 7.99935 15.49807 ct 
10.39916 13.09837 13.5989 11.99851 17.69857 11.99851 ct 21.69825 11.99851 24.898 13.09837 27.2978 15.49807 ct 
29.7976 17.79779 31.0975 20.79742 31.0975 24.09701 ct 31.0975 26.19675 30.59754 28.09651 29.39763 29.69631 ct 
28.19773 31.19613 26.59786 32.49597 24.19805 33.29587 ct 27.09782 34.29574 29.29764 35.69557 30.69753 37.79531 ct 
32.2974 39.89505 32.99734 42.29475 32.99734 45.19439 ct 32.99734 49.1939 31.59746 52.49349 28.79768 55.09316 ct 
25.89792 57.79283 22.2982 59.29264 17.79857 59.29264 ct 13.09894 59.29264 9.49923 57.79283 6.69946 55.09316 ct 
3.99967 52.3935 2.49979 48.99392 2.49979 44.99442 ct 2.49979 42.09478 3.29973 39.4951 4.69962 37.49535 ct 
6.29949 35.49559 l  8.49931 34.09577 l  p
10.19918 23.69706 m  10.19918 25.89678 10.89912 27.69656 12.19902 28.9964 ct 
13.5989 30.39623 15.59874 31.19613 17.79857 31.19613 ct 19.99839 31.19613 21.79824 30.39623 23.19813 29.09639 ct 
24.49803 27.69656 25.29796 25.99677 25.29796 23.99702 ct 25.29796 21.89728 24.49803 20.19749 23.09814 18.79766 ct 
21.69825 17.39784 19.7984 16.59794 17.69857 16.59794 ct 15.59874 16.59794 13.79889 17.39784 12.399 18.69768 ct 
10.89912 20.0975 l  10.19918 21.79729 l  p
8.29933 44.99442 m  8.29933 46.69421 8.6993 48.29401 9.49923 49.79382 ct 
10.29917 51.19365 11.39908 52.3935 12.89896 53.29339 ct 14.39884 54.09329 16.0987 54.49324 17.79857 54.49324 ct 
20.49835 54.49324 22.79816 53.69334 24.49803 51.89356 ct 26.29788 50.19377 27.19781 47.99404 27.19781 45.29438 ct 
27.19781 42.59471 26.29788 40.295 24.49803 38.49522 ct 22.59818 36.59546 20.39836 35.69557 17.69857 35.69557 ct 
14.8988 35.69557 12.69898 36.59546 10.89912 38.49522 ct 9.29925 40.295 l 
8.29933 42.49473 l  p ef
pom
pum
98.79206 299.36288 t 
2.49979 35.59558 m  2.49979 30.19625 3.19974 25.7968 4.19966 22.39722 ct 
5.39956 19.09763 7.09942 16.49795 9.29925 14.69817 ct 11.39908 12.8984 14.29885 11.99851 17.69857 11.99851 ct 
20.09838 11.99851 22.2982 12.49845 24.09806 13.49832 ct 25.99791 14.39821 27.59778 15.99801 28.79768 17.79779 ct 
30.09758 19.69755 30.99751 21.89728 31.69745 24.59695 ct 32.39739 27.29661 32.79736 31.09614 32.79736 35.59558 ct 
32.79736 40.99491 32.09742 45.39437 31.0975 48.79394 ct 29.89759 51.99355 28.19773 54.59323 25.99791 56.393 ct 
23.89808 58.29277 20.99831 59.29264 17.69857 59.29264 ct 13.09894 59.29264 9.59922 57.59285 7.19942 54.49324 ct 
4.09967 50.59372 l  2.49979 44.2945 l  p
8.29933 35.59558 m  8.29933 43.19464 9.29925 48.29401 11.0991 50.69371 ct 
12.89896 53.29339 15.09878 54.49324 17.69857 54.49324 ct 20.19837 54.49324 22.3982 53.29339 24.19805 50.69371 ct 
25.99791 48.29401 26.79784 43.19464 26.79784 35.59558 ct 26.79784 27.99652 25.99791 22.89716 24.19805 20.49745 ct 
22.3982 17.89778 20.19837 16.69792 17.49859 16.69792 ct 14.8988 16.69792 12.89896 17.79779 11.29909 19.99752 ct 
9.39924 22.79717 l  8.29933 27.99652 l  p ef
pom
pum
134.28921 299.36288 t 
3.6997 23.29711 m  3.6997 19.99752 4.49963 17.09787 6.1995 14.79816 ct 
7.79937 12.49845 10.19918 11.29859 13.39892 11.29859 ct 16.19869 11.29859 18.69849 12.49845 20.59834 14.4982 ct 
22.3982 16.59794 23.49811 19.59757 23.49811 23.59707 ct 23.49811 27.49659 22.3982 30.5962 20.49835 32.59595 ct 
18.5985 34.79568 16.19869 35.89554 13.39892 35.89554 ct 10.69914 35.89554 8.29933 34.79568 6.39948 32.79593 ct 
4.59963 30.5962 l  3.6997 27.49659 l  p
13.49891 15.2981 m  12.09902 15.2981 10.89912 15.79804 9.99919 17.09787 ct 
9.09926 18.29773 8.5993 20.59744 8.5993 23.89703 ct 8.5993 26.79667 9.09926 28.89641 9.99919 30.09626 ct 
10.89912 31.29611 12.09902 31.89604 13.49891 31.89604 ct 14.8988 31.89604 16.0987 31.29611 16.99863 30.09626 ct 
17.99855 28.89641 18.39852 26.69668 18.39852 23.49708 ct 18.39852 20.39747 17.99855 18.29773 16.99863 17.09787 ct 
16.0987 15.79804 l  14.8988 15.2981 l  p
13.49891 60.19253 m  38.79688 11.29859 l  43.4965 11.29859 l  18.29853 60.19253 l 
p
33.4973 47.59409 m  33.4973 44.2945 34.29724 41.39486 35.9971 39.09515 ct 
37.69697 36.79543 40.09677 35.59558 43.19653 35.59558 ct 46.19628 35.59558 48.4961 36.59546 50.49594 38.79518 ct 
52.39579 40.89492 53.29571 43.89455 53.29571 47.89406 ct 53.29571 51.79357 52.39579 54.89319 50.49594 56.89294 ct 
48.4961 59.09267 46.19628 60.19253 43.39651 60.19253 ct 40.49674 60.19253 38.19693 59.09267 36.39707 56.89294 ct 
34.39723 54.89319 l  33.4973 51.79357 l  p
43.4965 39.59509 m  42.09661 39.59509 40.79672 40.09502 39.89679 41.39486 ct 
38.99686 42.59471 38.4969 44.89443 38.4969 48.09403 ct 38.4969 51.09366 38.99686 53.1934 39.89679 54.29326 ct 
40.89671 55.5931 42.09661 56.19303 43.39651 56.19303 ct 44.89639 56.19303 46.09629 55.5931 46.99622 54.29326 ct 
47.89615 53.1934 48.39611 50.99367 48.39611 47.59409 ct 48.39611 44.69445 47.89615 42.59471 46.99622 41.39486 ct 
46.09629 40.09502 l  44.89639 39.59509 l  p ef
pom
gr
202.98369 191.27628 m  217.98249 191.27628 l  ps
gs
pum
63.19492 153.88091 t 
3.39972 47.79407 m  8.89928 47.19414 l  9.39924 49.79382 10.29917 51.5936 11.59906 52.79345 ct 
12.89896 53.9933 14.49883 54.49324 16.49867 54.49324 ct 18.29853 54.49324 19.7984 54.09329 21.0983 53.29339 ct 
22.3982 52.49349 23.49811 51.49361 24.39804 50.09378 ct 25.09798 48.79394 25.89792 46.99417 26.39787 44.79444 ct 
27.09782 42.49473 27.2978 40.09502 27.2978 37.79531 ct 27.2978 37.49535 27.2978 37.19538 27.2978 36.59546 ct 
26.19789 38.49522 24.59802 39.89505 22.69817 40.99491 ct 20.59834 42.19476 18.5985 42.6947 16.19869 42.6947 ct 
12.49899 42.6947 9.29925 41.29487 6.49947 38.59521 ct 3.99967 35.69557 2.49979 32.09602 2.49979 27.59657 ct 
2.49979 22.89716 3.99967 19.09763 6.69946 16.19799 ct 9.49923 13.39833 12.99895 11.99851 17.09862 11.99851 ct 
20.09838 11.99851 22.79816 12.69842 25.39796 14.39821 ct 27.89775 15.99801 29.7976 18.29773 31.0975 21.39734 ct 
32.39739 24.39697 32.99734 28.59645 32.99734 34.29574 ct 32.99734 40.295 32.39739 44.89443 31.0975 48.39399 ct 
29.7976 51.99355 27.89775 54.59323 25.29796 56.393 ct 22.79816 58.29277 19.7984 59.29264 16.39868 59.29264 ct 
12.69898 59.29264 9.8992 58.19278 7.59938 56.19303 ct 5.19958 54.19328 l 
3.79969 51.39362 l  p
26.69785 27.29661 m  26.69785 24.09701 25.79792 21.49733 24.09806 19.59757 ct 
22.2982 17.6978 20.19837 16.69792 17.79857 16.69792 ct 15.29877 16.69792 13.09894 17.6978 11.1991 19.69755 ct 
9.39924 21.79729 8.29933 24.49696 8.29933 27.69656 ct 8.29933 30.69619 9.29925 33.19588 11.0991 34.99566 ct 
12.89896 36.79543 15.09878 37.69532 17.69857 37.69532 ct 20.19837 37.69532 22.3982 36.79543 24.09806 34.99566 ct 
25.79792 33.19588 l  26.69785 30.5962 l  p ef
pom
pum
98.79206 153.88091 t 
2.49979 35.59558 m  2.49979 30.19625 3.19974 25.7968 4.19966 22.39722 ct 
5.39956 19.09763 7.09942 16.49795 9.29925 14.69817 ct 11.39908 12.8984 14.29885 11.99851 17.69857 11.99851 ct 
20.09838 11.99851 22.2982 12.49845 24.09806 13.49832 ct 25.99791 14.39821 27.59778 15.99801 28.79768 17.79779 ct 
30.09758 19.69755 30.99751 21.89728 31.69745 24.59695 ct 32.39739 27.29661 32.79736 31.09614 32.79736 35.59558 ct 
32.79736 40.99491 32.09742 45.39437 31.0975 48.79394 ct 29.89759 51.99355 28.19773 54.59323 25.99791 56.393 ct 
23.89808 58.29277 20.99831 59.29264 17.69857 59.29264 ct 13.09894 59.29264 9.59922 57.59285 7.19942 54.49324 ct 
4.09967 50.59372 l  2.49979 44.2945 l  p
8.29933 35.59558 m  8.29933 43.19464 9.29925 48.29401 11.0991 50.69371 ct 
12.89896 53.29339 15.09878 54.49324 17.69857 54.49324 ct 20.19837 54.49324 22.3982 53.29339 24.19805 50.69371 ct 
25.99791 48.29401 26.79784 43.19464 26.79784 35.59558 ct 26.79784 27.99652 25.99791 22.89716 24.19805 20.49745 ct 
22.3982 17.89778 20.19837 16.69792 17.49859 16.69792 ct 14.8988 16.69792 12.89896 17.79779 11.29909 19.99752 ct 
9.39924 22.79717 l  8.29933 27.99652 l  p ef
pom
pum
134.28921 153.88091 t 
3.6997 23.29711 m  3.6997 19.99752 4.49963 17.09787 6.1995 14.79816 ct 
7.79937 12.49845 10.19918 11.29859 13.39892 11.29859 ct 16.19869 11.29859 18.69849 12.49845 20.59834 14.4982 ct 
22.3982 16.59794 23.49811 19.59757 23.49811 23.59707 ct 23.49811 27.49659 22.3982 30.5962 20.49835 32.59595 ct 
18.5985 34.79568 16.19869 35.89554 13.39892 35.89554 ct 10.69914 35.89554 8.29933 34.79568 6.39948 32.79593 ct 
4.59963 30.5962 l  3.6997 27.49659 l  p
13.49891 15.2981 m  12.09902 15.2981 10.89912 15.79804 9.99919 17.09787 ct 
9.09926 18.29773 8.5993 20.59744 8.5993 23.89703 ct 8.5993 26.79667 9.09926 28.89641 9.99919 30.09626 ct 
10.89912 31.29611 12.09902 31.89604 13.49891 31.89604 ct 14.8988 31.89604 16.0987 31.29611 16.99863 30.09626 ct 
17.99855 28.89641 18.39852 26.69668 18.39852 23.49708 ct 18.39852 20.39747 17.99855 18.29773 16.99863 17.09787 ct 
16.0987 15.79804 l  14.8988 15.2981 l  p
13.49891 60.19253 m  38.79688 11.29859 l  43.4965 11.29859 l  18.29853 60.19253 l 
p
33.4973 47.59409 m  33.4973 44.2945 34.29724 41.39486 35.9971 39.09515 ct 
37.69697 36.79543 40.09677 35.59558 43.19653 35.59558 ct 46.19628 35.59558 48.4961 36.59546 50.49594 38.79518 ct 
52.39579 40.89492 53.29571 43.89455 53.29571 47.89406 ct 53.29571 51.79357 52.39579 54.89319 50.49594 56.89294 ct 
48.4961 59.09267 46.19628 60.19253 43.39651 60.19253 ct 40.49674 60.19253 38.19693 59.09267 36.39707 56.89294 ct 
34.39723 54.89319 l  33.4973 51.79357 l  p
43.4965 39.59509 m  42.09661 39.59509 40.79672 40.09502 39.89679 41.39486 ct 
38.99686 42.59471 38.4969 44.89443 38.4969 48.09403 ct 38.4969 51.09366 38.99686 53.1934 39.89679 54.29326 ct 
40.89671 55.5931 42.09661 56.19303 43.39651 56.19303 ct 44.89639 56.19303 46.09629 55.5931 46.99622 54.29326 ct 
47.89615 53.1934 48.39611 50.99367 48.39611 47.59409 ct 48.39611 44.69445 47.89615 42.59471 46.99622 41.39486 ct 
46.09629 40.09502 l  44.89639 39.59509 l  p ef
pom
gr
202.98369 45.69433 m  217.98249 45.69433 l  ps
gs
pum
28.79768 8.29897 t 
23.99807 58.49274 m  18.29853 58.49274 l  18.29853 22.19724 l  16.89864 23.59707 15.09878 24.89691 12.89896 26.19675 ct 
10.69914 27.49659 8.6993 28.39647 6.89944 28.9964 ct 6.89944 23.59707 l 
10.19918 21.99727 12.89896 20.19749 15.19877 18.19774 ct 17.69857 16.098 19.29845 13.99826 20.19837 11.99851 ct 
23.99807 11.99851 l  p ef
pom
pum
64.39482 8.29897 t 
2.49979 35.59558 m  2.49979 30.19625 3.19974 25.7968 4.19966 22.39722 ct 
5.39956 19.09763 7.09942 16.49795 9.29925 14.69817 ct 11.39908 12.8984 14.29885 11.99851 17.69857 11.99851 ct 
20.09838 11.99851 22.2982 12.49845 24.09806 13.49832 ct 25.99791 14.39821 27.59778 15.99801 28.79768 17.79779 ct 
30.09758 19.69755 30.99751 21.89728 31.69745 24.59695 ct 32.39739 27.29661 32.79736 31.09614 32.79736 35.59558 ct 
32.79736 40.99491 32.09742 45.39437 31.0975 48.79394 ct 29.89759 51.99355 28.19773 54.59323 25.99791 56.393 ct 
23.89808 58.29277 20.99831 59.29264 17.69857 59.29264 ct 13.09894 59.29264 9.59922 57.59285 7.19942 54.49324 ct 
4.09967 50.59372 l  2.49979 44.2945 l  p
8.29933 35.59558 m  8.29933 43.19464 9.29925 48.29401 11.0991 50.69371 ct 
12.89896 53.29339 15.09878 54.49324 17.69857 54.49324 ct 20.19837 54.49324 22.3982 53.29339 24.19805 50.69371 ct 
25.99791 48.29401 26.79784 43.19464 26.79784 35.59558 ct 26.79784 27.99652 25.99791 22.89716 24.19805 20.49745 ct 
22.3982 17.89778 20.19837 16.69792 17.49859 16.69792 ct 14.8988 16.69792 12.89896 17.79779 11.29909 19.99752 ct 
9.39924 22.79717 l  8.29933 27.99652 l  p ef
pom
pum
99.89197 8.29897 t 
2.49979 35.59558 m  2.49979 30.19625 3.19974 25.7968 4.19966 22.39722 ct 
5.39956 19.09763 7.09942 16.49795 9.29925 14.69817 ct 11.39908 12.8984 14.29885 11.99851 17.69857 11.99851 ct 
20.09838 11.99851 22.2982 12.49845 24.09806 13.49832 ct 25.99791 14.39821 27.59778 15.99801 28.79768 17.79779 ct 
30.09758 19.69755 30.99751 21.89728 31.69745 24.59695 ct 32.39739 27.29661 32.79736 31.09614 32.79736 35.59558 ct 
32.79736 40.99491 32.09742 45.39437 31.0975 48.79394 ct 29.89759 51.99355 28.19773 54.59323 25.99791 56.393 ct 
23.89808 58.29277 20.99831 59.29264 17.69857 59.29264 ct 13.09894 59.29264 9.59922 57.59285 7.19942 54.49324 ct 
4.09967 50.59372 l  2.49979 44.2945 l  p
8.29933 35.59558 m  8.29933 43.19464 9.29925 48.29401 11.0991 50.69371 ct 
12.89896 53.29339 15.09878 54.49324 17.69857 54.49324 ct 20.19837 54.49324 22.3982 53.29339 24.19805 50.69371 ct 
25.99791 48.29401 26.79784 43.19464 26.79784 35.59558 ct 26.79784 27.99652 25.99791 22.89716 24.19805 20.49745 ct 
22.3982 17.89778 20.19837 16.69792 17.49859 16.69792 ct 14.8988 16.69792 12.89896 17.79779 11.29909 19.99752 ct 
9.39924 22.79717 l  8.29933 27.99652 l  p ef
pom
pum
135.48911 8.29897 t 
3.6997 23.29711 m  3.6997 19.99752 4.49963 17.09787 6.1995 14.79816 ct 
7.79937 12.49845 10.19918 11.29859 13.39892 11.29859 ct 16.19869 11.29859 18.69849 12.49845 20.59834 14.4982 ct 
22.3982 16.59794 23.49811 19.59757 23.49811 23.59707 ct 23.49811 27.49659 22.3982 30.5962 20.49835 32.59595 ct 
18.5985 34.79568 16.19869 35.89554 13.39892 35.89554 ct 10.69914 35.89554 8.29933 34.79568 6.39948 32.79593 ct 
4.59963 30.5962 l  3.6997 27.49659 l  p
13.49891 15.2981 m  12.09902 15.2981 10.89912 15.79804 9.99919 17.09787 ct 
9.09926 18.29773 8.5993 20.59744 8.5993 23.89703 ct 8.5993 26.79667 9.09926 28.89641 9.99919 30.09626 ct 
10.89912 31.29611 12.09902 31.89604 13.49891 31.89604 ct 14.8988 31.89604 16.0987 31.29611 16.99863 30.09626 ct 
17.99855 28.89641 18.39852 26.69668 18.39852 23.49708 ct 18.39852 20.39747 17.99855 18.29773 16.99863 17.09787 ct 
16.0987 15.79804 l  14.8988 15.2981 l  p
13.49891 60.19253 m  38.79688 11.29859 l  43.4965 11.29859 l  18.29853 60.19253 l 
p
33.4973 47.59409 m  33.4973 44.2945 34.29724 41.39486 35.9971 39.09515 ct 
37.69697 36.79543 40.09677 35.59558 43.19653 35.59558 ct 46.19628 35.59558 48.4961 36.59546 50.49594 38.79518 ct 
52.39579 40.89492 53.29571 43.89455 53.29571 47.89406 ct 53.29571 51.79357 52.39579 54.89319 50.49594 56.89294 ct 
48.4961 59.09267 46.19628 60.19253 43.39651 60.19253 ct 40.49674 60.19253 38.19693 59.09267 36.39707 56.89294 ct 
34.39723 54.89319 l  33.4973 51.79357 l  p
43.4965 39.59509 m  42.09661 39.59509 40.79672 40.09502 39.89679 41.39486 ct 
38.99686 42.59471 38.4969 44.89443 38.4969 48.09403 ct 38.4969 51.09366 38.99686 53.1934 39.89679 54.29326 ct 
40.89671 55.5931 42.09661 56.19303 43.39651 56.19303 ct 44.89639 56.19303 46.09629 55.5931 46.99622 54.29326 ct 
47.89615 53.1934 48.39611 50.99367 48.39611 47.59409 ct 48.39611 44.69445 47.89615 42.59471 46.99622 41.39486 ct 
46.09629 40.09502 l  44.89639 39.59509 l  p ef
pom
gr
2291.41597 995.57655 m  2092.63193 995.57655 l  2092.63193 690.21441 l 
2490.2 690.21441 l  2490.2 995.57655 l  2291.41597 995.57655 l 
ps
0.601 0.601 0.800 c 2113.73024 718.31093 m  2177.02515 718.31093 l 
2177.02515 781.60308 l  2113.73024 781.60308 l  2113.73024 718.31093 l 
p ef
0.003 0.003 0.003 c 2145.3277 781.60308 m  2113.73024 781.60308 l  2113.73024 718.31093 l 
2177.02515 718.31093 l  2177.02515 781.60308 l  2145.3277 781.60308 l 
ps
gs
pum
2198.42344 712.41166 t 
4.99959 16.8979 m  11.49907 16.8979 l  11.49907 45.8943 l  11.49907 49.09391 11.69906 51.5936 12.399 53.09341 ct 
12.89896 54.59323 13.89888 55.89306 15.29877 56.89294 ct 17.3986 58.39275 20.09838 58.99268 23.69809 58.99268 ct 
27.69777 58.99268 30.59754 58.19278 32.2974 56.09304 ct 33.89727 54.19328 34.7972 50.89368 34.7972 46.09428 ct 
34.7972 16.8979 l  40.49674 16.8979 l  40.49674 45.99429 l  40.49674 49.9938 40.09677 53.1934 39.29684 55.19315 ct 
38.4969 57.39288 36.99702 59.29264 34.7972 60.79246 ct 31.89743 62.79221 27.99775 63.99206 23.19813 63.99206 ct 
16.79865 63.99206 12.19902 62.49225 9.29925 59.49262 ct 6.49947 56.79295 4.99959 52.09354 4.99959 45.8943 ct 
p ef
pom
pum
2244.11977 712.41166 t 
3.49971 61.59236 m  3.49971 55.99305 l  7.59938 57.9928 11.39908 58.89269 14.79881 58.89269 ct 
19.49843 58.89269 21.89824 57.29289 21.89824 53.9933 ct 21.89824 51.79357 20.19837 49.9938 16.89864 48.99392 ct 
11.49907 47.19414 l  6.29949 45.49435 3.59971 42.29475 3.59971 37.69532 ct 
3.59971 31.49609 7.89936 28.49646 16.39868 28.49646 ct 18.99847 28.49646 21.89824 28.69644 25.39796 29.39635 ct 
25.39796 34.59571 l  22.2982 33.59583 19.19845 32.9959 16.0987 32.9959 ct 
11.89904 32.9959 9.69922 34.39573 9.69922 37.19538 ct 9.69922 39.29512 11.0991 40.69495 13.99887 41.69483 ct 
18.99847 43.19464 l  24.898 45.19439 27.99775 48.59397 27.99775 53.49336 ct 
27.99775 56.49299 26.79784 58.99268 24.39804 60.79246 ct 21.99823 62.59223 18.69849 63.59211 14.49883 63.59211 ct 
11.39908 63.59211 l  7.59938 62.79221 l  p ef
pom
pum
2275.41725 712.41166 t 
25.19797 42.29475 m  25.19797 40.295 24.898 38.79518 24.49803 37.69532 ct 
23.49811 34.59571 21.0983 32.89592 17.59858 32.89592 ct 14.99879 32.89592 13.09894 33.69582 11.69906 35.19563 ct 
10.19918 36.59546 9.49923 38.99516 9.09926 42.29475 ct p
31.29748 56.89294 m  31.29748 61.69235 l  27.09782 62.99218 23.29812 63.59211 19.69841 63.59211 ct 
14.39884 63.59211 10.29917 61.99231 7.19942 58.69272 ct 4.09967 55.39313 2.59979 51.09366 2.59979 45.59434 ct 
2.59979 40.295 3.89968 36.19551 6.69946 32.9959 ct 9.29925 29.99628 13.09894 28.49646 17.69857 28.49646 ct 
23.19813 28.49646 26.79784 30.29624 29.09766 34.09577 ct 30.79752 36.99541 31.49747 40.49497 31.39747 45.0944 ct 
31.39747 46.99417 l  8.99927 46.99417 l  9.19926 49.39387 9.59922 51.29363 10.19918 52.59347 ct 
11.99903 56.79295 15.49875 58.89269 20.99831 58.89269 ct 24.19805 58.89269 l 
27.49779 58.29277 l  p ef
pom
pum
2311.01439 712.41166 t 
4.59963 62.79221 m  4.59963 29.09639 l  10.69914 29.09639 l  10.69914 35.49559 l 
11.59906 33.29587 12.59898 31.79605 13.5989 30.79618 ct 14.99879 29.19637 16.79865 28.49646 18.79849 28.49646 ct 
19.19845 28.49646 19.8984 28.49646 20.59834 28.59645 ct 20.59834 34.29574 l 
19.49843 33.89579 18.5985 33.7958 17.99855 33.7958 ct 15.69873 33.7958 13.29893 36.09552 10.69914 40.69495 ct 
10.69914 62.79221 l  p ef
pom
pum
2332.21269 712.41166 t 
pom
pum
2350.01126 712.41166 t 
16.29869 62.99218 m  14.99879 63.39213 13.89888 63.59211 12.79897 63.59211 ct 
7.29941 63.59211 4.59963 60.19253 4.59963 53.49336 ct 4.59963 33.7958 l 
0.79993 33.7958 l  0.79993 29.09639 l  4.59963 29.09639 l  4.59963 22.99714 l 
10.69914 22.49721 l  10.69914 29.09639 l  17.19861 29.09639 l  17.19861 33.7958 l 
10.69914 33.7958 l  10.69914 52.29351 l  10.69914 54.99318 10.99911 56.79295 11.39908 57.59285 ct 
11.89904 58.49274 12.79897 58.89269 14.29885 58.89269 ct 14.99879 58.89269 15.69873 58.89269 16.29869 58.69272 ct 
p ef
pom
pum
2366.9099 712.41166 t 
3.89968 62.79221 m  3.89968 29.09639 l  9.99919 29.09639 l  9.99919 62.79221 l 
p
3.89968 22.99714 m  3.89968 16.8979 l  9.99919 16.8979 l  9.99919 22.99714 l 
p ef
pom
pum
2381.30875 712.41166 t 
4.59963 62.79221 m  4.59963 29.09639 l  10.69914 29.09639 l  10.69914 35.49559 l 
12.49899 32.79593 13.99887 30.99615 15.19877 29.99628 ct 16.59866 28.9964 18.29853 28.49646 20.49835 28.49646 ct 
23.19813 28.49646 25.29796 29.19637 26.99783 30.99615 ct 27.99775 31.99603 28.89767 33.59583 29.49763 35.49559 ct 
31.39747 32.79593 32.79736 30.89616 33.89727 29.99628 ct 35.29716 28.9964 37.09702 28.49646 39.29684 28.49646 ct 
45.29636 28.49646 48.29612 31.79605 48.29612 38.39523 ct 48.29612 62.79221 l 
42.19661 62.79221 l  42.19661 39.29512 l  42.19661 35.49559 40.69673 33.59583 37.69697 33.59583 ct 
35.09718 33.59583 32.39739 35.69557 29.49763 40.295 ct 29.49763 62.79221 l 
23.39812 62.79221 l  23.39812 39.29512 l  23.39812 35.49559 21.89824 33.59583 18.99847 33.59583 ct 
16.29869 33.59583 13.49891 35.69557 10.69914 40.295 ct 10.69914 62.79221 l 
p ef
pom
pum
2434.60447 712.41166 t 
25.19797 42.29475 m  25.19797 40.295 24.898 38.79518 24.49803 37.69532 ct 
23.49811 34.59571 21.0983 32.89592 17.59858 32.89592 ct 14.99879 32.89592 13.09894 33.69582 11.69906 35.19563 ct 
10.19918 36.59546 9.49923 38.99516 9.09926 42.29475 ct p
31.29748 56.89294 m  31.29748 61.69235 l  27.09782 62.99218 23.29812 63.59211 19.69841 63.59211 ct 
14.39884 63.59211 10.29917 61.99231 7.19942 58.69272 ct 4.09967 55.39313 2.59979 51.09366 2.59979 45.59434 ct 
2.59979 40.295 3.89968 36.19551 6.69946 32.9959 ct 9.29925 29.99628 13.09894 28.49646 17.69857 28.49646 ct 
23.19813 28.49646 26.79784 30.29624 29.09766 34.09577 ct 30.79752 36.99541 31.49747 40.49497 31.39747 45.0944 ct 
31.39747 46.99417 l  8.99927 46.99417 l  9.19926 49.39387 9.59922 51.29363 10.19918 52.59347 ct 
11.99903 56.79295 15.49875 58.89269 20.99831 58.89269 ct 24.19805 58.89269 l 
27.49779 58.29277 l  p ef
pom
gr
0.800 0.800 1.000 c 2113.73024 813.09918 m  2177.02515 813.09918 l 
2177.02515 876.39133 l  2113.73024 876.39133 l  2113.73024 813.09918 l 
p ef
0.003 0.003 0.003 c 2145.3277 876.39133 m  2113.73024 876.39133 l  2113.73024 813.09918 l 
2177.02515 813.09918 l  2177.02515 876.39133 l  2145.3277 876.39133 l 
ps
gs
pum
2198.42344 805.00018 t 
4.99959 62.79221 m  4.99959 16.8979 l  13.99887 16.8979 l  26.59786 52.3935 l 
39.49682 16.8979 l  47.59617 16.8979 l  47.59617 62.79221 l  41.49666 62.79221 l 
41.49666 25.59682 l  28.99767 59.69259 l  22.79816 59.69259 l  10.59914 25.39685 l 
10.59914 62.79221 l  p ef
pom
pum
2250.91922 805.00018 t 
3.89968 62.79221 m  3.89968 29.09639 l  9.99919 29.09639 l  9.99919 62.79221 l 
p
3.89968 22.99714 m  3.89968 16.8979 l  9.99919 16.8979 l  9.99919 22.99714 l 
p ef
pom
pum
2265.31806 805.00018 t 
3.89968 62.79221 m  3.89968 13.89827 l  9.99919 13.89827 l  9.99919 62.79221 l 
p ef
pom
pum
2278.81698 805.00018 t 
25.19797 42.29475 m  25.19797 40.295 24.898 38.79518 24.49803 37.69532 ct 
23.49811 34.59571 21.0983 32.89592 17.59858 32.89592 ct 14.99879 32.89592 13.09894 33.69582 11.69906 35.19563 ct 
10.19918 36.59546 9.49923 38.99516 9.09926 42.29475 ct p
31.29748 56.89294 m  31.29748 61.69235 l  27.09782 62.99218 23.29812 63.59211 19.69841 63.59211 ct 
14.39884 63.59211 10.29917 61.99231 7.19942 58.69272 ct 4.09967 55.39313 2.59979 51.09366 2.59979 45.59434 ct 
2.59979 40.295 3.89968 36.19551 6.69946 32.9959 ct 9.29925 29.99628 13.09894 28.49646 17.69857 28.49646 ct 
23.19813 28.49646 26.79784 30.29624 29.09766 34.09577 ct 30.79752 36.99541 31.49747 40.49497 31.39747 45.0944 ct 
31.39747 46.99417 l  8.99927 46.99417 l  9.19926 49.39387 9.59922 51.29363 10.19918 52.59347 ct 
11.99903 56.79295 15.49875 58.89269 20.99831 58.89269 ct 24.19805 58.89269 l 
27.49779 58.29277 l  p ef
pom
pum
2314.41412 805.00018 t 
3.49971 61.59236 m  3.49971 55.99305 l  7.59938 57.9928 11.39908 58.89269 14.79881 58.89269 ct 
19.49843 58.89269 21.89824 57.29289 21.89824 53.9933 ct 21.89824 51.79357 20.19837 49.9938 16.89864 48.99392 ct 
11.49907 47.19414 l  6.29949 45.49435 3.59971 42.29475 3.59971 37.69532 ct 
3.59971 31.49609 7.89936 28.49646 16.39868 28.49646 ct 18.99847 28.49646 21.89824 28.69644 25.39796 29.39635 ct 
25.39796 34.59571 l  22.2982 33.59583 19.19845 32.9959 16.0987 32.9959 ct 
11.89904 32.9959 9.69922 34.39573 9.69922 37.19538 ct 9.69922 39.29512 11.0991 40.69495 13.99887 41.69483 ct 
18.99847 43.19464 l  24.898 45.19439 27.99775 48.59397 27.99775 53.49336 ct 
27.99775 56.49299 26.79784 58.99268 24.39804 60.79246 ct 21.99823 62.59223 18.69849 63.59211 14.49883 63.59211 ct 
11.39908 63.59211 l  7.59938 62.79221 l  p ef
pom
pum
2345.71161 805.00018 t 
16.29869 62.99218 m  14.99879 63.39213 13.89888 63.59211 12.79897 63.59211 ct 
7.29941 63.59211 4.59963 60.19253 4.59963 53.49336 ct 4.59963 33.7958 l 
0.79993 33.7958 l  0.79993 29.09639 l  4.59963 29.09639 l  4.59963 22.99714 l 
10.69914 22.49721 l  10.69914 29.09639 l  17.19861 29.09639 l  17.19861 33.7958 l 
10.69914 33.7958 l  10.69914 52.29351 l  10.69914 54.99318 10.99911 56.79295 11.39908 57.59285 ct 
11.89904 58.49274 12.79897 58.89269 14.29885 58.89269 ct 14.99879 58.89269 15.69873 58.89269 16.29869 58.69272 ct 
p ef
pom
pum
2363.51018 805.00018 t 
17.3986 28.49646 m  22.09822 28.49646 25.69793 29.99628 28.49771 33.19588 ct 
31.0975 36.19551 32.39739 40.49497 32.39739 45.99429 ct 32.39739 51.39362 31.0975 55.69309 28.49771 58.89269 ct 
25.69793 61.99231 21.99823 63.59211 17.29861 63.59211 ct 13.29893 63.59211 9.99919 62.19228 7.3994 59.69259 ct 
4.09967 56.49299 2.59979 51.79357 2.59979 45.99429 ct 2.59979 40.49497 3.89968 36.19551 6.49947 33.19588 ct 
9.19926 29.99628 l  12.89896 28.49646 l  p
17.3986 32.9959 m  11.89904 32.9959 9.19926 37.39536 9.19926 45.99429 ct 
9.19926 54.59323 11.89904 58.89269 17.3986 58.89269 ct 22.99815 58.89269 25.79792 54.59323 25.79792 45.8943 ct 
25.79792 37.19538 l  22.99815 32.9959 l  p ef
pom
pum
2399.10732 805.00018 t 
4.59963 62.79221 m  4.59963 29.09639 l  10.69914 29.09639 l  10.69914 35.49559 l 
12.19902 33.39585 13.79889 31.79605 15.19877 30.79618 ct 17.29861 29.19637 19.69841 28.49646 22.2982 28.49646 ct 
27.79776 28.49646 30.79752 31.79605 30.79752 38.59521 ct 30.79752 62.79221 l 
24.69801 62.79221 l  24.69801 40.69495 l  24.69801 37.8953 24.29804 36.09552 23.79808 35.09564 ct 
23.19813 34.19575 22.09822 33.69582 20.59834 33.69582 ct 17.19861 33.69582 13.89888 36.09552 10.69914 40.99491 ct 
10.69914 62.79221 l  p ef
pom
pum
2434.60447 805.00018 t 
25.19797 42.29475 m  25.19797 40.295 24.898 38.79518 24.49803 37.69532 ct 
23.49811 34.59571 21.0983 32.89592 17.59858 32.89592 ct 14.99879 32.89592 13.09894 33.69582 11.69906 35.19563 ct 
10.19918 36.59546 9.49923 38.99516 9.09926 42.29475 ct p
31.29748 56.89294 m  31.29748 61.69235 l  27.09782 62.99218 23.29812 63.59211 19.69841 63.59211 ct 
14.39884 63.59211 10.29917 61.99231 7.19942 58.69272 ct 4.09967 55.39313 2.59979 51.09366 2.59979 45.59434 ct 
2.59979 40.295 3.89968 36.19551 6.69946 32.9959 ct 9.29925 29.99628 13.09894 28.49646 17.69857 28.49646 ct 
23.19813 28.49646 26.79784 30.29624 29.09766 34.09577 ct 30.79752 36.99541 31.49747 40.49497 31.39747 45.0944 ct 
31.39747 46.99417 l  8.99927 46.99417 l  9.19926 49.39387 9.59922 51.29363 10.19918 52.59347 ct 
11.99903 56.79295 15.49875 58.89269 20.99831 58.89269 ct 24.19805 58.89269 l 
27.49779 58.29277 l  p ef
pom
gr
0.402 0.402 0.601 c 2113.73024 907.88742 m  2177.02515 907.88742 l 
2177.02515 971.17958 l  2113.73024 971.17958 l  2113.73024 907.88742 l 
p ef
0.003 0.003 0.003 c 2145.3277 971.17958 m  2113.73024 971.17958 l  2113.73024 907.88742 l 
2177.02515 907.88742 l  2177.02515 971.17958 l  2145.3277 971.17958 l 
ps
gs
pum
2198.42344 900.28837 t 
4.99959 62.79221 m  4.99959 16.8979 l  24.19805 16.8979 l  33.5973 16.8979 38.19693 20.69743 38.19693 28.39647 ct 
38.19693 31.99603 37.09702 35.09564 34.7972 37.49535 ct 33.39731 38.89517 31.49747 40.09502 28.99767 41.29487 ct 
44.29644 62.79221 l  36.29708 62.79221 l  23.29812 43.39461 l  11.49907 43.39461 l 
11.49907 62.79221 l  p
11.49907 38.49522 m  18.69849 38.49522 l  23.19813 38.49522 26.49787 37.69532 28.49771 36.19551 ct 
30.49755 34.69569 31.49747 32.29599 31.49747 29.09639 ct 31.49747 26.49671 30.79752 24.49696 28.99767 23.49708 ct 
27.2978 22.39722 24.69801 21.89728 20.69833 21.89728 ct 11.49907 21.89728 l 
p ef
pom
pum
2244.11977 900.28837 t 
17.3986 28.49646 m  22.09822 28.49646 25.69793 29.99628 28.49771 33.19588 ct 
31.0975 36.19551 32.39739 40.49497 32.39739 45.99429 ct 32.39739 51.39362 31.0975 55.69309 28.49771 58.89269 ct 
25.69793 61.99231 21.99823 63.59211 17.29861 63.59211 ct 13.29893 63.59211 9.99919 62.19228 7.3994 59.69259 ct 
4.09967 56.49299 2.59979 51.79357 2.59979 45.99429 ct 2.59979 40.49497 3.89968 36.19551 6.49947 33.19588 ct 
9.19926 29.99628 l  12.89896 28.49646 l  p
17.3986 32.9959 m  11.89904 32.9959 9.19926 37.39536 9.19926 45.99429 ct 
9.19926 54.59323 11.89904 58.89269 17.3986 58.89269 ct 22.99815 58.89269 25.79792 54.59323 25.79792 45.8943 ct 
25.79792 37.19538 l  22.99815 32.9959 l  p ef
pom
pum
2278.81698 900.28837 t 
3.89968 62.79221 m  3.89968 13.89827 l  9.99919 13.89827 l  9.99919 62.79221 l 
p ef
pom
pum
2293.21582 900.28837 t 
3.89968 62.79221 m  3.89968 13.89827 l  9.99919 13.89827 l  9.99919 62.79221 l 
p ef
pom
pum
2307.61467 900.28837 t 
10.69914 40.99491 m  10.69914 58.19278 l  13.49891 58.69272 15.69873 58.89269 17.09862 58.89269 ct 
22.89816 58.89269 25.79792 54.59323 25.79792 45.69433 ct 25.79792 41.8948 25.29796 38.99516 24.19805 36.99541 ct 
22.99815 34.79568 21.49827 33.7958 19.49843 33.7958 ct 16.89864 33.7958 l 
13.99887 36.19551 l  p
10.69914 35.49559 m  11.89904 33.39585 13.09894 31.79605 14.39884 30.79618 ct 
16.19869 29.19637 18.29853 28.49646 20.89832 28.49646 ct 24.29804 28.49646 27.09782 29.89629 29.19765 32.89592 ct 
31.39747 35.99553 32.39739 39.99504 32.39739 45.0944 ct 32.39739 50.89368 30.99751 55.49311 28.39771 58.79271 ct 
25.59794 61.99231 21.59826 63.59211 16.59866 63.59211 ct 14.79881 63.59211 12.79897 63.39213 10.69914 62.79221 ct 
4.59963 63.09217 l  4.59963 13.89827 l  10.69914 13.89827 l  p ef
pom
pum
2342.31188 900.28837 t 
23.79808 58.49274 m  19.99839 61.79233 16.29869 63.59211 12.79897 63.59211 ct 
9.79921 63.59211 7.3994 62.69222 5.49955 60.89244 ct 3.79969 59.29264 2.89976 56.99293 2.89976 54.29326 ct 
2.89976 46.69421 9.09926 42.89468 21.49827 42.89468 ct 22.89816 42.89468 l 
22.89816 38.89517 l  22.89816 34.89567 20.69833 32.9959 16.39868 32.9959 ct 
13.09894 32.9959 9.59922 33.89579 5.79953 35.99553 ct 5.79953 30.89616 l 
9.99919 29.19637 13.89888 28.49646 17.69857 28.49646 ct 21.59826 28.49646 24.49803 29.19637 26.29788 30.89616 ct 
28.09774 32.49597 28.99767 35.19563 28.99767 38.89517 ct 28.99767 54.09329 l 
28.99767 57.49287 30.09758 59.29264 32.2974 59.29264 ct 32.49739 59.29264 32.89735 59.29264 33.39731 59.19266 ct 
33.89727 62.59223 l  32.39739 63.19216 30.89751 63.59211 29.39763 63.59211 ct 
27.99775 63.59211 26.79784 63.19216 25.89792 62.29227 ct 25.09798 61.59236 l 
24.29804 60.29252 l  p
22.89816 55.19315 m  22.89816 46.49423 l  20.99831 46.49423 l  19.69841 46.39424 18.29853 46.49423 16.79865 46.69421 ct 
11.69906 47.39412 9.19926 49.69383 9.19926 53.49336 ct 9.19926 56.89294 10.99911 58.49274 14.79881 58.49274 ct 
17.29861 58.49274 l  20.09838 57.39288 l  p ef
pom
pum
2377.90902 900.28837 t 
28.5977 61.69235 m  24.798 62.99218 21.29828 63.59211 17.99855 63.59211 ct 
13.39892 63.59211 9.59922 61.99231 6.79945 58.69272 ct 3.99967 55.39313 2.59979 51.19365 2.59979 45.99429 ct 
2.59979 40.49497 3.99967 36.19551 6.89944 32.9959 ct 9.69922 29.99628 13.79889 28.49646 18.99847 28.49646 ct 
21.49827 28.49646 24.69801 28.69644 28.19773 29.49634 ct 28.19773 34.59571 l 
24.798 33.59583 22.09822 32.9959 20.09838 32.9959 ct 12.99895 32.9959 9.49923 37.39536 9.49923 45.99429 ct 
9.49923 49.9938 10.29917 53.09341 12.09902 55.39313 ct 13.99887 57.49287 16.59866 58.69272 19.8984 58.69272 ct 
22.2982 58.69272 25.19797 57.89282 28.5977 56.49299 ct p ef
pom
pum
2410.10644 900.28837 t 
4.59963 62.79221 m  4.59963 13.89827 l  10.69914 13.89827 l  10.69914 45.49435 l 
21.99823 29.09639 l  27.79776 29.09639 l  17.09862 45.0944 l  30.99751 62.79221 l 
23.69809 62.79221 l  10.69914 45.59434 l  10.69914 62.79221 l  p ef
pom
gr
1262.4231 1262.4231 t 
-1846.91506 -1936.37811 m -51353.7815 -1936.37811 l -51353.7815 -34001.92501 l -1846.91506 -34001.92501 l -1846.91506 -1936.37811 l
eoclip newpath
gr
63.5 63.5 m 2633.4 63.5 l 2633.4 1733.4 l 63.5 1733.4 l 63.5 63.5 l
eoclip newpath
gr
gr
0 1670 t 
pom
count op_count sub {pop} repeat countdictstack dict_count sub {end} repeat b4_inc_state restore
%%PageTrailer
%%Trailer
%%EOF
