%!PS-Adobe-2.0 EPSF-2.0
%%Title: instancedesc.dia
%%Creator: Dia v0.90
%%CreationDate: Mon Jan 27 20:43:38 2003
%%For: pascal
%%Magnification: 1.0000
%%Orientation: Portrait
%%BoundingBox: 0 0 654 546
%%Pages: 1
%%EndComments
%%BeginProlog
/cp {closepath} bind def
/c {curveto} bind def
/f {fill} bind def
/a {arc} bind def
/ef {eofill} bind def
/ex {exch} bind def
/gr {grestore} bind def
/gs {gsave} bind def
/sa {save} bind def
/rs {restore} bind def
/l {lineto} bind def
/m {moveto} bind def
/rm {rmoveto} bind def
/n {newpath} bind def
/s {stroke} bind def
/sh {show} bind def
/slc {setlinecap} bind def
/slj {setlinejoin} bind def
/slw {setlinewidth} bind def
/srgb {setrgbcolor} bind def
/rot {rotate} bind def
/sc {scale} bind def
/sd {setdash} bind def
/ff {findfont} bind def
/sf {setfont} bind def
/scf {scalefont} bind def
/sw {stringwidth pop} bind def
/tr {translate} bind def

/ellipsedict 8 dict def
ellipsedict /mtrx matrix put
/ellipse
{ ellipsedict begin
   /endangle exch def
   /startangle exch def
   /yrad exch def
   /xrad exch def
   /y exch def
   /x exch def   /savematrix mtrx currentmatrix def
   x y tr xrad yrad sc
   0 0 1 startangle endangle arc
   savematrix setmatrix
   end
} def

/mergeprocs {
dup length
3 -1 roll
dup
length
dup
5 1 roll
3 -1 roll
add
array cvx
dup
3 -1 roll
0 exch
putinterval
dup
4 2 roll
putinterval
} bind def
%%EndProlog

%%BeginSetup
%%EndSetup
28.346000 -28.346000 scale
-6.472400 -17.195000 translate

0.100000 slw
[] 0 sd
1.000000 1.000000 1.000000 srgb
n 6.522400 3.050000 m 6.522400 4.850000 l 16.560000 4.850000 l 16.560000 3.050000 l f
0.000000 0.000000 0.000000 srgb
n 6.522400 3.050000 m 6.522400 4.850000 l 16.560000 4.850000 l 16.560000 3.050000 l cp s
 [ /xi /xi /xi /xi /xi /xi /xi /xi /xi /xi /xi /xi /xi /xi /xi /xi
 /xi /xi /xi /xi /xi /xi /xi /xi /xi /xi /xi /xi /xi /xi /xi /xi
 /J /N /u /k /e /I /n /s /xi /xi /t /a /c /D /C /l
 /space /i /o /b /j /period /xi /xi /xi /xi /xi /xi /xi /xi /xi /xi
 /xi /xi /xi /xi /xi /xi /xi /xi /xi /xi /xi /xi /xi /xi /xi /xi
 /xi /xi /xi /xi /xi /xi /xi /xi /xi /xi /xi /xi /xi /xi /xi /xi
 /xi /xi /xi /xi /xi /xi /xi /xi /xi /xi /xi /xi /xi /xi /xi /xi
 /xi /xi /xi /xi /xi /xi /xi /xi /xi /xi /xi /xi /xi /xi /xi /xi
 /xi /xi /xi /xi /xi /xi /xi /xi /xi /xi /xi /xi /xi /xi /xi /xi
 /xi /xi /xi /xi /xi /xi /xi /xi /xi /xi /xi /xi /xi /xi /xi /xi
 /xi /xi /xi /xi /xi /xi /xi /xi /xi /xi /xi /xi /xi /xi /xi /xi
 /xi /xi /xi /xi /xi /xi /xi /xi /xi /xi /xi /xi /xi /xi /xi /xi
 /xi /xi /xi /xi /xi /xi /xi /xi /xi /xi /xi /xi /xi /xi /xi /xi
 /xi /xi /xi /xi /xi /xi /xi /xi /xi /xi /xi /xi /xi /xi /xi /xi
 /xi /xi /xi /xi /xi /xi /xi /xi /xi /xi /xi /xi /xi /xi /xi /xi
 /xi /xi /xi /xi /xi /xi /xi /xi /xi /xi /xi /xi /xi /xi /xi /xi
] /e0 exch def
/Helvetica_e0 undefinefont
/Helvetica_e0
  /Helvetica findfont
  dup length dict begin
  {1 index /FID ne {def} {pop pop} ifelse} forall
  /Encoding e0 def
  currentdict end
definefont pop
/Helvetica_e0 ff 0.800000 scf sf
( !"#$%&'*+&,$-$',) sw
2 div 11.541200 ex sub 4.146491 m ( !"#$%&'*+&,$-$',)
 gs 1 -1 sc sh gr
0.050000 slw
n 7.022400 4.350000 m 16.060000 4.350000 l s
0.100000 slw
[] 0 sd
1.000000 1.000000 1.000000 srgb
n 14.950000 -2.000000 m 14.950000 -0.200000 l 21.186000 -0.200000 l 21.186000 -2.000000 l f
0.000000 0.000000 0.000000 srgb
n 14.950000 -2.000000 m 14.950000 -0.200000 l 21.186000 -0.200000 l 21.186000 -2.000000 l cp s
/Helvetica_e0 ff 0.800000 scf sf
( !"#$./+'') sw
2 div 18.068000 ex sub -0.903509 m ( !"#$./+'')
 gs 1 -1 sc sh gr
0.050000 slw
n 15.450000 -0.700000 m 20.686000 -0.700000 l s
0.100000 slw
[] 0 sd
1.000000 1.000000 1.000000 srgb
n 19.442200 3.100000 m 19.442200 4.900000 l 29.479800 4.900000 l 29.479800 3.100000 l f
0.000000 0.000000 0.000000 srgb
n 19.442200 3.100000 m 19.442200 4.900000 l 29.479800 4.900000 l 29.479800 3.100000 l cp s
/Helvetica_e0 ff 0.800000 scf sf
( !"#$%&'*+&,$-$',) sw
2 div 24.461000 ex sub 4.196491 m ( !"#$%&'*+&,$-$',)
 gs 1 -1 sc sh gr
0.050000 slw
n 19.942200 4.400000 m 28.979800 4.400000 l s
/Courier_e0 undefinefont
/Courier_e0
  /Courier findfont
  dup length dict begin
  {1 index /FID ne {def} {pop pop} ifelse} forall
  /Encoding e0 def
  currentdict end
definefont pop
/Courier_e0 ff 0.800000 scf sf
(,/+''01&'*+&,$) sw
2 div 23.350000 ex sub 7.050000 m (,/+''01&'*+&,$)
 gs 1 -1 sc sh gr
0.100000 slw
[] 0 sd
0 slj
0 slc
n 11.462000 3.050000 m 11.462000 1.800000 l 18.019600 1.800000 l 18.019600 -0.200000 l s
0.100000 slw
[] 0 sd
0 slj
0 slc
n 18.419600 0.600000 m 18.019600 -0.200000 l 17.619600 0.600000 l s
0.100000 slw
[] 0 sd
0 slj
0 slc
n 24.381800 3.100000 m 24.381800 1.800000 l 18.019600 1.800000 l 18.019600 -0.200000 l s
0.100000 slw
[] 0 sd
0 slj
0 slc
n 18.419600 0.600000 m 18.019600 -0.200000 l 17.619600 0.600000 l s
/Courier_e0 ff 0.800000 scf sf
(234$,*01&'*+&,$) sw
2 div 12.550000 ex sub 7.050000 m (234$,*01&'*+&,$)
 gs 1 -1 sc sh gr
/Courier_e0 ff 0.800000 scf sf
(234$,*01&'*+&,$) sw
2 div 12.350000 ex sub 11.050000 m (234$,*01&'*+&,$)
 gs 1 -1 sc sh gr
/Courier_e0 ff 0.800000 scf sf
(234$,*01&'*+&,$) sw
2 div 12.450000 ex sub 14.850000 m (234$,*01&'*+&,$)
 gs 1 -1 sc sh gr
0.717647 0.717647 0.717647 srgb
n 19.342400 7.370000 m 19.342400 9.270000 l 20.442400 9.270000 l 20.442400 7.370000 l f
0.100000 slw
[] 0 sd
[] 0 sd
0 slj
0.000000 0.000000 0.000000 srgb
n 19.342400 7.370000 m 19.342400 9.270000 l 20.442400 9.270000 l 20.442400 7.370000 l cp s
1.000000 1.000000 1.000000 srgb
n 20.511600 7.370000 m 20.511600 9.270000 l 23.899600 9.270000 l 23.899600 7.370000 l f
0.100000 slw
[] 0 sd
[] 0 sd
0 slj
0.000000 0.000000 0.000000 srgb
n 20.511600 7.370000 m 20.511600 9.270000 l 23.899600 9.270000 l 23.899600 7.370000 l cp s
/Courier_e0 ff 0.800000 scf sf
(55555) sw
2 div 22.205600 ex sub 8.516491 m (55555)
 gs 1 -1 sc sh gr
0.717647 0.717647 0.717647 srgb
n 7.213600 7.411500 m 7.213600 9.311500 l 8.313600 9.311500 l 8.313600 7.411500 l f
0.100000 slw
[] 0 sd
[] 0 sd
0 slj
0.000000 0.000000 0.000000 srgb
n 7.213600 7.411500 m 7.213600 9.311500 l 8.313600 9.311500 l 8.313600 7.411500 l cp s
1.000000 1.000000 1.000000 srgb
n 8.382800 7.411500 m 8.382800 9.311500 l 11.770800 9.311500 l 11.770800 7.411500 l f
0.100000 slw
[] 0 sd
[] 0 sd
0 slj
0.000000 0.000000 0.000000 srgb
n 8.382800 7.411500 m 8.382800 9.311500 l 11.770800 9.311500 l 11.770800 7.411500 l cp s
/Courier_e0 ff 0.800000 scf sf
(55555) sw
2 div 10.076800 ex sub 8.557991 m (55555)
 gs 1 -1 sc sh gr
0.717647 0.717647 0.717647 srgb
n 7.213600 11.345000 m 7.213600 13.245000 l 8.313600 13.245000 l 8.313600 11.345000 l f
0.100000 slw
[] 0 sd
[] 0 sd
0 slj
0.000000 0.000000 0.000000 srgb
n 7.213600 11.345000 m 7.213600 13.245000 l 8.313600 13.245000 l 8.313600 11.345000 l cp s
1.000000 1.000000 1.000000 srgb
n 8.382800 11.345000 m 8.382800 13.245000 l 11.770800 13.245000 l 11.770800 11.345000 l f
0.100000 slw
[] 0 sd
[] 0 sd
0 slj
0.000000 0.000000 0.000000 srgb
n 8.382800 11.345000 m 8.382800 13.245000 l 11.770800 13.245000 l 11.770800 11.345000 l cp s
/Courier_e0 ff 0.800000 scf sf
(55555) sw
2 div 10.076800 ex sub 12.491491 m (55555)
 gs 1 -1 sc sh gr
0.717647 0.717647 0.717647 srgb
n 7.213600 15.245000 m 7.213600 17.145000 l 8.313600 17.145000 l 8.313600 15.245000 l f
0.100000 slw
[] 0 sd
[] 0 sd
0 slj
0.000000 0.000000 0.000000 srgb
n 7.213600 15.245000 m 7.213600 17.145000 l 8.313600 17.145000 l 8.313600 15.245000 l cp s
1.000000 1.000000 1.000000 srgb
n 8.382800 15.245000 m 8.382800 17.145000 l 11.770800 17.145000 l 11.770800 15.245000 l f
0.100000 slw
[] 0 sd
[] 0 sd
0 slj
0.000000 0.000000 0.000000 srgb
n 8.382800 15.245000 m 8.382800 17.145000 l 11.770800 17.145000 l 11.770800 15.245000 l cp s
/Courier_e0 ff 0.800000 scf sf
(55555) sw
2 div 10.076800 ex sub 16.391491 m (55555)
 gs 1 -1 sc sh gr
0.100000 slw
[] 0 sd
0 slj
0 slc
n 7.763600 7.411500 m 7.763600 5.875010 l 11.541200 5.875010 l 11.541200 4.850000 l s
0.100000 slw
[] 0 sd
0 slj
0 slc
n 11.941200 5.650000 m 11.541200 4.850000 l 11.141200 5.650000 l s
0.100000 slw
[] 0 sd
0 slj
0 slc
n 7.763600 11.345000 m 7.763600 9.770020 l 13.329900 9.770020 l 13.329900 4.875010 l s
0.100000 slw
[] 0 sd
0 slj
0 slc
n 13.729900 5.675010 m 13.329900 4.875010 l 12.929900 5.675010 l s
0.100000 slw
[] 0 sd
0 slj
0 slc
n 7.763600 15.245000 m 7.763600 13.670000 l 15.129900 13.670000 l 15.129900 4.875010 l s
0.100000 slw
[] 0 sd
0 slj
0 slc
n 15.529900 5.675010 m 15.129900 4.875010 l 14.729900 5.675010 l s
0.100000 slw
[] 0 sd
0 slj
0 slc
n 19.617400 7.370000 m 19.617400 5.875010 l 24.461000 5.875010 l 24.461000 4.900000 l s
0.100000 slw
[] 0 sd
0 slj
0 slc
n 24.861000 5.700000 m 24.461000 4.900000 l 24.061000 5.700000 l s
showpage
