#FIG 3.2
Landscape
Center
Inches
Letter  
100.00
Single
-2
1200 2
6 225 2025 3375 3825
2 2 0 1 0 7 50 0 -1 0.000 0 0 -1 0 0 5
	 1500 2025 2100 2025 2100 2325 1500 2325 1500 2025
2 2 0 1 0 7 50 0 -1 0.000 0 0 -1 0 0 5
	 2175 2775 2775 2775 2775 3075 2175 3075 2175 2775
2 2 0 1 0 7 50 0 -1 0.000 0 0 -1 0 0 5
	 825 2775 1425 2775 1425 3075 825 3075 825 2775
2 2 0 1 0 7 50 0 -1 0.000 0 0 -1 0 0 5
	 825 3525 1425 3525 1425 3825 825 3825 825 3525
2 2 0 1 0 7 50 0 -1 0.000 0 0 -1 0 0 5
	 2175 3525 2775 3525 2775 3825 2175 3825 2175 3525
2 1 0 1 0 7 50 0 -1 0.000 0 0 -1 0 0 2
	 1500 2325 1125 2775
2 1 0 1 0 7 50 0 -1 0.000 0 0 -1 0 0 2
	 2100 2325 2475 2775
2 1 0 1 0 7 50 0 -1 0.000 0 0 -1 0 0 2
	 1125 3075 1125 3525
2 1 0 1 0 7 50 0 -1 0.000 0 0 -1 0 0 2
	 2475 3075 2475 3525
4 0 0 50 0 0 12 0.0000 4 165 480 1575 2250 T0, T1\001
4 0 0 50 0 0 12 0.0000 4 135 195 900 3000 T1\001
4 0 0 50 0 0 12 0.0000 4 135 195 2250 3000 T0\001
4 0 0 50 0 0 12 0.0000 4 135 795 225 3375 T1: b.x = 0\001
4 0 0 50 0 0 12 0.0000 4 135 795 450 2550 T0: a.x = 0\001
4 0 0 50 0 0 12 0.0000 4 135 795 2400 2550 T1: b.x = 0\001
4 0 0 50 0 0 12 0.0000 4 135 795 2550 3375 T0: a.x = 0\001
-6
2 2 0 1 0 7 50 0 -1 0.000 0 0 -1 0 0 5
	 5250 2025 5850 2025 5850 2325 5250 2325 5250 2025
2 2 0 1 0 7 50 0 -1 0.000 0 0 -1 0 0 5
	 4575 2775 5175 2775 5175 3075 4575 3075 4575 2775
2 2 0 1 0 7 50 0 -1 0.000 0 0 -1 0 0 5
	 4575 3525 5175 3525 5175 3825 4575 3825 4575 3525
2 1 0 1 0 7 50 0 -1 0.000 0 0 -1 0 0 2
	 5250 2325 4875 2775
2 1 0 1 0 7 50 0 -1 0.000 0 0 -1 0 0 2
	 4875 3075 4875 3525
4 0 0 50 0 0 12 0.0000 4 165 480 5325 2250 T0, T1\001
4 0 0 50 0 0 12 0.0000 4 135 195 4650 3000 T1\001
4 0 0 50 0 0 12 0.0000 4 135 795 3975 3375 T1: b.x = 0\001
4 0 0 50 0 0 12 0.0000 4 135 795 4200 2550 T0: a.x = 0\001
