#FIG 3.2  Produced by xfig version 3.2.5c
Landscape
Center
Metric
Letter  
100.00
Single
-2
1200 2
6 5355 3105 6795 3915
2 2 0 2 0 7 50 -1 -1 0.000 0 0 -1 0 0 5
	 5400 3150 6750 3150 6750 3870 5400 3870 5400 3150
4 1 0 50 -1 16 20 0.0000 4 240 675 6075 3600 SUT\001
-6
6 2655 3105 4095 3915
2 2 0 2 0 7 50 -1 -1 0.000 0 0 -1 0 0 5
	 2700 3150 4050 3150 4050 3870 2700 3870 2700 3150
4 1 0 50 -1 16 20 0.0000 4 240 675 3375 3600 Tool\001
-6
6 -45 3105 1395 3915
2 2 0 2 0 7 50 -1 -1 0.000 0 0 -1 0 0 5
	 0 3150 1350 3150 1350 3870 0 3870 0 3150
4 1 0 50 -1 16 20 0.0000 4 240 900 675 3600 Model\001
-6
2 1 0 2 0 7 50 -1 -1 0.000 0 0 -1 1 0 2
	1 1 2.00 90.00 180.00
	 4050 3420 5400 3420
2 1 0 2 0 7 50 -1 -1 0.000 0 0 -1 1 0 2
	1 1 2.00 90.00 180.00
	 5400 3600 4050 3600
2 1 0 2 0 7 50 -1 -1 0.000 0 0 -1 1 0 2
	1 1 2.00 90.00 180.00
	 1350 3645 2700 3645
4 1 0 50 -1 17 18 0.0000 4 255 765 4680 4005 output\001
4 1 0 50 -1 17 18 0.0000 4 270 615 4725 3240 input\001
4 1 0 50 -1 17 18 0.0000 4 210 1065 2025 3465 behavior\001
