1000	7	17	213
2000	7	17	360
3000	7	17	466
4000	7	17	598
5000	7	17	695
6000	7	17	792
7000	7	17	894
8000	7	17	1015
9000	7	17	1114
10000	7	17	1215
11000	7	17	1318
12000	7	17	1413
13000	7	17	1482
14000	7	17	1557
15000	7	17	1662
16000	7	17	1739
17000	7	17	1828
18000	7	17	1911
19000	7	17	1967
20000	7	17	2062
21000	7	17	2128
22000	7	17	2236
23000	7	17	2302
24000	7	17	2348
25000	7	17	2426
26000	7	17	2512
27000	7	17	2594
28000	7	17	2655
29000	7	17	2731
30000	7	17	2790
31000	7	17	2847
32000	7	17	2916
33000	7	17	2980
34000	7	17	3045
35000	7	17	3120
36000	7	17	3209
37000	7	17	3292
38000	7	17	3357
39000	7	17	3455
40000	7	17	3502
41000	7	17	3596
42000	7	17	3693
43000	7	17	3797
44000	7	17	3852
45000	7	17	3905
46000	7	17	3962
47000	7	17	4014
48000	7	17	4068
49000	7	17	4123
50000	7	17	4179
51000	7	17	4243
52000	7	17	4278
53000	7	17	4344
54000	7	17	4393
55000	7	17	4450
56000	7	17	4509
57000	7	17	4555
58000	7	17	4608
59000	7	17	4697
60000	7	17	4763
61000	7	17	4805
62000	7	17	4855
63000	7	17	4916
64000	7	17	4976
65000	7	17	5031
66000	7	17	5094
67000	7	17	5152
68000	7	17	5219
69000	7	17	5260
70000	7	17	5323
71000	7	17	5369
72000	7	17	5423
73000	7	17	5466
74000	7	17	5515
75000	7	17	5582
76000	7	17	5655
77000	7	17	5725
78000	7	17	5797
79000	7	17	5877
80000	7	17	5914
81000	7	17	5998
82000	7	17	6046
83000	7	17	6098
84000	7	17	6172
85000	7	17	6233
86000	7	17	6295
87000	7	17	6345
88000	7	17	6396
89000	7	17	6430
90000	7	17	6474
91000	7	17	6519
92000	7	17	6584
93000	7	17	6647
94000	7	17	6703
95000	7	17	6743
96000	7	17	6810
97000	7	17	6867
98000	7	17	6898
99000	7	17	6943
100000	7	17	7014
