#FIG 3.2
Landscape
Center
Metric
Letter  
100.00
Single
-2
1200 2
0 32 #ccff00
5 1 0 2 0 7 150 -1 -1 0.000 0 0 1 0 6825.000 2475.000 6525 2250 7200 2475 6525 2700
	1 1 2.00 180.00 240.00
6 2880 1260 3690 3690
2 4 0 2 0 6 150 -1 -1 0.000 0 0 7 0 0 5
	 3645 1305 3645 3645 2925 3645 2925 1305 3645 1305
4 1 0 50 -1 16 20 1.5708 4 210 1935 3375 2475 Transformation\001
-6
6 4410 1980 6570 2970
6 4763 2220 6420 2805
4 1 0 50 -1 16 20 0.0000 4 210 1365 5445 2430 Test cases\001
4 0 0 50 -1 16 18 0.0000 4 270 750 5670 2745 (Java)\001
-6
2 2 0 2 0 2 150 -1 20 0.000 0 0 -1 0 0 5
	 4455 2025 6525 2025 6525 2925 4455 2925 4455 2025
-6
6 810 1980 2160 2970
2 2 0 2 0 6 150 -1 20 0.000 0 0 -1 0 0 5
	 855 2025 2115 2025 2115 2925 855 2925 855 2025
4 1 0 50 -1 16 20 0.0000 4 210 780 1485 2565 Model\001
-6
2 1 0 2 0 7 150 -1 -1 0.000 0 0 -1 1 0 2
	1 1 2.00 180.00 240.00
	 3645 2475 4455 2475
2 1 0 2 0 7 150 -1 -1 0.000 0 0 -1 1 0 2
	1 1 2.00 180.00 240.00
	 2115 2475 2925 2475
4 1 0 150 -1 16 18 0.0000 4 210 1845 6795 3375 Test execution\001
