#FIG 3.2  Produced by xfig version 3.2.5
Landscape
Center
Metric
Letter  
100.00
Single
-2
1200 2
0 32 #ccff00
0 33 #ff9900
6 -225 1260 2115 2250
2 2 0 2 0 6 150 -1 20 0.000 0 0 -1 0 0 5
	 -180 1305 2070 1305 2070 2205 -180 2205 -180 1305
4 1 0 50 -1 16 20 0.0000 4 240 1620 900 1845 Test model\001
-6
6 4410 1260 6570 2250
2 2 0 2 0 6 150 -1 20 0.000 0 0 -1 0 0 5
	 4455 1305 6525 1305 6525 2205 4455 2205 4455 1305
4 1 0 50 -1 16 20 0.0000 4 240 675 5445 1845 SUT\001
-6
6 4410 2700 6570 3780
6 4725 2880 6165 3510
4 1 0 50 -1 16 20 0.0000 4 315 1380 5445 3150 Compiled\001
4 1 0 50 -1 16 20 0.0000 4 240 885 5445 3510 model\001
-6
2 2 0 2 0 7 150 -1 20 0.000 0 0 -1 0 0 5
	 4455 2745 6525 2745 6525 3735 4455 3735 4455 2745
-6
6 -225 2745 2115 3735
2 2 0 2 0 33 150 -1 20 0.000 0 0 -1 0 0 5
	 -180 2790 2070 2790 2070 3690 -180 3690 -180 2790
4 1 0 50 -1 16 20 0.0000 4 315 1860 945 3330 Model library\001
-6
6 7335 1260 8145 3780
2 4 0 2 0 33 150 -1 20 0.000 0 0 7 0 0 5
	 8100 1305 7380 1305 7380 3735 8100 3735 8100 1305
4 1 0 50 -1 16 20 1.5708 4 240 1080 7830 2520 Modbat\001
-6
6 2880 1260 3690 3780
2 4 0 2 0 6 150 -1 -1 0.000 0 0 7 0 0 5
	 3645 1305 3645 3735 2925 3735 2925 1305 3645 1305
4 1 0 50 -1 16 20 1.5708 4 315 2145 3375 2520 Scala compiler\001
-6
2 1 0 2 0 7 150 -1 -1 0.000 0 0 -1 1 0 2
	1 1 2.00 180.00 240.00
	 3645 3285 4455 3285
2 1 0 2 0 7 150 -1 -1 0.000 0 0 -1 1 0 2
	1 1 2.00 180.00 240.00
	 6530 1700 7399 2317
2 1 0 2 0 7 150 -1 -1 0.000 0 0 -1 1 0 2
	1 1 2.00 180.00 240.00
	 6511 3317 7380 2700
2 1 0 2 0 7 150 -1 -1 0.000 0 0 -1 1 0 2
	1 1 2.00 180.00 240.00
	 2075 1700 2944 2317
2 1 0 2 0 7 150 -1 -1 0.000 0 0 -1 1 0 2
	1 1 2.00 180.00 240.00
	 2056 3272 2925 2700
