digraph model {
  orientation = landscape;
  graph [ rankdir = "TB", sep="0.5", nodesep="0.2" ];
  node [ fontname = "Helvetica", fontsize="12.0", margin="0.07" ];
  edge [ fontname = "Helvetica", fontsize="12.0", margin="0.05" ];
  "connecting" [ peripheries = "2.0" ];
  start	-> connecting [ label = " request connection " ];
  connecting	-> connected [ label = " connect " ];
  connected	-> connecting [ label = " disconnected " ];
  connecting	-> AUTH_failed [ label = " auth_failed " ];
  AUTH_failed	-> end [ label = " clean up " ];
  connecting	-> close [ label = " connection lost " ];
  connecting	-> close [ label = " session expired " ];
  connected	-> close [label = " connection lost " ];
  close	-> end [ label = " clean up " ];
}
