%!PS-Adobe-3.0
%%Creator: graphviz version 2.26.3 (20100126.1600)
%%Title: model
%%Pages: (atend)
%%BoundingBox: (atend)
%%EndComments
save
%%BeginProlog
/DotDict 200 dict def
DotDict begin

/setupLatin1 {
mark
/EncodingVector 256 array def
 EncodingVector 0

ISOLatin1Encoding 0 255 getinterval putinterval
EncodingVector 45 /hyphen put

% Set up ISO Latin 1 character encoding
/starnetISO {
        dup dup findfont dup length dict begin
        { 1 index /FID ne { def }{ pop pop } ifelse
        } forall
        /Encoding EncodingVector def
        currentdict end definefont
} def
/Times-Roman starnetISO def
/Times-Italic starnetISO def
/Times-Bold starnetISO def
/Times-BoldItalic starnetISO def
/Helvetica starnetISO def
/Helvetica-Oblique starnetISO def
/Helvetica-Bold starnetISO def
/Helvetica-BoldOblique starnetISO def
/Courier starnetISO def
/Courier-Oblique starnetISO def
/Courier-Bold starnetISO def
/Courier-BoldOblique starnetISO def
cleartomark
} bind def

%%BeginResource: procset graphviz 0 0
/coord-font-family /Times-Roman def
/default-font-family /Times-Roman def
/coordfont coord-font-family findfont 8 scalefont def

/InvScaleFactor 1.0 def
/set_scale {
       dup 1 exch div /InvScaleFactor exch def
       scale
} bind def

% styles
/solid { [] 0 setdash } bind def
/dashed { [9 InvScaleFactor mul dup ] 0 setdash } bind def
/dotted { [1 InvScaleFactor mul 6 InvScaleFactor mul] 0 setdash } bind def
/invis {/fill {newpath} def /stroke {newpath} def /show {pop newpath} def} bind def
/bold { 2 setlinewidth } bind def
/filled { } bind def
/unfilled { } bind def
/rounded { } bind def
/diagonals { } bind def

% hooks for setting color 
/nodecolor { sethsbcolor } bind def
/edgecolor { sethsbcolor } bind def
/graphcolor { sethsbcolor } bind def
/nopcolor {pop pop pop} bind def

/beginpage {	% i j npages
	/npages exch def
	/j exch def
	/i exch def
	/str 10 string def
	npages 1 gt {
		gsave
			coordfont setfont
			0 0 moveto
			(\() show i str cvs show (,) show j str cvs show (\)) show
		grestore
	} if
} bind def

/set_font {
	findfont exch
	scalefont setfont
} def

% draw text fitted to its expected width
/alignedtext {			% width text
	/text exch def
	/width exch def
	gsave
		width 0 gt {
			[] 0 setdash
			text stringwidth pop width exch sub text length div 0 text ashow
		} if
	grestore
} def

/boxprim {				% xcorner ycorner xsize ysize
		4 2 roll
		moveto
		2 copy
		exch 0 rlineto
		0 exch rlineto
		pop neg 0 rlineto
		closepath
} bind def

/ellipse_path {
	/ry exch def
	/rx exch def
	/y exch def
	/x exch def
	matrix currentmatrix
	newpath
	x y translate
	rx ry scale
	0 0 1 0 360 arc
	setmatrix
} bind def

/endpage { showpage } bind def
/showpage { } def

/layercolorseq
	[	% layer color sequence - darkest to lightest
		[0 0 0]
		[.2 .8 .8]
		[.4 .8 .8]
		[.6 .8 .8]
		[.8 .8 .8]
	]
def

/layerlen layercolorseq length def

/setlayer {/maxlayer exch def /curlayer exch def
	layercolorseq curlayer 1 sub layerlen mod get
	aload pop sethsbcolor
	/nodecolor {nopcolor} def
	/edgecolor {nopcolor} def
	/graphcolor {nopcolor} def
} bind def

/onlayer { curlayer ne {invis} if } def

/onlayers {
	/myupper exch def
	/mylower exch def
	curlayer mylower lt
	curlayer myupper gt
	or
	{invis} if
} def

/curlayer 0 def

%%EndResource
%%EndProlog
%%BeginSetup
14 default-font-family set_font
1 setmiterlimit
% /arrowlength 10 def
% /arrowwidth 5 def

% make sure pdfmark is harmless for PS-interpreters other than Distiller
/pdfmark where {pop} {userdict /pdfmark /cleartomark load put} ifelse
% make '<<' and '>>' safe on PS Level 1 devices
/languagelevel where {pop languagelevel}{1} ifelse
2 lt {
    userdict (<<) cvn ([) cvn load put
    userdict (>>) cvn ([) cvn load put
} if

%%EndSetup
setupLatin1
%%Page: 1 1
%%PageBoundingBox: 36 36 376 203
%%PageOrientation: Landscape
0 0 1 beginpage
gsave
36 36 340 167 boxprim clip newpath
1 1 set_scale 90 rotate 40 -372 translate
% initialization
gsave
1 setlinewidth
0 0 0 nodecolor
95 310 46.99 18 ellipse_path stroke
1 setlinewidth
0 0 0 nodecolor
95 310 50.95 22 ellipse_path stroke
0 0 0 nodecolor
12 /Helvetica set_font
63.5 305.7 moveto 63 (initialization) alignedtext
grestore
% mainAction
gsave
1 setlinewidth
0 0 0 nodecolor
95 234 46.15 18 ellipse_path stroke
0 0 0 nodecolor
12 /Helvetica set_font
64.5 229.7 moveto 61 (mainAction) alignedtext
grestore
% initialization->mainAction
gsave
1 setlinewidth
0 0 0 edgecolor
newpath 95 287.61 moveto
95 279.73 95 270.76 95 262.45 curveto
stroke
0 0 0 edgecolor
newpath 98.5 262.4 moveto
95 252.4 lineto
91.5 262.4 lineto
closepath fill
1 setlinewidth
solid
0 0 0 edgecolor
newpath 98.5 262.4 moveto
95 252.4 lineto
91.5 262.4 lineto
closepath stroke
grestore
% mainAction->mainAction
gsave
1 setlinewidth
0 0 0 edgecolor
newpath 126.49 247.17 moveto
141.63 248.8 155 244.41 155 234 curveto
155 226.03 147.16 221.59 136.69 220.68 curveto
stroke
0 0 0 edgecolor
newpath 136.43 217.18 moveto
126.49 220.83 lineto
136.54 224.18 lineto
closepath fill
1 setlinewidth
solid
0 0 0 edgecolor
newpath 136.43 217.18 moveto
126.49 220.83 lineto
136.54 224.18 lineto
closepath stroke
grestore
% secondAction
gsave
1 setlinewidth
0 0 0 nodecolor
56 162 55.9 18 ellipse_path stroke
0 0 0 nodecolor
12 /Helvetica set_font
18 157.7 moveto 76 (secondAction) alignedtext
grestore
% mainAction->secondAction
gsave
1 setlinewidth
0 0 0 edgecolor
newpath 85.36 216.2 moveto
80.86 207.89 75.41 197.83 70.43 188.64 curveto
stroke
0 0 0 edgecolor
newpath 73.51 186.97 moveto
65.66 179.84 lineto
67.35 190.3 lineto
closepath fill
1 setlinewidth
solid
0 0 0 edgecolor
newpath 73.51 186.97 moveto
65.66 179.84 lineto
67.35 190.3 lineto
closepath stroke
grestore
% quit
gsave
1 setlinewidth
0 0 0 nodecolor
95 90 27 18 ellipse_path stroke
0 0 0 nodecolor
12 /Helvetica set_font
85 85.7 moveto 20 (quit) alignedtext
grestore
% mainAction->quit
gsave
1 setlinewidth
0 0 0 edgecolor
newpath 105.21 216.15 moveto
110.46 205.92 116.32 192.65 119 180 curveto
122.32 164.35 122.32 159.65 119 144 curveto
116.99 134.52 113.19 124.69 109.21 116.05 curveto
stroke
0 0 0 edgecolor
newpath 112.26 114.32 moveto
104.71 106.89 lineto
105.97 117.4 lineto
closepath fill
1 setlinewidth
solid
0 0 0 edgecolor
newpath 112.26 114.32 moveto
104.71 106.89 lineto
105.97 117.4 lineto
closepath stroke
grestore
% secondAction->quit
gsave
1 setlinewidth
0 0 0 edgecolor
newpath 65.64 144.2 moveto
70.24 135.71 75.84 125.38 80.9 116.02 curveto
stroke
0 0 0 edgecolor
newpath 84.05 117.56 moveto
85.74 107.1 lineto
77.9 114.22 lineto
closepath fill
1 setlinewidth
solid
0 0 0 edgecolor
newpath 84.05 117.56 moveto
85.74 107.1 lineto
77.9 114.22 lineto
closepath stroke
grestore
% end
gsave
1 setlinewidth
0 0 0 nodecolor
95 18 27 18 ellipse_path stroke
0 0 0 nodecolor
12 /Helvetica set_font
84 13.7 moveto 22 (end) alignedtext
grestore
% quit->end
gsave
1 setlinewidth
0 0 0 edgecolor
newpath 95 71.83 moveto
95 64.13 95 54.97 95 46.42 curveto
stroke
0 0 0 edgecolor
newpath 98.5 46.41 moveto
95 36.41 lineto
91.5 46.41 lineto
closepath fill
1 setlinewidth
solid
0 0 0 edgecolor
newpath 98.5 46.41 moveto
95 36.41 lineto
91.5 46.41 lineto
closepath stroke
grestore
endpage
showpage
grestore
%%PageTrailer
%%EndPage: 1
%%Trailer
%%Pages: 1
%%BoundingBox: 36 36 376 203
end
restore
%%EOF
