%!PS-Adobe-3.0
%%Creator: graphviz version 2.26.3 (20100126.1600)
%%Title: model
%%Pages: (atend)
%%BoundingBox: (atend)
%%EndComments
save
%%BeginProlog
/DotDict 200 dict def
DotDict begin

/setupLatin1 {
mark
/EncodingVector 256 array def
 EncodingVector 0

ISOLatin1Encoding 0 255 getinterval putinterval
EncodingVector 45 /hyphen put

% Set up ISO Latin 1 character encoding
/starnetISO {
        dup dup findfont dup length dict begin
        { 1 index /FID ne { def }{ pop pop } ifelse
        } forall
        /Encoding EncodingVector def
        currentdict end definefont
} def
/Times-Roman starnetISO def
/Times-Italic starnetISO def
/Times-Bold starnetISO def
/Times-BoldItalic starnetISO def
/Helvetica starnetISO def
/Helvetica-Oblique starnetISO def
/Helvetica-Bold starnetISO def
/Helvetica-BoldOblique starnetISO def
/Courier starnetISO def
/Courier-Oblique starnetISO def
/Courier-Bold starnetISO def
/Courier-BoldOblique starnetISO def
cleartomark
} bind def

%%BeginResource: procset graphviz 0 0
/coord-font-family /Times-Roman def
/default-font-family /Times-Roman def
/coordfont coord-font-family findfont 8 scalefont def

/InvScaleFactor 1.0 def
/set_scale {
       dup 1 exch div /InvScaleFactor exch def
       scale
} bind def

% styles
/solid { [] 0 setdash } bind def
/dashed { [9 InvScaleFactor mul dup ] 0 setdash } bind def
/dotted { [1 InvScaleFactor mul 6 InvScaleFactor mul] 0 setdash } bind def
/invis {/fill {newpath} def /stroke {newpath} def /show {pop newpath} def} bind def
/bold { 2 setlinewidth } bind def
/filled { } bind def
/unfilled { } bind def
/rounded { } bind def
/diagonals { } bind def

% hooks for setting color 
/nodecolor { sethsbcolor } bind def
/edgecolor { sethsbcolor } bind def
/graphcolor { sethsbcolor } bind def
/nopcolor {pop pop pop} bind def

/beginpage {	% i j npages
	/npages exch def
	/j exch def
	/i exch def
	/str 10 string def
	npages 1 gt {
		gsave
			coordfont setfont
			0 0 moveto
			(\() show i str cvs show (,) show j str cvs show (\)) show
		grestore
	} if
} bind def

/set_font {
	findfont exch
	scalefont setfont
} def

% draw text fitted to its expected width
/alignedtext {			% width text
	/text exch def
	/width exch def
	gsave
		width 0 gt {
			[] 0 setdash
			text stringwidth pop width exch sub text length div 0 text ashow
		} if
	grestore
} def

/boxprim {				% xcorner ycorner xsize ysize
		4 2 roll
		moveto
		2 copy
		exch 0 rlineto
		0 exch rlineto
		pop neg 0 rlineto
		closepath
} bind def

/ellipse_path {
	/ry exch def
	/rx exch def
	/y exch def
	/x exch def
	matrix currentmatrix
	newpath
	x y translate
	rx ry scale
	0 0 1 0 360 arc
	setmatrix
} bind def

/endpage { showpage } bind def
/showpage { } def

/layercolorseq
	[	% layer color sequence - darkest to lightest
		[0 0 0]
		[.2 .8 .8]
		[.4 .8 .8]
		[.6 .8 .8]
		[.8 .8 .8]
	]
def

/layerlen layercolorseq length def

/setlayer {/maxlayer exch def /curlayer exch def
	layercolorseq curlayer 1 sub layerlen mod get
	aload pop sethsbcolor
	/nodecolor {nopcolor} def
	/edgecolor {nopcolor} def
	/graphcolor {nopcolor} def
} bind def

/onlayer { curlayer ne {invis} if } def

/onlayers {
	/myupper exch def
	/mylower exch def
	curlayer mylower lt
	curlayer myupper gt
	or
	{invis} if
} def

/curlayer 0 def

%%EndResource
%%EndProlog
%%BeginSetup
14 default-font-family set_font
1 setmiterlimit
% /arrowlength 10 def
% /arrowwidth 5 def

% make sure pdfmark is harmless for PS-interpreters other than Distiller
/pdfmark where {pop} {userdict /pdfmark /cleartomark load put} ifelse
% make '<<' and '>>' safe on PS Level 1 devices
/languagelevel where {pop languagelevel}{1} ifelse
2 lt {
    userdict (<<) cvn ([) cvn load put
    userdict (>>) cvn ([) cvn load put
} if

%%EndSetup
setupLatin1
%%Page: 1 1
%%PageBoundingBox: 36 36 260 284
%%PageOrientation: Landscape
0 0 1 beginpage
gsave
36 36 224 248 boxprim clip newpath
1 1 set_scale 90 rotate 40 -256 translate
% connected
gsave
1 setlinewidth
0 0 0 nodecolor
49 194 44.85 18 ellipse_path stroke
1 setlinewidth
0 0 0 nodecolor
49 194 48.85 22 ellipse_path stroke
0 0 0 nodecolor
12 /Helvetica set_font
19.5 189.7 moveto 59 (connected) alignedtext
grestore
% connected->connected
gsave
1 setlinewidth
0 0 0 edgecolor
newpath 97.34 198.06 moveto
105.97 197.53 112 196.18 112 194 curveto
112 192.84 110.3 191.92 107.41 191.23 curveto
stroke
0 0 0 edgecolor
newpath 107.7 187.74 moveto
97.34 189.94 lineto
106.81 194.68 lineto
closepath fill
1 setlinewidth
solid
0 0 0 edgecolor
newpath 107.7 187.74 moveto
97.34 189.94 lineto
106.81 194.68 lineto
closepath stroke
0 0 0 edgecolor
12 /Helvetica set_font
112 189.7 moveto 46 ( writeTo ) alignedtext
grestore
% connected->connected
gsave
1 setlinewidth
0 0 0 edgecolor
newpath 89.33 206.58 moveto
121.47 210.61 158 206.41 158 194 curveto
158 182.89 128.77 178.37 99.6 180.42 curveto
stroke
0 0 0 edgecolor
newpath 98.94 176.96 moveto
89.33 181.42 lineto
99.62 183.93 lineto
closepath fill
1 setlinewidth
solid
0 0 0 edgecolor
newpath 98.94 176.96 moveto
89.33 181.42 lineto
99.62 183.93 lineto
closepath stroke
0 0 0 edgecolor
12 /Helvetica set_font
158 189.7 moveto 60 ( readFrom ) alignedtext
grestore
% closed
gsave
1 setlinewidth
0 0 0 nodecolor
49 104 30.05 18 ellipse_path stroke
0 0 0 nodecolor
12 /Helvetica set_font
30.5 99.7 moveto 37 (closed) alignedtext
grestore
% connected->closed
gsave
1 setlinewidth
0 0 0 edgecolor
newpath 30.85 173.52 moveto
24.28 163.65 19.29 151.48 23 140 curveto
24.27 136.07 26.15 132.21 28.33 128.55 curveto
stroke
0 0 0 edgecolor
newpath 31.42 130.23 moveto
34.17 120 lineto
25.64 126.28 lineto
closepath fill
1 setlinewidth
solid
0 0 0 edgecolor
newpath 31.42 130.23 moveto
34.17 120 lineto
25.64 126.28 lineto
closepath stroke
0 0 0 edgecolor
12 /Helvetica set_font
23 142.7 moveto 37 ( close ) alignedtext
grestore
% connected->closed
gsave
1 setlinewidth
0 0 0 edgecolor
newpath 56.3 172.01 moveto
58.71 162.24 60.44 150.58 59 140 curveto
58.63 137.26 58.1 134.44 57.48 131.63 curveto
stroke
0 0 0 edgecolor
newpath 60.82 130.57 moveto
54.96 121.75 lineto
54.04 132.3 lineto
closepath fill
1 setlinewidth
solid
0 0 0 edgecolor
newpath 60.82 130.57 moveto
54.96 121.75 lineto
54.04 132.3 lineto
closepath stroke
0 0 0 edgecolor
12 /Helvetica set_font
59 142.7 moveto 46 ( writeTo ) alignedtext
grestore
% closed->closed
gsave
1 setlinewidth
0 1 1 edgecolor
newpath 78.61 107.91 moveto
86.77 107.72 93 106.42 93 104 curveto
93 102.75 91.34 101.8 88.62 101.15 curveto
stroke
0 1 1 edgecolor
newpath 88.93 97.66 moveto
78.61 100.09 lineto
88.19 104.62 lineto
closepath fill
1 setlinewidth
solid
0 1 1 edgecolor
newpath 88.93 97.66 moveto
78.61 100.09 lineto
88.19 104.62 lineto
closepath stroke
0 0 0 edgecolor
12 /Helvetica set_font
93 99.7 moveto 61 ( Exception ) alignedtext
grestore
% closed->closed
gsave
1 setlinewidth
0 0 0 edgecolor
newpath 73.81 114.32 moveto
106.06 121.09 154 117.65 154 104 curveto
154 91.73 115.31 87.71 84.06 91.93 curveto
stroke
0 0 0 edgecolor
newpath 83.08 88.55 moveto
73.81 93.68 lineto
84.26 95.45 lineto
closepath fill
1 setlinewidth
solid
0 0 0 edgecolor
newpath 83.08 88.55 moveto
73.81 93.68 lineto
84.26 95.45 lineto
closepath stroke
0 0 0 edgecolor
12 /Helvetica set_font
154 99.7 moveto 46 ( writeTo ) alignedtext
grestore
% end
gsave
1 setlinewidth
0 0 0 nodecolor
49 18 27 18 ellipse_path stroke
0 0 0 nodecolor
12 /Helvetica set_font
38 13.7 moveto 22 (end) alignedtext
grestore
% closed->end
gsave
1 setlinewidth
0 0 0 edgecolor
newpath 49 85.76 moveto
49 74.36 49 59.43 49 46.49 curveto
stroke
0 0 0 edgecolor
newpath 52.5 46.21 moveto
49 36.21 lineto
45.5 46.21 lineto
closepath fill
1 setlinewidth
solid
0 0 0 edgecolor
newpath 52.5 46.21 moveto
49 36.21 lineto
45.5 46.21 lineto
closepath stroke
0 0 0 edgecolor
12 /Helvetica set_font
49 56.7 moveto 49 ( cleanup ) alignedtext
grestore
endpage
showpage
grestore
%%PageTrailer
%%EndPage: 1
%%Trailer
%%Pages: 1
%%BoundingBox: 36 36 260 284
end
restore
%%EOF
