%!PS-Adobe-3.0
%%Creator: graphviz version 2.26.3 (20100126.1600)
%%Title: model
%%Pages: (atend)
%%BoundingBox: (atend)
%%EndComments
save
%%BeginProlog
/DotDict 200 dict def
DotDict begin

/setupLatin1 {
mark
/EncodingVector 256 array def
 EncodingVector 0

ISOLatin1Encoding 0 255 getinterval putinterval
EncodingVector 45 /hyphen put

% Set up ISO Latin 1 character encoding
/starnetISO {
        dup dup findfont dup length dict begin
        { 1 index /FID ne { def }{ pop pop } ifelse
        } forall
        /Encoding EncodingVector def
        currentdict end definefont
} def
/Times-Roman starnetISO def
/Times-Italic starnetISO def
/Times-Bold starnetISO def
/Times-BoldItalic starnetISO def
/Helvetica starnetISO def
/Helvetica-Oblique starnetISO def
/Helvetica-Bold starnetISO def
/Helvetica-BoldOblique starnetISO def
/Courier starnetISO def
/Courier-Oblique starnetISO def
/Courier-Bold starnetISO def
/Courier-BoldOblique starnetISO def
cleartomark
} bind def

%%BeginResource: procset graphviz 0 0
/coord-font-family /Times-Roman def
/default-font-family /Times-Roman def
/coordfont coord-font-family findfont 8 scalefont def

/InvScaleFactor 1.0 def
/set_scale {
       dup 1 exch div /InvScaleFactor exch def
       scale
} bind def

% styles
/solid { [] 0 setdash } bind def
/dashed { [9 InvScaleFactor mul dup ] 0 setdash } bind def
/dotted { [1 InvScaleFactor mul 6 InvScaleFactor mul] 0 setdash } bind def
/invis {/fill {newpath} def /stroke {newpath} def /show {pop newpath} def} bind def
/bold { 2 setlinewidth } bind def
/filled { } bind def
/unfilled { } bind def
/rounded { } bind def
/diagonals { } bind def

% hooks for setting color 
/nodecolor { sethsbcolor } bind def
/edgecolor { sethsbcolor } bind def
/graphcolor { sethsbcolor } bind def
/nopcolor {pop pop pop} bind def

/beginpage {	% i j npages
	/npages exch def
	/j exch def
	/i exch def
	/str 10 string def
	npages 1 gt {
		gsave
			coordfont setfont
			0 0 moveto
			(\() show i str cvs show (,) show j str cvs show (\)) show
		grestore
	} if
} bind def

/set_font {
	findfont exch
	scalefont setfont
} def

% draw text fitted to its expected width
/alignedtext {			% width text
	/text exch def
	/width exch def
	gsave
		width 0 gt {
			[] 0 setdash
			text stringwidth pop width exch sub text length div 0 text ashow
		} if
	grestore
} def

/boxprim {				% xcorner ycorner xsize ysize
		4 2 roll
		moveto
		2 copy
		exch 0 rlineto
		0 exch rlineto
		pop neg 0 rlineto
		closepath
} bind def

/ellipse_path {
	/ry exch def
	/rx exch def
	/y exch def
	/x exch def
	matrix currentmatrix
	newpath
	x y translate
	rx ry scale
	0 0 1 0 360 arc
	setmatrix
} bind def

/endpage { showpage } bind def
/showpage { } def

/layercolorseq
	[	% layer color sequence - darkest to lightest
		[0 0 0]
		[.2 .8 .8]
		[.4 .8 .8]
		[.6 .8 .8]
		[.8 .8 .8]
	]
def

/layerlen layercolorseq length def

/setlayer {/maxlayer exch def /curlayer exch def
	layercolorseq curlayer 1 sub layerlen mod get
	aload pop sethsbcolor
	/nodecolor {nopcolor} def
	/edgecolor {nopcolor} def
	/graphcolor {nopcolor} def
} bind def

/onlayer { curlayer ne {invis} if } def

/onlayers {
	/myupper exch def
	/mylower exch def
	curlayer mylower lt
	curlayer myupper gt
	or
	{invis} if
} def

/curlayer 0 def

%%EndResource
%%EndProlog
%%BeginSetup
14 default-font-family set_font
1 setmiterlimit
% /arrowlength 10 def
% /arrowwidth 5 def

% make sure pdfmark is harmless for PS-interpreters other than Distiller
/pdfmark where {pop} {userdict /pdfmark /cleartomark load put} ifelse
% make '<<' and '>>' safe on PS Level 1 devices
/languagelevel where {pop languagelevel}{1} ifelse
2 lt {
    userdict (<<) cvn ([) cvn load put
    userdict (>>) cvn ([) cvn load put
} if

%%EndSetup
setupLatin1
%%Page: 1 1
%%PageBoundingBox: 36 36 604 757
%%PageOrientation: Landscape
0 0 1 beginpage
gsave
36 36 568 721 boxprim clip newpath
1 1 set_scale 90 rotate 40 -600 translate
% open
gsave
1 setlinewidth
0 0 0 nodecolor
498 538 27 18 ellipse_path stroke
1 setlinewidth
0 0 0 nodecolor
498 538 31 22 ellipse_path stroke
0 0 0 nodecolor
12 /Helvetica set_font
483.5 533.7 moveto 29 (open) alignedtext
grestore
% open->open
gsave
1 setlinewidth
0 1 1 edgecolor
newpath 528.71 542.27 moveto
536.84 542.03 543 540.61 543 538 curveto
543 536.66 541.36 535.63 538.66 534.91 curveto
stroke
0 1 1 edgecolor
newpath 539.05 531.43 moveto
528.71 533.73 lineto
538.22 538.38 lineto
closepath fill
1 setlinewidth
solid
0 1 1 edgecolor
newpath 539.05 531.43 moveto
528.71 533.73 lineto
538.22 538.38 lineto
closepath stroke
0 0 0 edgecolor
12 /Helvetica set_font
543 533.7 moveto 61 ( Exception ) alignedtext
grestore
% open->open
gsave
1 setlinewidth
0 0 0 edgecolor
newpath 524.92 548.97 moveto
557.44 555.43 604 551.77 604 538 curveto
604 525.58 566.09 521.38 534.79 525.43 curveto
stroke
0 0 0 edgecolor
newpath 534.23 521.97 moveto
524.92 527.03 lineto
535.35 528.88 lineto
closepath fill
1 setlinewidth
solid
0 0 0 edgecolor
newpath 534.23 521.97 moveto
524.92 527.03 lineto
535.35 528.88 lineto
closepath stroke
0 0 0 edgecolor
12 /Helvetica set_font
604 533.7 moveto 87 ( toggleBlocking ) alignedtext
grestore
% bound
gsave
1 setlinewidth
0 0 0 nodecolor
320 448 29.25 18 ellipse_path stroke
0 0 0 nodecolor
12 /Helvetica set_font
302.5 443.7 moveto 35 (bound) alignedtext
grestore
% open->bound
gsave
1 setlinewidth
0 0 0 edgecolor
newpath 472.5 525.11 moveto
440.69 509.02 386.3 481.52 351.8 464.08 curveto
stroke
0 0 0 edgecolor
newpath 353.14 460.83 moveto
342.64 459.45 lineto
349.98 467.08 lineto
closepath fill
1 setlinewidth
solid
0 0 0 edgecolor
newpath 353.14 460.83 moveto
342.64 459.45 lineto
349.98 467.08 lineto
closepath stroke
0 0 0 edgecolor
12 /Helvetica set_font
414 486.7 moveto 29 ( bind ) alignedtext
grestore
% closed
gsave
1 setlinewidth
0 0 0 nodecolor
406 18 30.05 18 ellipse_path stroke
0 0 0 nodecolor
12 /Helvetica set_font
387.5 13.7 moveto 37 (closed) alignedtext
grestore
% open->closed
gsave
1 setlinewidth
0 0 0 edgecolor
newpath 521.1 523.1 moveto
542.48 507.3 571 480.19 571 448 curveto
571 448 571 448 571 104 curveto
571 47.75 494.67 28.24 445.84 21.5 curveto
stroke
0 0 0 edgecolor
newpath 446.24 18.03 moveto
435.88 20.25 lineto
445.37 24.97 lineto
closepath fill
1 setlinewidth
solid
0 0 0 edgecolor
newpath 446.24 18.03 moveto
435.88 20.25 lineto
445.37 24.97 lineto
closepath stroke
0 0 0 edgecolor
12 /Helvetica set_font
571 271.7 moveto 37 ( close ) alignedtext
grestore
% bound->bound
gsave
1 setlinewidth
0 1 1 edgecolor
newpath 348.53 451.92 moveto
356.7 451.77 363 450.46 363 448 curveto
363 446.73 361.33 445.77 358.58 445.11 curveto
stroke
0 1 1 edgecolor
newpath 358.84 441.62 moveto
348.53 444.08 lineto
358.12 448.58 lineto
closepath fill
1 setlinewidth
solid
0 1 1 edgecolor
newpath 358.84 441.62 moveto
348.53 444.08 lineto
358.12 448.58 lineto
closepath stroke
0 0 0 edgecolor
12 /Helvetica set_font
363 443.7 moveto 61 ( Exception ) alignedtext
grestore
% bound->bound
gsave
1 setlinewidth
0 0 0 edgecolor
newpath 344.27 458.27 moveto
376.19 465.11 424 461.69 424 448 curveto
424 435.7 385.41 431.69 354.42 435.97 curveto
stroke
0 0 0 edgecolor
newpath 353.52 432.57 moveto
344.27 437.73 lineto
354.72 439.47 lineto
closepath fill
1 setlinewidth
solid
0 0 0 edgecolor
newpath 353.52 432.57 moveto
344.27 437.73 lineto
354.72 439.47 lineto
closepath stroke
0 0 0 edgecolor
12 /Helvetica set_font
424 443.7 moveto 87 ( toggleBlocking ) alignedtext
grestore
% port
gsave
1 setlinewidth
0 0 0 nodecolor
320 362 27 18 ellipse_path stroke
0 0 0 nodecolor
12 /Helvetica set_font
309 357.7 moveto 22 (port) alignedtext
grestore
% bound->port
gsave
1 setlinewidth
0 0 0 edgecolor
newpath 320 429.76 moveto
320 418.36 320 403.43 320 390.49 curveto
stroke
0 0 0 edgecolor
newpath 323.5 390.21 moveto
320 380.21 lineto
316.5 390.21 lineto
closepath fill
1 setlinewidth
solid
0 0 0 edgecolor
newpath 323.5 390.21 moveto
320 380.21 lineto
316.5 390.21 lineto
closepath stroke
0 0 0 edgecolor
12 /Helvetica set_font
320 400.7 moveto 76 ( getLocalPort ) alignedtext
grestore
% bound->closed
gsave
1 setlinewidth
0 0 0 edgecolor
newpath 291.04 446.41 moveto
212.27 441.3 0 421.97 0 362 curveto
0 362 0 362 0 104 curveto
0 66.82 263.94 33.69 366.2 22.25 curveto
stroke
0 0 0 edgecolor
newpath 366.59 25.72 moveto
376.15 21.14 lineto
365.82 18.77 lineto
closepath fill
1 setlinewidth
solid
0 0 0 edgecolor
newpath 366.59 25.72 moveto
376.15 21.14 lineto
365.82 18.77 lineto
closepath stroke
0 0 0 edgecolor
12 /Helvetica set_font
0 228.7 moveto 37 ( close ) alignedtext
grestore
% port->port
gsave
1 setlinewidth
0 1 1 edgecolor
newpath 344.41 369.86 moveto
353.51 370.12 361 367.5 361 362 curveto
361 358.82 358.5 356.61 354.63 355.35 curveto
stroke
0 1 1 edgecolor
newpath 354.76 351.84 moveto
344.41 354.14 lineto
353.93 358.79 lineto
closepath fill
1 setlinewidth
solid
0 1 1 edgecolor
newpath 354.76 351.84 moveto
344.41 354.14 lineto
353.93 358.79 lineto
closepath stroke
0 0 0 edgecolor
12 /Helvetica set_font
361 357.7 moveto 61 ( Exception ) alignedtext
grestore
% selector
gsave
1 setlinewidth
0 0 0 nodecolor
273 276 35.9 18 ellipse_path stroke
0 0 0 nodecolor
12 /Helvetica set_font
250 271.7 moveto 46 (selector) alignedtext
grestore
% port->selector
gsave
1 setlinewidth
0 0 0 edgecolor
newpath 310.71 345.01 moveto
304.11 332.92 295.1 316.43 287.54 302.61 curveto
stroke
0 0 0 edgecolor
newpath 290.46 300.64 moveto
282.59 293.55 lineto
284.31 304 lineto
closepath fill
1 setlinewidth
solid
0 0 0 edgecolor
newpath 290.46 300.64 moveto
282.59 293.55 lineto
284.31 304 lineto
closepath stroke
0 0 0 edgecolor
12 /Helvetica set_font
299 314.7 moveto 85 ( configSelector ) alignedtext
grestore
% port->closed
gsave
1 setlinewidth
0 0 0 edgecolor
newpath 345.89 356.13 moveto
398.3 343.51 512 311.98 512 276 curveto
512 276 512 276 512 104 curveto
512 67.22 473.04 43.43 442.36 30.39 curveto
stroke
0 0 0 edgecolor
newpath 443.33 27.01 moveto
432.75 26.54 lineto
440.73 33.51 lineto
closepath fill
1 setlinewidth
solid
0 0 0 edgecolor
newpath 443.33 27.01 moveto
432.75 26.54 lineto
440.73 33.51 lineto
closepath stroke
0 0 0 edgecolor
12 /Helvetica set_font
512 185.7 moveto 37 ( close ) alignedtext
grestore
% selector->selector
gsave
1 setlinewidth
0 1 1 edgecolor
newpath 305.7 283.86 moveto
315.43 283.62 323 281 323 276 curveto
323 272.95 320.19 270.79 315.79 269.51 curveto
stroke
0 1 1 edgecolor
newpath 316.08 266.02 moveto
305.7 268.14 lineto
315.14 272.95 lineto
closepath fill
1 setlinewidth
solid
0 1 1 edgecolor
newpath 316.08 266.02 moveto
305.7 268.14 lineto
315.14 272.95 lineto
closepath stroke
0 0 0 edgecolor
12 /Helvetica set_font
323 271.7 moveto 61 ( Exception ) alignedtext
grestore
% connected
gsave
1 setlinewidth
0 0 0 nodecolor
180 104 44.85 18 ellipse_path stroke
0 0 0 nodecolor
12 /Helvetica set_font
150.5 99.7 moveto 59 (connected) alignedtext
grestore
% selector->connected
gsave
1 setlinewidth
0 0 0 edgecolor
newpath 245.63 263.99 moveto
224.04 252.89 195.42 234.14 182 208 curveto
169.95 184.53 171.01 153.98 174.13 132.07 curveto
stroke
0 0 0 edgecolor
newpath 177.6 132.51 moveto
175.78 122.08 lineto
170.7 131.37 lineto
closepath fill
1 setlinewidth
solid
0 0 0 edgecolor
newpath 177.6 132.51 moveto
175.78 122.08 lineto
170.7 131.37 lineto
closepath stroke
0 0 0 edgecolor
12 /Helvetica set_font
182 185.7 moveto 43 ( accept ) alignedtext
grestore
% accepting
gsave
1 setlinewidth
0 0 0 nodecolor
273 190 40.95 18 ellipse_path stroke
0 0 0 nodecolor
12 /Helvetica set_font
246.5 185.7 moveto 53 (accepting) alignedtext
grestore
% selector->accepting
gsave
1 setlinewidth
0 0 0 edgecolor
newpath 273 257.76 moveto
273 246.36 273 231.43 273 218.49 curveto
stroke
0 0 0 edgecolor
newpath 276.5 218.21 moveto
273 208.21 lineto
269.5 218.21 lineto
closepath fill
1 setlinewidth
solid
0 0 0 edgecolor
newpath 276.5 218.21 moveto
273 208.21 lineto
269.5 218.21 lineto
closepath stroke
0 0 0 edgecolor
12 /Helvetica set_font
273 228.7 moveto 63 ( startClient ) alignedtext
grestore
% selector->closed
gsave
1 setlinewidth
0 0 0 edgecolor
newpath 306.09 268.81 moveto
355.01 257.45 442.81 233.93 461 208 curveto
479.65 181.42 440.73 90.42 419.12 44.68 curveto
stroke
0 0 0 edgecolor
newpath 422.14 42.9 moveto
414.67 35.39 lineto
415.83 45.92 lineto
closepath fill
1 setlinewidth
solid
0 0 0 edgecolor
newpath 422.14 42.9 moveto
414.67 35.39 lineto
415.83 45.92 lineto
closepath stroke
0 0 0 edgecolor
12 /Helvetica set_font
460 142.7 moveto 37 ( close ) alignedtext
grestore
% connected->selector
gsave
1 setlinewidth
0 0 0 edgecolor
newpath 148.17 116.75 moveto
107.4 134.98 45.07 170.46 72 208 curveto
90.61 233.94 176.16 255.93 229.48 267.42 curveto
stroke
0 0 0 edgecolor
newpath 228.85 270.87 moveto
239.36 269.51 lineto
230.3 264.02 lineto
closepath fill
1 setlinewidth
solid
0 0 0 edgecolor
newpath 228.85 270.87 moveto
239.36 269.51 lineto
230.3 264.02 lineto
closepath stroke
0 0 0 edgecolor
12 /Helvetica set_font
72 185.7 moveto 97 ( checkReadWrite ) alignedtext
grestore
% connected->connected
gsave
1 setlinewidth
0 1 1 edgecolor
newpath 220.81 111.78 moveto
231.2 111.27 239 108.68 239 104 curveto
239 101 235.8 98.86 230.77 97.58 curveto
stroke
0 1 1 edgecolor
newpath 231.19 94.1 moveto
220.81 96.22 lineto
230.25 101.04 lineto
closepath fill
1 setlinewidth
solid
0 1 1 edgecolor
newpath 231.19 94.1 moveto
220.81 96.22 lineto
230.25 101.04 lineto
closepath stroke
0 0 0 edgecolor
12 /Helvetica set_font
239 99.7 moveto 61 ( Exception ) alignedtext
grestore
% connected->closed
gsave
1 setlinewidth
0 0 0 edgecolor
newpath 211.17 90.83 moveto
235.94 80.48 271.52 65.89 303 54 curveto
325.13 45.64 350.19 36.87 370.04 30.08 curveto
stroke
0 0 0 edgecolor
newpath 371.28 33.35 moveto
379.62 26.81 lineto
369.03 26.72 lineto
closepath fill
1 setlinewidth
solid
0 0 0 edgecolor
newpath 371.28 33.35 moveto
379.62 26.81 lineto
369.03 26.72 lineto
closepath stroke
0 0 0 edgecolor
12 /Helvetica set_font
303 56.7 moveto 37 ( close ) alignedtext
grestore
% accepting->connected
gsave
1 setlinewidth
dashed
0 0 0 edgecolor
newpath 255.07 173.42 moveto
240.92 160.33 221 141.91 205.24 127.34 curveto
stroke
0 0 0 edgecolor
newpath 207.59 124.75 moveto
197.88 120.53 lineto
202.84 129.89 lineto
closepath fill
1 setlinewidth
solid
0 0 0 edgecolor
newpath 207.59 124.75 moveto
197.88 120.53 lineto
202.84 129.89 lineto
closepath stroke
0 0 0 edgecolor
12 /Helvetica set_font
232 142.7 moveto 52 ( \(accept\) ) alignedtext
grestore
% accepting->accepting
gsave
1 setlinewidth
0 1 1 edgecolor
newpath 304.66 201.56 moveto
334.54 206.58 371 202.73 371 190 curveto
371 178.67 342.08 174.37 314.64 177.11 curveto
stroke
0 1 1 edgecolor
newpath 314.11 173.65 moveto
304.66 178.44 lineto
315.04 180.59 lineto
closepath fill
1 setlinewidth
solid
0 1 1 edgecolor
newpath 314.11 173.65 moveto
304.66 178.44 lineto
315.04 180.59 lineto
closepath stroke
0 0 0 edgecolor
12 /Helvetica set_font
371 185.7 moveto 61 ( Exception ) alignedtext
grestore
% accepting->accepting
gsave
1 setlinewidth
0 0 0 edgecolor
newpath 313.53 193.8 moveto
321.95 193.4 328 192.13 328 190 curveto
328 188.9 326.39 188.03 323.68 187.39 curveto
stroke
0 0 0 edgecolor
newpath 323.87 183.89 moveto
313.53 186.2 lineto
323.06 190.84 lineto
closepath fill
1 setlinewidth
solid
0 0 0 edgecolor
newpath 323.87 183.89 moveto
313.53 186.2 lineto
323.06 190.84 lineto
closepath stroke
0 0 0 edgecolor
12 /Helvetica set_font
328 185.7 moveto 43 ( accept ) alignedtext
grestore
% accepting->closed
gsave
1 setlinewidth
0 0 0 edgecolor
newpath 286.24 172.88 moveto
309.86 142.33 359.36 78.31 386.75 42.9 curveto
stroke
0 0 0 edgecolor
newpath 389.86 44.6 moveto
393.21 34.55 lineto
384.32 40.32 lineto
closepath fill
1 setlinewidth
solid
0 0 0 edgecolor
newpath 389.86 44.6 moveto
393.21 34.55 lineto
384.32 40.32 lineto
closepath stroke
0 0 0 edgecolor
12 /Helvetica set_font
352 99.7 moveto 37 ( close ) alignedtext
grestore
% closed->closed
gsave
1 setlinewidth
0 0 0 edgecolor
newpath 435.61 21.91 moveto
443.77 21.72 450 20.42 450 18 curveto
450 16.75 448.34 15.8 445.62 15.15 curveto
stroke
0 0 0 edgecolor
newpath 445.93 11.66 moveto
435.61 14.09 lineto
445.19 18.62 lineto
closepath fill
1 setlinewidth
solid
0 0 0 edgecolor
newpath 445.93 11.66 moveto
435.61 14.09 lineto
445.19 18.62 lineto
closepath stroke
0 0 0 edgecolor
12 /Helvetica set_font
450 13.7 moveto 37 ( close ) alignedtext
grestore
% closed->closed
gsave
1 setlinewidth
0 1 1 edgecolor
newpath 430.04 29.07 moveto
455.14 34.81 487 31.12 487 18 curveto
487 6.57 462.83 2.3 440 5.18 curveto
stroke
0 1 1 edgecolor
newpath 439.29 1.76 moveto
430.04 6.93 lineto
440.5 8.65 lineto
closepath fill
1 setlinewidth
solid
0 1 1 edgecolor
newpath 439.29 1.76 moveto
430.04 6.93 lineto
440.5 8.65 lineto
closepath stroke
0 0 0 edgecolor
12 /Helvetica set_font
487 13.7 moveto 61 ( Exception ) alignedtext
grestore
endpage
showpage
grestore
%%PageTrailer
%%EndPage: 1
%%Trailer
%%Pages: 1
%%BoundingBox: 36 36 604 757
end
restore
%%EOF
