digraph model {
  orientation = landscape;
  graph [ rankdir = "TB", sep="0.5", nodesep="0.2" ];
  node [ fontname = "Helvetica", fontsize="12.0", margin="0.07" ];
  edge [ fontname = "Helvetica", fontsize="12.0", margin="0.05" ];
  "connected" [ peripheries = "2.0" ];
  connected	-> connected [ label = " writeTo " ];
  connected	-> connected [ label = " readFrom " ];
  connected	-> closed [ label = " close " ];
  connected	-> closed [ label = " writeTo " ];
  closed	-> closed [ label = " Exception " color = "red" ];
  closed	-> closed [ label = " writeTo " ];
  closed	-> end [ label = " cleanup " ];
}
