[{"Code":"YPPF","Name":"ADELAIDE/Parafield","CTAF":"118.7","Category":"CERT","Lat":"-34.7933","Lng":"138.6331"},
{"Code":"YABA","Name":"ALBANY","CTAF":"127.85","Category":"CERT","Lat":"-34.9433","Lng":"117.8089"},
{"Code":"YMAY","Name":"ALBURY","CTAF":"123.25","Category":"CERT","Lat":"-36.0678","Lng":"146.9581"},
{"Code":"YBAS","Name":"ALICE SPRINGS","CTAF":"118.3","Category":"CERT","Lat":"-23.8083","Lng":"133.9008"},
{"Code":"YAPH","Name":"ALPHA","CTAF":"126.7","Category":"REG","Lat":"-23.6461","Lng":"146.5836"},
{"Code":"YAMB","Name":"AMBERLEY","CTAF":"118.3","Category":"MIL","Lat":"-27.6406","Lng":"152.7119"},
{"Code":"YARA","Name":"ARARAT","CTAF":"126.7","Category":"REG","Lat":"-37.3094","Lng":"142.9886"},
{"Code":"YARG","Name":"ARGYLE","CTAF":"127.3","Category":"CERT","Lat":"-16.6369","Lng":"128.4514"},
{"Code":"YARM","Name":"ARMIDALE","CTAF":"127.5","Category":"CERT","Lat":"-30.5281","Lng":"151.6172"},
{"Code":"YAUR","Name":"AURUKUN","CTAF":"126.7","Category":"CERT","Lat":"-13.3539","Lng":"141.7208"},
{"Code":"YMAV","Name":"AVALON","CTAF":"120.1","Category":"CERT","Lat":"-38.0394","Lng":"144.4694"},
{"Code":"YAYE","Name":"AYERS ROCK/CONNELLAN","CTAF":"126.9","Category":"CERT","Lat":"-25.1861","Lng":"130.9756"},
{"Code":"YBNS","Name":"BAIRNSDALE","CTAF":"126.7","Category":"REG","Lat":"-37.8875","Lng":"147.5678"},
{"Code":"YBGO","Name":"BALGO HILL","CTAF":"126.7","Category":"REG","Lat":"-20.1483","Lng":"127.9739"},
{"Code":"YBLT","Name":"BALLARAT","CTAF":"127.75","Category":"REG","Lat":"-37.5117","Lng":"143.7911"},
{"Code":"YLLE","Name":"BALLERA","CTAF":"126.7","Category":"CERT","Lat":"-27.4083","Lng":"141.8083"},
{"Code":"YBNA","Name":"BALLINA/BYRON GATEWAY","CTAF":"124.2","Category":"CERT","Lat":"-28.8339","Lng":"153.5625"},
{"Code":"YBRN","Name":"BALRANALD","CTAF":"126.7","Category":"REG","Lat":"-34.6236","Lng":"143.5783"},
{"Code":"YBAR","Name":"BARCALDINE","CTAF":"126.7","Category":"CERT","Lat":"-23.5653","Lng":"145.3067"},
{"Code":"YBRY","Name":"BARIMUNYA","CTAF":"127.05","Category":"CERT","Lat":"-22.6739","Lng":"119.1661"},
{"Code":"YBWX","Name":"BARROW ISLAND","CTAF":"120.1","Category":"CERT","Lat":"-20.8644","Lng":"115.4061"},
{"Code":"YBTH","Name":"BATHURST","CTAF":"127.35","Category":"CERT","Lat":"-33.4094","Lng":"149.6519"},
{"Code":"YBTI","Name":"BATHURST ISLAND","CTAF":"126.5","Category":"REG","Lat":"-11.7692","Lng":"130.6197"},
{"Code":"YBIE","Name":"BEDOURIE","CTAF":"126.7","Category":"CERT","Lat":"-24.3461","Lng":"139.4603"},
{"Code":"YBLU","Name":"BELLEVUE","CTAF":"126.5","Category":"REG","Lat":"-27.6128","Lng":"120.5939"},
{"Code":"YBLA","Name":"BENALLA","CTAF":"125.6","Category":"REG","Lat":"-36.5542","Lng":"146.0092"},
{"Code":"YBDG","Name":"BENDIGO","CTAF":"119.3","Category":"REG","Lat":"-36.7394","Lng":"144.3297"},
{"Code":"YBIR","Name":"BIRCHIP","CTAF":"126.7","Category":"REG","Lat":"-35.9997","Lng":"142.9175"},
{"Code":"YBDV","Name":"BIRDSVILLE","CTAF":"126.7","Category":"CERT","Lat":"-25.8975","Lng":"139.3475"},
{"Code":"YBCK","Name":"BLACKALL","CTAF":"126.7","Category":"CERT","Lat":"-24.4278","Lng":"145.4286"},
{"Code":"YBGD","Name":"BOOLGEEDA","CTAF":"126.7","Category":"CERT","Lat":"-22.5411","Lng":"117.2694"},
{"Code":"YBOU","Name":"BOULIA","CTAF":"126.7","Category":"CERT","Lat":"-22.9133","Lng":"139.8997"},
{"Code":"YBKE","Name":"BOURKE","CTAF":"126.7","Category":"CERT","Lat":"-30.0392","Lng":"145.9517"},
{"Code":"YBWN","Name":"BOWEN","CTAF":"126.7","Category":"REG","Lat":"-20.0178","Lng":"148.2153"},
{"Code":"YBRW","Name":"BREWARRINA","CTAF":"126.7","Category":"REG","Lat":"-29.9739","Lng":"146.8167"},
{"Code":"YBWW","Name":"BRISBANE WEST WELLCAMP","CTAF":"127.65","Category":"CERT","Lat":"-27.5586","Lng":"151.7942"},
{"Code":"YBAF","Name":"BRISBANE/Archerfield","CTAF":"118.1","Category":"CERT","Lat":"-27.5703","Lng":"153.0081"},
{"Code":"YBHI","Name":"BROKEN HILL","CTAF":"126.7","Category":"CERT","Lat":"-32.0014","Lng":"141.4717"},
{"Code":"YBRM","Name":"BROOME/INTL","CTAF":"126.0","Category":"CERT","Lat":"-17.9494","Lng":"122.2278"},
{"Code":"YBUN","Name":"BUNBURY","CTAF":"126.7","Category":"REG","Lat":"-33.3781","Lng":"115.6769"},
{"Code":"YBUD","Name":"BUNDABERG","CTAF":"126.9","Category":"CERT","Lat":"-24.9039","Lng":"152.3186"},
{"Code":"YBKT","Name":"BURKETOWN","CTAF":"126.7","Category":"CERT","Lat":"-17.7486","Lng":"139.5345"},
{"Code":"YBLN","Name":"BUSSELTON","CTAF":"127.0","Category":"CERT","Lat":"-33.6872","Lng":"115.4003"},
{"Code":"YSCN","Name":"CAMDEN","CTAF":"120.1","Category":"REG","Lat":"-34.0403","Lng":"150.6872"},
{"Code":"YCMW","Name":"CAMOOWEAL","CTAF":"126.7","Category":"REG","Lat":"-19.9117","Lng":"138.125"},
{"Code":"YSCB","Name":"CANBERRA","CTAF":"118.7","Category":"CERT","Lat":"-35.3069","Lng":"149.195"},
{"Code":"YCAR","Name":"CARNARVON","CTAF":"126.7","Category":"CERT","Lat":"-24.8806","Lng":"113.6722"},
{"Code":"YCDU","Name":"CEDUNA","CTAF":"126.7","Category":"CERT","Lat":"-32.1306","Lng":"133.7097"},
{"Code":"YCNY","Name":"CENTURY MINE","CTAF":"126.7","Category":"REG","Lat":"-18.7533","Lng":"138.7067"},
{"Code":"YCNK","Name":"CESSNOCK","CTAF":"122.65","Category":"REG","Lat":"-32.7875","Lng":"151.3417"},
{"Code":"YBCV","Name":"CHARLEVILLE","CTAF":"126.7","Category":"CERT","Lat":"-26.4133","Lng":"146.2625"},
{"Code":"YCHT","Name":"CHARTERS TOWERS","CTAF":"126.7","Category":"REG","Lat":"-20.0431","Lng":"146.2731"},
{"Code":"YCGO","Name":"CHILLAGOE","CTAF":"126.7","Category":"REG","Lat":"-17.1408","Lng":"144.5283"},
{"Code":"YCCA","Name":"CHINCHILLA","CTAF":"126.35","Category":"CERT","Lat":"-26.7694","Lng":"150.6167"},
{"Code":"YCHK","Name":"CHRISTMAS CREEK","CTAF":"127.05","Category":"CERT","Lat":"-22.3558","Lng":"119.6425"},
{"Code":"YPXM","Name":"CHRISTMAS ISLAND","CTAF":"122.8","Category":"CERT","Lat":"-10.4506","Lng":"105.6903"},
{"Code":"YCMT","Name":"CLERMONT","CTAF":"126.7","Category":"CERT","Lat":"-22.7731","Lng":"147.6206"},
{"Code":"YCEE","Name":"CLEVE","CTAF":"126.7","Category":"REG","Lat":"-33.7097","Lng":"136.5047"},
{"Code":"YCCY","Name":"CLONCURRY","CTAF":"126.7","Category":"CERT","Lat":"-20.6686","Lng":"140.5044"},
{"Code":"YCBA","Name":"COBAR","CTAF":"126.7","Category":"CERT","Lat":"-31.5383","Lng":"145.7939"},
{"Code":"YPCC","Name":"COCOS (Keeling) ISLAND","CTAF":"118.1","Category":"CERT","Lat":"-12.1886","Lng":"96.8306"},
{"Code":"YCOE","Name":"COEN","CTAF":"126.7","Category":"CERT","Lat":"-13.7619","Lng":"143.1167"},
{"Code":"YCFS","Name":"COFFS HARBOUR","CTAF":"118.2","Category":"CERT","Lat":"-30.3206","Lng":"153.1164"},
{"Code":"YCDO","Name":"CONDOBOLIN","CTAF":"126.7","Category":"REG","Lat":"-33.0644","Lng":"147.2092"},
{"Code":"YCBP","Name":"COOBER PEDY","CTAF":"126.7","Category":"CERT","Lat":"-29.04","Lng":"134.7208"},
{"Code":"YCKN","Name":"COOKTOWN","CTAF":"126.7","Category":"CERT","Lat":"-15.4447","Lng":"145.1844"},
{"Code":"YCAH","Name":"COOLAH","CTAF":"126.7","Category":"REG","Lat":"-31.7733","Lng":"149.6095"},
{"Code":"YCOM","Name":"COOMA - SNOWY MOUNTAINS","CTAF":"118.1","Category":"CERT","Lat":"-36.3006","Lng":"148.9739"},
{"Code":"YCBB","Name":"COONABARABRAN","CTAF":"126.7","Category":"REG","Lat":"-31.3325","Lng":"149.2672"},
{"Code":"YCNM","Name":"COONAMBLE","CTAF":"126.7","Category":"CERT","Lat":"-30.9833","Lng":"148.3756"},
{"Code":"YCWA","Name":"COONDEWANNA","CTAF":"127.05","Category":"CERT","Lat":"-22.9667","Lng":"118.8133"},
{"Code":"YCTM","Name":"COOTAMUNDRA","CTAF":"126.7","Category":"REG","Lat":"-34.6244","Lng":"148.0358"},
{"Code":"YCOR","Name":"COROWA","CTAF":"132.45","Category":"REG","Lat":"-35.9903","Lng":"146.3514"},
{"Code":"YCRG","Name":"CORRYONG","CTAF":"126.7","Category":"REG","Lat":"-36.1828","Lng":"147.8878"},
{"Code":"YCWR","Name":"COWRA","CTAF":"126.7","Category":"CERT","Lat":"-33.8447","Lng":"148.6489"},
{"Code":"YCKI","Name":"CROKER ISLAND","CTAF":"126.7","Category":"REG","Lat":"-11.1653","Lng":"132.4839"},
{"Code":"YCUN","Name":"CUNDERDIN","CTAF":"127.8","Category":"REG","Lat":"-31.6222","Lng":"117.2167"},
{"Code":"YCMU","Name":"CUNNAMULLA","CTAF":"126.7","Category":"CERT","Lat":"-28.03","Lng":"145.6222"},
{"Code":"YCIN","Name":"CURTIN","CTAF":"126.7","Category":"MIL","Lat":"-17.5814","Lng":"123.8283"},
{"Code":"YDLO","Name":"DARLOT","CTAF":"126.5","Category":"CERT","Lat":"-27.8736","Lng":"121.2717"},
{"Code":"YDGU","Name":"DEGRUSSA","CTAF":"126.7","Category":"CERT","Lat":"-25.5575","Lng":"119.2875"},
{"Code":"YDWF","Name":"DELAMERE RANGE FACILITY","CTAF":"126.7","Category":"MIL","Lat":"-15.7469","Lng":"131.9194"},
{"Code":"YDLQ","Name":"DENILIQUIN","CTAF":"119.0","Category":"REG","Lat":"-35.5594","Lng":"144.9464"},
{"Code":"YDBY","Name":"DERBY","CTAF":"126.7","Category":"CERT","Lat":"-17.37","Lng":"123.6606"},
{"Code":"YDPO","Name":"DEVONPORT","CTAF":"126.9","Category":"CERT","Lat":"-41.1697","Lng":"146.4303"},
{"Code":"YDBI","Name":"DIRRANBANDI","CTAF":"126.7","Category":"REG","Lat":"-28.5917","Lng":"148.2167"},
{"Code":"YDOD","Name":"DONALD","CTAF":"126.7","Category":"REG","Lat":"-36.3603","Lng":"143.0075"},
{"Code":"YDMG","Name":"DOOMADGEE","CTAF":"126.7","Category":"CERT","Lat":"-17.9403","Lng":"138.8217"},
{"Code":"YSDU","Name":"DUBBO","CTAF":"134.0","Category":"CERT","Lat":"-32.2167","Lng":"148.5747"},
{"Code":"YDKG","Name":"DUKETON GOLD","CTAF":"126.7","Category":"CERT","Lat":"-27.6019","Lng":"122.3339"},
{"Code":"YEJI","Name":"EAST JAURDI","CTAF":"126.7","Category":"CERT","Lat":"-30.7694","Lng":"120.312"},
{"Code":"YMES","Name":"EAST SALE","CTAF":"118.3","Category":"MIL","Lat":"-38.0989","Lng":"147.1494"},
{"Code":"YECH","Name":"ECHUCA","CTAF":"119.1","Category":"REG","Lat":"-36.1572","Lng":"144.7619"},
{"Code":"YPED","Name":"EDINBURGH","CTAF":"118.3","Category":"MIL","Lat":"-34.7025","Lng":"138.6208"},
{"Code":"YELD","Name":"ELCHO ISLAND","CTAF":"127.15","Category":"REG","Lat":"-12.0194","Lng":"135.5706"},
{"Code":"YEML","Name":"EMERALD","CTAF":"126.7","Category":"CERT","Lat":"-23.5675","Lng":"148.1792"},
{"Code":"YESP","Name":"ESPERANCE","CTAF":"126.7","Category":"CERT","Lat":"-33.6844","Lng":"121.8228"},
{"Code":"YFTZ","Name":"FITZROY CROSSING","CTAF":"126.7","Category":"CERT","Lat":"-18.1819","Lng":"125.5586"},
{"Code":"YFLI","Name":"FLINDERS ISLAND","CTAF":"127.8","Category":"CERT","Lat":"-40.0914","Lng":"147.9928"},
{"Code":"YFBS","Name":"FORBES","CTAF":"126.7","Category":"REG","Lat":"-33.3636","Lng":"147.935"},
{"Code":"YFRT","Name":"FORREST","CTAF":"126.7","Category":"CERT","Lat":"-30.8381","Lng":"128.115"},
{"Code":"YFTA","Name":"FORRESTANIA","CTAF":"126.7","Category":"CERT","Lat":"-32.5783","Lng":"119.7067"},
{"Code":"YFDF","Name":"FORTESCUE DAVE FORREST","CTAF":"127.05","Category":"CERT","Lat":"-22.2919","Lng":"119.4372"},
{"Code":"YGAD","Name":"GARDEN ISLAND HELIPORT","CTAF":"121.0","Category":"MIL","Lat":"-32.2417","Lng":"115.6839"},
{"Code":"YGPT","Name":"GARDEN POINT","CTAF":"126.5","Category":"REG","Lat":"-11.3992","Lng":"130.4253"},
{"Code":"YGAY","Name":"GAYNDAH","CTAF":"126.7","Category":"REG","Lat":"-25.6153","Lng":"151.6208"},
{"Code":"YGTN","Name":"GEORGETOWN (QLD)","CTAF":"126.7","Category":"REG","Lat":"-18.3033","Lng":"143.5317"},
{"Code":"YGEL","Name":"GERALDTON","CTAF":"126.8","Category":"CERT","Lat":"-28.7961","Lng":"114.7075"},
{"Code":"YGIA","Name":"GINBATA","CTAF":"127.05","Category":"CERT","Lat":"-22.5811","Lng":"120.0356"},
{"Code":"YGIG","Name":"GINGIN","CTAF":"118.5","Category":"MIL","Lat":"-31.4653","Lng":"115.8633"},
{"Code":"YGLA","Name":"GLADSTONE","CTAF":"118.8","Category":"CERT","Lat":"-23.8697","Lng":"151.2228"},
{"Code":"YGLI","Name":"GLEN INNES","CTAF":"126.7","Category":"REG","Lat":"-29.675","Lng":"151.6894"},
{"Code":"YBCG","Name":"GOLD COAST","CTAF":"118.7","Category":"CERT","Lat":"-28.1644","Lng":"153.5047"},
{"Code":"YGGE","Name":"GOLDEN GROVE","CTAF":"126.7","Category":"CERT","Lat":"-28.765","Lng":"116.9717"},
{"Code":"YGDA","Name":"GOODOOGA","CTAF":"126.7","Category":"REG","Lat":"-29.0733","Lng":"147.3761"},
{"Code":"YGDI","Name":"GOONDIWINDI","CTAF":"126.7","Category":"REG","Lat":"-28.5214","Lng":"150.3203"},
{"Code":"YGLB","Name":"GOULBURN","CTAF":"127.15","Category":"REG","Lat":"-34.8103","Lng":"149.7264"},
{"Code":"YPGV","Name":"GOVE","CTAF":"127.8","Category":"CERT","Lat":"-12.2694","Lng":"136.8183"},
{"Code":"YGFN","Name":"GRAFTON","CTAF":"126.7","Category":"CERT","Lat":"-29.7594","Lng":"153.03"},
{"Code":"YGRS","Name":"GRANNY SMITH","CTAF":"126.8","Category":"CERT","Lat":"-28.7633","Lng":"122.4378"},
{"Code":"YGTH","Name":"GRIFFITH","CTAF":"126.55","Category":"CERT","Lat":"-34.2508","Lng":"146.0672"},
{"Code":"YGTE","Name":"GROOTE EYLANDT","CTAF":"126.0","Category":"CERT","Lat":"-13.9733","Lng":"136.4608"},
{"Code":"YGDH","Name":"GUNNEDAH","CTAF":"127.4","Category":"REG","Lat":"-30.9611","Lng":"150.2505"},
{"Code":"YHLC","Name":"HALLS CREEK","CTAF":"126.7","Category":"CERT","Lat":"-18.2339","Lng":"127.6697"},
{"Code":"YHML","Name":"HAMILTON","CTAF":"124.2","Category":"REG","Lat":"-37.6489","Lng":"142.0653"},
{"Code":"YBHM","Name":"HAMILTON ISLAND","CTAF":"127.85","Category":"CERT","Lat":"-20.3581","Lng":"148.9517"},
{"Code":"YHAY","Name":"HAY","CTAF":"126.7","Category":"REG","Lat":"-34.5314","Lng":"144.8297"},
{"Code":"YHBA","Name":"HERVEY BAY","CTAF":"126.55","Category":"CERT","Lat":"-25.3189","Lng":"152.8803"},
{"Code":"YMHB","Name":"HOBART","CTAF":"118.1","Category":"CERT","Lat":"-42.8361","Lng":"147.5103"},
{"Code":"YSHW","Name":"HOLSWORTHY","CTAF":"121.0","Category":"MIL","Lat":"-33.995","Lng":"150.9525"},
{"Code":"YHPN","Name":"HOPETOUN","CTAF":"126.7","Category":"REG","Lat":"-35.7153","Lng":"142.3597"},
{"Code":"YHID","Name":"HORN ISLAND","CTAF":"126.5","Category":"CERT","Lat":"-10.5864","Lng":"142.29"},
{"Code":"YHSM","Name":"HORSHAM","CTAF":"118.8","Category":"REG","Lat":"-36.6697","Lng":"142.1728"},
{"Code":"YHUG","Name":"HUGHENDEN","CTAF":"126.7","Category":"CERT","Lat":"-20.815","Lng":"144.2253"},
{"Code":"YIFL","Name":"INNISFAIL","CTAF":"132.9","Category":"REG","Lat":"-17.5586","Lng":"146.0117"},
{"Code":"YIVL","Name":"INVERELL","CTAF":"126.7","Category":"REG","Lat":"-29.8883","Lng":"151.1442"},
{"Code":"YJAB","Name":"JABIRU","CTAF":"126.7","Category":"CERT","Lat":"-12.6583","Lng":"132.8931"},
{"Code":"YJAC","Name":"JACINTH AMBROSIA","CTAF":"126.7","Category":"CERT","Lat":"-30.9011","Lng":"132.1836"},
{"Code":"YJBY","Name":"JERVIS BAY","CTAF":"118.85","Category":"MIL","Lat":"-35.1472","Lng":"150.6972"},
{"Code":"YJLC","Name":"JULIA CREEK","CTAF":"126.7","Category":"CERT","Lat":"-20.6683","Lng":"141.7225"},
{"Code":"YJUN","Name":"JUNDEE","CTAF":"127.2","Category":"CERT","Lat":"-26.4211","Lng":"120.5775"},
{"Code":"YKBR","Name":"KALBARRI","CTAF":"126.7","Category":"REG","Lat":"-27.6919","Lng":"114.2594"},
{"Code":"YPKG","Name":"KALGOORLIE-BOULDER","CTAF":"126.6","Category":"CERT","Lat":"-30.7894","Lng":"121.4617"},
{"Code":"YKKG","Name":"KALKGURUNG","CTAF":"126.7","Category":"REG","Lat":"-17.4319","Lng":"130.8081"},
{"Code":"YKAL","Name":"KALUMBURU","CTAF":"128.0","Category":"REG","Lat":"-14.2881","Lng":"126.6311"},
{"Code":"YKAR","Name":"KARARA","CTAF":"126.9","Category":"CERT","Lat":"-29.2161","Lng":"116.6867"},
{"Code":"YPKA","Name":"KARRATHA","CTAF":"127.35","Category":"CERT","Lat":"-20.7122","Lng":"116.7733"},
{"Code":"YKMB","Name":"KARUMBA","CTAF":"126.7","Category":"CERT","Lat":"-17.4556","Lng":"140.8317"},
{"Code":"YKNG","Name":"KATANNING","CTAF":"126.7","Category":"REG","Lat":"-33.7003","Lng":"117.6533"},
{"Code":"YKMP","Name":"KEMPSEY","CTAF":"118.9","Category":"REG","Lat":"-31.0744","Lng":"152.7697"},
{"Code":"YKER","Name":"KERANG","CTAF":"126.7","Category":"REG","Lat":"-35.7514","Lng":"143.9394"},
{"Code":"YIMB","Name":"KIMBA","CTAF":"126.7","Category":"REG","Lat":"-33.0997","Lng":"136.4597"},
{"Code":"YKII","Name":"KING ISLAND","CTAF":"126.85","Category":"CERT","Lat":"-39.8775","Lng":"143.8783"},
{"Code":"YKRY","Name":"KINGAROY","CTAF":"127.45","Category":"CERT","Lat":"-26.5808","Lng":"151.8411"},
{"Code":"YKSC","Name":"KINGSCOTE/KANGAROO ISLAND","CTAF":"126.0","Category":"CERT","Lat":"-35.7139","Lng":"137.5214"},
{"Code":"YKOW","Name":"KOWANYAMA","CTAF":"126.7","Category":"CERT","Lat":"-15.4856","Lng":"141.7514"},
{"Code":"YPKU","Name":"KUNUNURRA","CTAF":"127.0","Category":"CERT","Lat":"-15.7781","Lng":"128.7075"},
{"Code":"YLCG","Name":"LAKE CARGELLIGO","CTAF":"126.7","Category":"REG","Lat":"-33.2783","Lng":"146.3692"},
{"Code":"YLEV","Name":"LAKE EVELLA","CTAF":"127.15","Category":"REG","Lat":"-12.4989","Lng":"135.8058"},
{"Code":"YLTV","Name":"LATROBE VALLEY","CTAF":"126.0","Category":"REG","Lat":"-38.2072","Lng":"146.4703"},
{"Code":"YMLT","Name":"LAUNCESTON","CTAF":"118.7","Category":"CERT","Lat":"-41.5453","Lng":"147.2142"},
{"Code":"YLTN","Name":"LAVERTON (WA)","CTAF":"126.8","Category":"CERT","Lat":"-28.6136","Lng":"122.4239"},
{"Code":"YPLM","Name":"LEARMONTH","CTAF":"118.3","Category":"MIL","Lat":"-22.2356","Lng":"114.0886"},
{"Code":"YLEC","Name":"LEIGH CREEK","CTAF":"126.7","Category":"REG","Lat":"-30.5983","Lng":"138.4258"},
{"Code":"YLST","Name":"LEINSTER","CTAF":"126.5","Category":"CERT","Lat":"-27.8433","Lng":"120.7033"},
{"Code":"YLEO","Name":"LEONORA","CTAF":"126.8","Category":"CERT","Lat":"-28.8781","Lng":"121.3147"},
{"Code":"YLRD","Name":"LIGHTNING RIDGE","CTAF":"126.7","Category":"REG","Lat":"-29.4567","Lng":"147.9845"},
{"Code":"YLIS","Name":"LISMORE","CTAF":"124.2","Category":"CERT","Lat":"-28.8267","Lng":"153.2575"},
{"Code":"YLHR","Name":"LOCKHART RIVER","CTAF":"126.7","Category":"CERT","Lat":"-12.7869","Lng":"143.3047"},
{"Code":"YLRE","Name":"LONGREACH","CTAF":"126.7","Category":"CERT","Lat":"-23.4342","Lng":"144.2803"},
{"Code":"YLHI","Name":"LORD HOWE ISLAND","CTAF":"126.7","Category":"CERT","Lat":"-31.5383","Lng":"159.0772"},
{"Code":"YLOX","Name":"LOXTON","CTAF":"126.7","Category":"REG","Lat":"-34.4758","Lng":"140.6639"},
{"Code":"YBMK","Name":"MACKAY","CTAF":"124.5","Category":"CERT","Lat":"-21.1717","Lng":"149.1797"},
{"Code":"YMND","Name":"MAITLAND (NSW)","CTAF":"122.65","Category":"REG","Lat":"-32.7042","Lng":"151.4889"},
{"Code":"YMCO","Name":"MALLACOOTA","CTAF":"126.7","Category":"REG","Lat":"-37.5989","Lng":"149.7208"},
{"Code":"YMNG","Name":"MANGALORE","CTAF":"121.1","Category":"REG","Lat":"-36.8883","Lng":"145.1842"},
{"Code":"YMGD","Name":"MANINGRIDA","CTAF":"127.5","Category":"REG","Lat":"-12.0561","Lng":"134.2342"},
{"Code":"YMJM","Name":"MANJIMUP","CTAF":"126.7","Category":"REG","Lat":"-34.2653","Lng":"116.1403"},
{"Code":"YMBA","Name":"MAREEBA","CTAF":"126.7","Category":"CERT","Lat":"-17.0692","Lng":"145.4192"},
{"Code":"YMYB","Name":"MARYBOROUGH(QLD)","CTAF":"126.55","Category":"REG","Lat":"-25.5133","Lng":"152.715"},
{"Code":"YMBU","Name":"MARYBOROUGH(VIC)","CTAF":"119.1","Category":"REG","Lat":"-37.0331","Lng":"143.7089"},
{"Code":"YMHU","Name":"MCARTHUR RIVER MINE","CTAF":"126.7","Category":"CERT","Lat":"-16.4433","Lng":"136.0767"},
{"Code":"YMEK","Name":"MEEKATHARRA","CTAF":"126.55","Category":"CERT","Lat":"-26.6117","Lng":"118.5478"},
{"Code":"YMMB","Name":"MELBOURNE/Moorabbin","CTAF":"118.1","Category":"CERT","Lat":"-37.9758","Lng":"145.1022"},
{"Code":"YMER","Name":"MERIMBULA","CTAF":"126.7","Category":"CERT","Lat":"-36.9086","Lng":"149.9014"},
{"Code":"YMMU","Name":"MIDDLEMOUNT","CTAF":"126.7","Category":"CERT","Lat":"-22.8025","Lng":"148.7047"},
{"Code":"YMIA","Name":"MILDURA","CTAF":"118.8","Category":"CERT","Lat":"-34.2292","Lng":"142.0856"},
{"Code":"YMLS","Name":"MILES","CTAF":"126.35","Category":"CERT","Lat":"-26.8061","Lng":"150.1697"},
{"Code":"YMGB","Name":"MILINGIMBI","CTAF":"127.5","Category":"REG","Lat":"-12.0944","Lng":"134.8936"},
{"Code":"YOOM","Name":"MOOMBA","CTAF":"126.7","Category":"CERT","Lat":"-28.0994","Lng":"140.1969"},
{"Code":"YMRB","Name":"MORANBAH","CTAF":"127.5","Category":"CERT","Lat":"-22.0578","Lng":"148.0775"},
{"Code":"YMRW","Name":"MORAWA","CTAF":"126.7","Category":"REG","Lat":"-29.2014","Lng":"116.0219"},
{"Code":"YMOR","Name":"MOREE","CTAF":"126.7","Category":"CERT","Lat":"-29.4989","Lng":"149.8447"},
{"Code":"YMTI","Name":"MORNINGTON ISLAND","CTAF":"126.7","Category":"CERT","Lat":"-16.6625","Lng":"139.1781"},
{"Code":"YMRY","Name":"MORUYA","CTAF":"126.7","Category":"CERT","Lat":"-35.8978","Lng":"150.1444"},
{"Code":"YMTG","Name":"MOUNT GAMBIER","CTAF":"126.65","Category":"CERT","Lat":"-37.7456","Lng":"140.7853"},
{"Code":"YGON","Name":"MOUNT GORDON","CTAF":"126.7","Category":"CERT","Lat":"-19.775","Lng":"139.4067"},
{"Code":"YHOT","Name":"MOUNT HOTHAM","CTAF":"126.75","Category":"CERT","Lat":"-37.0475","Lng":"147.3342"},
{"Code":"YBMA","Name":"MOUNT ISA","CTAF":"126.5","Category":"CERT","Lat":"-20.6639","Lng":"139.4886"},
{"Code":"YMNE","Name":"MOUNT KEITH","CTAF":"126.5","Category":"CERT","Lat":"-27.2864","Lng":"120.5547"},
{"Code":"YMOG","Name":"MOUNT MAGNET","CTAF":"126.7","Category":"CERT","Lat":"-28.1161","Lng":"117.8417"},
{"Code":"YMDG","Name":"MUDGEE","CTAF":"126.7","Category":"CERT","Lat":"-32.5625","Lng":"149.6111"},
{"Code":"YMUL","Name":"MURRAY FIELD","CTAF":"119.1","Category":"REG","Lat":"-32.5103","Lng":"115.8333"},
{"Code":"YMMI","Name":"MURRIN MURRIN","CTAF":"126.8","Category":"CERT","Lat":"-28.7053","Lng":"121.8906"},
{"Code":"YNRC","Name":"NARACOORTE","CTAF":"126.7","Category":"REG","Lat":"-36.9853","Lng":"140.725"},
{"Code":"YNBR","Name":"NARRABRI","CTAF":"126.7","Category":"CERT","Lat":"-30.3192","Lng":"149.8272"},
{"Code":"YNAR","Name":"NARRANDERA","CTAF":"132.85","Category":"CERT","Lat":"-34.7022","Lng":"146.5122"},
{"Code":"YNRM","Name":"NARROMINE","CTAF":"126.7","Category":"REG","Lat":"-32.2144","Lng":"148.2247"},
{"Code":"YNWN","Name":"NEWMAN","CTAF":"122.0","Category":"CERT","Lat":"-23.4178","Lng":"119.8028"},
{"Code":"YNGU","Name":"NGUKURR","CTAF":"126.7","Category":"REG","Lat":"-14.7228","Lng":"134.7475"},
{"Code":"YNHL","Name":"NHILL","CTAF":"126.7","Category":"REG","Lat":"-36.3097","Lng":"141.6408"},
{"Code":"YCNF","Name":"NIFTY","CTAF":"126.7","Category":"CERT","Lat":"-21.6736","Lng":"121.5947"},
{"Code":"YNTN","Name":"NORMANTON","CTAF":"126.7","Category":"CERT","Lat":"-17.685","Lng":"141.0703"},
{"Code":"YNSM","Name":"NORSEMAN","CTAF":"126.7","Category":"REG","Lat":"-32.2094","Lng":"121.7544"},
{"Code":"YNPE","Name":"NORTHERN PENINSULA","CTAF":"126.5","Category":"CERT","Lat":"-10.9508","Lng":"142.4594"},
{"Code":"YNOV","Name":"NOVA","CTAF":"126.7","Category":"CERT","Lat":"-31.8453","Lng":"123.1919"},
{"Code":"YSNW","Name":"NOWRA","CTAF":"118.85","Category":"MIL","Lat":"-34.9489","Lng":"150.537"},
{"Code":"YNUM","Name":"NUMBULWAR","CTAF":"126.7","Category":"REG","Lat":"-14.2717","Lng":"135.7167"},
{"Code":"YNYN","Name":"NYNGAN","CTAF":"126.7","Category":"REG","Lat":"-31.5511","Lng":"147.2028"},
{"Code":"YBOK","Name":"OAKEY","CTAF":"127.65","Category":"MIL","Lat":"-27.4114","Lng":"151.7353"},
{"Code":"YOEN","Name":"OENPELLI","CTAF":"126.7","Category":"REG","Lat":"-12.3253","Lng":"133.0056"},
{"Code":"YOLD","Name":"OLYMPIC DAM","CTAF":"126.6","Category":"CERT","Lat":"-30.485","Lng":"136.8767"},
{"Code":"YOLW","Name":"ONSLOW","CTAF":"126.6","Category":"CERT","Lat":"-21.6683","Lng":"115.1131"},
{"Code":"YORG","Name":"ORANGE","CTAF":"119.0","Category":"CERT","Lat":"-33.3781","Lng":"149.1256"},
{"Code":"YORB","Name":"ORBOST","CTAF":"126.7","Category":"REG","Lat":"-37.7903","Lng":"148.6097"},
{"Code":"YOSB","Name":"OSBORNE MINE","CTAF":"126.7","Category":"CERT","Lat":"-22.0817","Lng":"140.5567"},
{"Code":"YPAM","Name":"PALM ISLAND","CTAF":"126.7","Category":"REG","Lat":"-18.7553","Lng":"146.5814"},
{"Code":"YPBO","Name":"PARABURDOO","CTAF":"126.8","Category":"CERT","Lat":"-23.1711","Lng":"117.7453"},
{"Code":"YPKS","Name":"PARKES","CTAF":"126.7","Category":"CERT","Lat":"-33.1314","Lng":"148.2392"},
{"Code":"YPEA","Name":"PEARCE","CTAF":"118.3","Category":"MIL","Lat":"-31.6678","Lng":"116.015"},
{"Code":"YPJT","Name":"PERTH/Jandakot","CTAF":"118.1","Category":"CERT","Lat":"-32.0975","Lng":"115.8811"},
{"Code":"YPLU","Name":"PLUTONIC","CTAF":"126.7","Category":"CERT","Lat":"-25.3167","Lng":"119.4233"},
{"Code":"YMPC","Name":"POINT COOK","CTAF":"126.2","Category":"MIL","Lat":"-37.9322","Lng":"144.7533"},
{"Code":"YPCE","Name":"POONCARIE","CTAF":"126.7","Category":"REG","Lat":"-33.3733","Lng":"142.5833"},
{"Code":"YPMP","Name":"PORMPURAAW","CTAF":"126.7","Category":"CERT","Lat":"-14.8975","Lng":"141.6108"},
{"Code":"YPAG","Name":"PORT AUGUSTA","CTAF":"126.7","Category":"CERT","Lat":"-32.5069","Lng":"137.7167"},
{"Code":"YPPD","Name":"PORT HEDLAND","CTAF":"119.9","Category":"CERT","Lat":"-20.3778","Lng":"118.6264"},
{"Code":"YPKT","Name":"PORT KEATS","CTAF":"126.7","Category":"REG","Lat":"-14.25","Lng":"129.5292"},
{"Code":"YPLC","Name":"PORT LINCOLN","CTAF":"128.0","Category":"CERT","Lat":"-34.6053","Lng":"135.8803"},
{"Code":"YPMQ","Name":"PORT MACQUARIE","CTAF":"118.1","Category":"CERT","Lat":"-31.4358","Lng":"152.8633"},
{"Code":"YPIR","Name":"PORT PIRIE","CTAF":"126.7","Category":"REG","Lat":"-33.2389","Lng":"137.995"},
{"Code":"YPOD","Name":"PORTLAND","CTAF":"127.95","Category":"CERT","Lat":"-38.3181","Lng":"141.4711"},
{"Code":"YPMH","Name":"PROMINENT HILL","CTAF":"126.6","Category":"CERT","Lat":"-29.7178","Lng":"135.5244"},
{"Code":"YBPN","Name":"PROSERPINE/WHITSUNDAY COAST","CTAF":"126.7","Category":"CERT","Lat":"-20.495","Lng":"148.5522"},
{"Code":"YQLP","Name":"QUILPIE","CTAF":"126.7","Category":"CERT","Lat":"-26.6086","Lng":"144.2572"},
{"Code":"YQDI","Name":"QUIRINDI","CTAF":"127.8","Category":"REG","Lat":"-31.4986","Lng":"150.5181"},
{"Code":"YRNG","Name":"RAMINGINING","CTAF":"127.5","Category":"REG","Lat":"-12.3564","Lng":"134.8975"},
{"Code":"YNRV","Name":"RAVENSTHORPE","CTAF":"126.7","Category":"CERT","Lat":"-33.7972","Lng":"120.2081"},
{"Code":"YREN","Name":"RENMARK","CTAF":"126.7","Category":"REG","Lat":"-34.1964","Lng":"140.6739"},
{"Code":"YSRI","Name":"RICHMOND(NSW)","CTAF":"135.5","Category":"MIL","Lat":"-33.6006","Lng":"150.7808"},
{"Code":"YRMD","Name":"RICHMOND(QLD)","CTAF":"126.7","Category":"CERT","Lat":"-20.7019","Lng":"143.1147"},
{"Code":"YRBK","Name":"ROBERTSON BARRACKS","CTAF":"126.6","Category":"MIL","Lat":"-12.425","Lng":"130.9733"},
{"Code":"YROI","Name":"ROBINVALE","CTAF":"126.7","Category":"REG","Lat":"-34.6506","Lng":"142.7828"},
{"Code":"YBRK","Name":"ROCKHAMPTON","CTAF":"118.1","Category":"CERT","Lat":"-23.3819","Lng":"150.4753"},
{"Code":"YROM","Name":"ROMA","CTAF":"126.95","Category":"CERT","Lat":"-26.545","Lng":"148.7747"},
{"Code":"YRTI","Name":"ROTTNEST ISLAND","CTAF":"126.0","Category":"REG","Lat":"-32.0067","Lng":"115.5397"},
{"Code":"YSTA","Name":"SAINT ARNAUD","CTAF":"119.1","Category":"REG","Lat":"-36.6367","Lng":"143.1858"},
{"Code":"YSGE","Name":"SAINT GEORGE","CTAF":"126.7","Category":"CERT","Lat":"-28.0497","Lng":"148.5953"},
{"Code":"YSTH","Name":"SAINT HELENS","CTAF":"119.1","Category":"REG","Lat":"-41.3367","Lng":"148.2819"},
{"Code":"YBSG","Name":"SCHERGER","CTAF":"126.7","Category":"MIL","Lat":"-12.6239","Lng":"142.0872"},
{"Code":"YSCO","Name":"SCONE","CTAF":"128.0","Category":"REG","Lat":"-32.0372","Lng":"150.8322"},
{"Code":"YSLK","Name":"SEA LAKE","CTAF":"126.7","Category":"REG","Lat":"-35.5317","Lng":"142.8905"},
{"Code":"YSHK","Name":"SHARK BAY","CTAF":"126.7","Category":"CERT","Lat":"-25.8939","Lng":"113.5772"},
{"Code":"YSHT","Name":"SHEPPARTON","CTAF":"118.8","Category":"REG","Lat":"-36.4289","Lng":"145.3925"},
{"Code":"YSNB","Name":"SNAKE BAY","CTAF":"126.5","Category":"REG","Lat":"-11.4228","Lng":"130.6536"},
{"Code":"YSOL","Name":"SOLOMON","CTAF":"126.7","Category":"CERT","Lat":"-22.255","Lng":"117.8517"},
{"Code":"YGBI","Name":"SOUTH GOULBURN ISLAND","CTAF":"126.7","Category":"REG","Lat":"-11.6506","Lng":"133.3819"},
{"Code":"YSCR","Name":"SOUTHERN CROSS","CTAF":"126.7","Category":"REG","Lat":"-31.2403","Lng":"119.3597"},
{"Code":"YSPT","Name":"SOUTHPORT","CTAF":"119.0","Category":"REG","Lat":"-27.9217","Lng":"153.3714"},
{"Code":"YSPE","Name":"STANTHORPE","CTAF":"126.7","Category":"REG","Lat":"-28.6203","Lng":"151.9906"},
{"Code":"YSWL","Name":"STAWELL","CTAF":"119.1","Category":"REG","Lat":"-37.0717","Lng":"142.7403"},
{"Code":"YSRN","Name":"STRAHAN","CTAF":"124.2","Category":"REG","Lat":"-42.1556","Lng":"145.2914"},
{"Code":"YKBY","Name":"STREAKY BAY","CTAF":"126.7","Category":"REG","Lat":"-32.8358","Lng":"134.2928"},
{"Code":"YSRD","Name":"SUNRISE DAM","CTAF":"126.8","Category":"CERT","Lat":"-29.0983","Lng":"122.4553"},
{"Code":"YBSU","Name":"SUNSHINE COAST","CTAF":"124.4","Category":"CERT","Lat":"-26.6033","Lng":"153.0911"},
{"Code":"YSWH","Name":"SWAN HILL","CTAF":"119.1","Category":"REG","Lat":"-35.3758","Lng":"143.5328"},
{"Code":"YSBK","Name":"SYDNEY/Bankstown","CTAF":"132.8","Category":"CERT","Lat":"-33.9244","Lng":"150.9883"},
{"Code":"YSTW","Name":"TAMWORTH","CTAF":"119.4","Category":"CERT","Lat":"-31.0839","Lng":"150.8467"},
{"Code":"YTRE","Name":"TAREE","CTAF":"118.1","Category":"CERT","Lat":"-31.8886","Lng":"152.5139"},
{"Code":"YTAM","Name":"TAROOM","CTAF":"126.7","Category":"CERT","Lat":"-25.8019","Lng":"149.8994"},
{"Code":"YTEF","Name":"TELFER","CTAF":"126.65","Category":"CERT","Lat":"-21.715","Lng":"122.2283"},
{"Code":"YTEM","Name":"TEMORA","CTAF":"126.15","Category":"REG","Lat":"-34.4214","Lng":"147.5117"},
{"Code":"YTNK","Name":"TENNANT CREEK","CTAF":"126.7","Category":"REG","Lat":"-19.6344","Lng":"134.1833"},
{"Code":"YTNG","Name":"THANGOOL","CTAF":"126.7","Category":"CERT","Lat":"-24.4939","Lng":"150.5761"},
{"Code":"YTGM","Name":"THARGOMINDAH","CTAF":"126.7","Category":"CERT","Lat":"-27.9864","Lng":"143.8108"},
{"Code":"YTGT","Name":"THE GRANITES","CTAF":"126.7","Category":"CERT","Lat":"-20.5483","Lng":"130.35"},
{"Code":"YTMO","Name":"THE MONUMENT","CTAF":"127.3","Category":"CERT","Lat":"-21.8111","Lng":"139.9236"},
{"Code":"YTIB","Name":"TIBOOBURRA","CTAF":"126.7","Category":"REG","Lat":"-29.4511","Lng":"142.0578"},
{"Code":"YPTN","Name":"TINDAL","CTAF":"119.7","Category":"MIL","Lat":"-14.5211","Lng":"132.3778"},
{"Code":"YTOC","Name":"TOCUMWAL","CTAF":"125.5","Category":"REG","Lat":"-35.8108","Lng":"145.6042"},
{"Code":"YTWB","Name":"TOOWOOMBA","CTAF":"127.65","Category":"CERT","Lat":"-27.5414","Lng":"151.9125"},
{"Code":"YBTL","Name":"TOWNSVILLE/Townsville INTL","CTAF":"118.3","Category":"JOINT","Lat":"-19.2525","Lng":"146.7653"},
{"Code":"YTEE","Name":"TREPELL","CTAF":"126.7","Category":"CERT","Lat":"-21.835","Lng":"140.888"},
{"Code":"YTRA","Name":"TROPICANA","CTAF":"126.7","Category":"CERT","Lat":"-29.1867","Lng":"124.5503"},
{"Code":"YTTI","Name":"TROUGHTON ISLAND","CTAF":"128.0","Category":"REG","Lat":"-13.7517","Lng":"126.1483"},
{"Code":"YTST","Name":"TRUSCOTT-MUNGALALU","CTAF":"128.0","Category":"REG","Lat":"-14.0897","Lng":"126.3808"},
{"Code":"YTBB","Name":"TUMBY BAY","CTAF":"128.0","Category":"REG","Lat":"-34.3611","Lng":"136.095"},
{"Code":"YTMU","Name":"TUMUT","CTAF":"126.7","Category":"REG","Lat":"-35.2628","Lng":"148.2408"},
{"Code":"YSWG","Name":"WAGGA WAGGA","CTAF":"126.95","Category":"CERT","Lat":"-35.1653","Lng":"147.4664"},
{"Code":"YWKI","Name":"WAIKERIE","CTAF":"126.7","Category":"REG","Lat":"-34.1842","Lng":"140.0305"},
{"Code":"YWLG","Name":"WALGETT","CTAF":"126.7","Category":"REG","Lat":"-30.0328","Lng":"148.1258"},
{"Code":"YWGT","Name":"WANGARATTA","CTAF":"119.1","Category":"REG","Lat":"-36.4158","Lng":"146.3069"},
{"Code":"YWBR","Name":"WARBURTON","CTAF":"127.1","Category":"REG","Lat":"-26.1283","Lng":"126.5833"},
{"Code":"YWKB","Name":"WARRACKNABEAL","CTAF":"126.7","Category":"REG","Lat":"-36.3211","Lng":"142.4194"},
{"Code":"YWRN","Name":"WARREN","CTAF":"126.7","Category":"REG","Lat":"-31.7333","Lng":"147.8025"},
{"Code":"YWBL","Name":"WARRNAMBOOL","CTAF":"126.0","Category":"REG","Lat":"-38.2953","Lng":"142.4467"},
{"Code":"YWCK","Name":"WARWICK","CTAF":"127.85","Category":"REG","Lat":"-28.1494","Lng":"151.9431"},
{"Code":"YBWP","Name":"WEIPA","CTAF":"126.7","Category":"CERT","Lat":"-12.6786","Lng":"141.9253"},
{"Code":"YWTO","Name":"WENTWORTH","CTAF":"118.8","Category":"REG","Lat":"-34.0878","Lng":"141.8919"},
{"Code":"YANG","Name":"WEST ANGELAS","CTAF":"127.05","Category":"CERT","Lat":"-23.135","Lng":"118.7067"},
{"Code":"YWSL","Name":"WEST SALE","CTAF":"118.3","Category":"REG","Lat":"-38.0917","Lng":"146.9653"},
{"Code":"YWWL","Name":"WEST WYALONG","CTAF":"126.7","Category":"REG","Lat":"-33.9372","Lng":"147.1914"},
{"Code":"YWHA","Name":"WHYALLA","CTAF":"126.9","Category":"CERT","Lat":"-33.0589","Lng":"137.5145"},
{"Code":"YWLM","Name":"WILLIAMTOWN","CTAF":"118.3","Category":"MIL","Lat":"-32.795","Lng":"151.8344"},
{"Code":"YWLU","Name":"WILUNA","CTAF":"127.2","Category":"CERT","Lat":"-26.6292","Lng":"120.2206"},
{"Code":"YWDG","Name":"WINDARLING","CTAF":"126.7","Category":"CERT","Lat":"-30.0319","Lng":"119.3872"},
{"Code":"YWDH","Name":"WINDORAH","CTAF":"126.7","Category":"CERT","Lat":"-25.4131","Lng":"142.6672"},
{"Code":"YWTN","Name":"WINTON","CTAF":"126.7","Category":"CERT","Lat":"-22.3636","Lng":"143.0856"},
{"Code":"YWOL","Name":"WOLLONGONG","CTAF":"127.3","Category":"CERT","Lat":"-34.5611","Lng":"150.7886"},
{"Code":"YPWR","Name":"WOOMERA","CTAF":"118.3","Category":"MIL","Lat":"-31.1442","Lng":"136.8169"},
{"Code":"YWUD","Name":"WUDINNA","CTAF":"126.7","Category":"REG","Lat":"-33.0433","Lng":"135.4472"},
{"Code":"YWYF","Name":"WYCHEPROOF","CTAF":"126.7","Category":"REG","Lat":"-36.0589","Lng":"143.2433"},
{"Code":"YWYM","Name":"WYNDHAM","CTAF":"128.0","Category":"REG","Lat":"-15.5114","Lng":"128.153"},
{"Code":"YWYY","Name":"WYNYARD","CTAF":"126.9","Category":"CERT","Lat":"-40.9989","Lng":"145.7311"},
{"Code":"YYRM","Name":"YARRAM","CTAF":"126.7","Category":"REG","Lat":"-38.5675","Lng":"146.7544"},
{"Code":"YYWG","Name":"YARRAWONGA","CTAF":"126.7","Category":"REG","Lat":"-36.0289","Lng":"146.0286"},
{"Code":"YYNG","Name":"YOUNG","CTAF":"126.7","Category":"REG","Lat":"-34.2556","Lng":"148.2481"}]