<?xml version="1.0" encoding="UTF-8"?>
<kml xmlns="http://earth.google.com/kml/2.2">
	<Document>
		<name>ACTHGPA Site Guide</name>
		<open>1</open>
		<Style id="lz">
			<IconStyle id="lzicon">
				<Icon>
					<href>http://maps.google.com/mapfiles/kml/pal2/icon56.png</href>
				</Icon>
			</IconStyle>
			<LineStyle id="lzline">
				<color>87000000</color>
			</LineStyle>
			<PolyStyle id="lzpoly">
				<color>8f00aa55</color>
				<outline>0</outline>
			</PolyStyle>
		</Style>
		<Style id="retrieve">
			<IconStyle id="retrieveicon">
				<Icon>
					<href>http://maps.google.com/mapfiles/kml/pal4/icon62.png</href>
				</Icon>
			</IconStyle>
			<LineStyle id="retrieveline">
				<color>ffff0000</color>
			</LineStyle>
			<PolyStyle id="retrievepoly">
				<color>7f00aa00</color>
			</PolyStyle>
		</Style>
		<Folder>
			<name>Site Guide</name>
			<open>1</open>
			<Folder>
				<name>Lanyon</name>
				<open>1</open>
				<LookAt>
					<longitude>149.1001702457124</longitude>
					<latitude>-35.47934578592705</latitude>
					<altitude>0</altitude>
					<range>2429.446834356219</range>
					<tilt>36.74387002897238</tilt>
					<heading>100.1441286435541</heading>
				</LookAt>
				<Placemark>
					<name>Retrieve</name>
					<LookAt>
						<longitude>149.1042111034118</longitude>
						<latitude>-35.47634544836485</latitude>
						<altitude>0</altitude>
						<range>2334.906029506057</range>
						<tilt>59.52886655927238</tilt>
						<heading>165.5223521782882</heading>
					</LookAt>
					<styleUrl>#retrieve</styleUrl>
					<LineString>
						<tessellate>1</tessellate>
						<coordinates>
							149.108018839021,-35.4840165858618,0 149.108639243429,-35.48411572578902,0 149.10895107756,-35.48412079346501,0 149.109180949213,-35.48396769691127,0 149.1093732529679,-35.48380379034357,0 149.1096330200697,-35.48367397370728,0 149.1099211430807,-35.48358891015116,0 149.1102031843204,-35.48349807390944,0 149.1105184636999,-35.4834566414939,0 149.1108311191007,-35.48345869703016,0 149.1111444058461,-35.4834609436511,0 149.1114030882278,-35.48346408400625,0 149.1117195199398,-35.48346773716597,0 149.1120072037125,-35.48340176455307,0 149.1122860995278,-35.48330781537463,0 149.1126274600911,-35.48330902889869,0 149.1129120808075,-35.48319499649233,0 149.1128077689635,-35.48294576902948,0 149.1127937963478,-35.48272131953703,0 149.1127797712868,-35.48249601019037,0 149.112738815284,-35.48224722632445,0 149.1126693132875,-35.48202065128183,0 149.1124820836255,-35.4818386989427,0 149.1122324635552,-35.48172467436998,0 149.1119895124795,-35.48156585422607,0 149.1118307083202,-35.4813826922553,0 149.1115748878199,-35.48126648564732,0 149.1112636368953,-35.48110393610395,0 149.110976936741,-35.4810573444811,0 149.1106584250273,-35.48105679679689,0 149.1103945688542,-35.48112553725229,0 149.1100507344942,-35.48114919463599,0 149.1097891161469,-35.48128838585016,0 149.1095542100141,-35.48147308661518,0 149.1092732673382,-35.48147574362308,0 149.108992698428,-35.48140874751017,0 149.108742348482,-35.48124880489398,0 149.1085794429783,-35.48104185608206,0 149.1083821869038,-35.48083195964188,0 149.1081520553215,-35.4806674570174,0 149.1078940404613,-35.48052685215284,0 149.1076364225487,-35.48038624771078,0 149.1074957471019,-35.48017446699128,0 149.1073828063739,-35.47993792550615,0 149.107237914213,-35.47974802024202,0 149.1071512130548,-35.47948662735505,0 149.1071520572804,-35.47924876830859,0 149.1071529006182,-35.47901069172529,0 149.1071529588236,-35.47874895995154,0 149.1072412503427,-35.47851066117386,0 149.1073885529617,-35.47829570497559,0 149.1075354202166,-35.47808091404939,0 149.1076822710084,-35.47784224339782,0 149.1078295380198,-35.47765085079688,0 149.1079507557431,-35.47743291417061,0 149.1081030364038,-35.47721316602361,0 149.1080432871669,-35.47695097807779,0 149.1080183639718,-35.47668315529103,0 149.1078394159791,-35.47649455346986,0 149.1076036539965,-35.47630410032189,0 149.1076648478955,-35.47606119928606,0 149.1076655674965,-35.47582055224025,0 149.1076675909724,-35.47552959710053,0 149.10748969974,-35.4753402016154,0 149.1072848646486,-35.47514598095448,0 149.1071110760589,-35.47492289008181,0 149.1071147830642,-35.47467274857881,0 149.1071192292851,-35.47439542826344,0 149.1071235171307,-35.47414148270897,0 149.1071004564853,-35.47387885635575,0 149.1071073161201,-35.47358933947883,0 149.107118406809,-35.47320976244159,0 149.1071271873345,-35.47293301536281,0 149.1071359557087,-35.47262923902985,0 149.1071439876436,-35.47232576139852,0 149.1071523814743,-35.47201846860787,0 149.1070323524275,-35.47175753169721,0 149.1071587040548,-35.47149196254701,0 149.1071930383014,-35.47122579019923,0 149.1072273101432,-35.47098460195867,0 149.1072315649469,-35.47066346317582,0 149.106953710634,-35.47056021292717,0 149.1067047555924,-35.47072074970497,0 149.1065478734281,-35.47096354073477,0 149.1063609656704,-35.47120408302299,0 149.1060531652407,-35.47125334808325,0 149.1057456544027,-35.47119575155036,0 149.1055919993247,-35.47103299977559,0 149.1055308733522,-35.47071012404313,0 149.1056240940593,-35.47044706090688,0 149.1056245903913,-35.47015573104066,0 149.1053764773302,-35.47005001179674,0 149.105035005596,-35.47002107490677,0 149.1047548674212,-35.4700076336653,0 149.1044114623205,-35.46999176809091,0 149.1042244295156,-35.47016754285684,0 149.1041002340518,-35.47042417466916,0 149.1040389891045,-35.47071048374835,0 149.1038208973096,-35.47093657977263,0 149.1035712453233,-35.47111043342234,0 149.1035415651926,-35.47137085331882,0 149.1035117299896,-35.47162990651832,0 149.1033253139007,-35.47185805824497,0 149.1031391043051,-35.47211216330149,0 149.1030463766114,-35.47236689792796,0 149.1030164250892,-35.47262339779962,0 149.102893145843,-35.47287898924839,0 149.1027079281299,-35.47310918748079,0 149.102522801242,-35.47333907065896,0 149.102369117286,-35.4735946300498,0 149.1022463918506,-35.47384959462169,0 149.102092400162,-35.47410366769437,0 149.1018115783132,-35.47420149686085,0 149.1016253370802,-35.47440312694993,0 149.1015335718653,-35.47463201614786,0 149.1015989127169,-35.47491395152122,0 149.1018517488041,-35.47512242150864,0 149.1020722907691,-35.47532936882016,0 149.1021680561107,-35.47558490442611,0 149.1021687815179,-35.47566119361849,0
						</coordinates>
					</LineString>
				</Placemark>
				<Placemark>
					<name>Lanyon Launch</name>
					<LookAt>
						<longitude>149.0956044317502</longitude>
						<latitude>-35.48027754321604</latitude>
						<altitude>0</altitude>
						<range>2487.510456833842</range>
						<tilt>52.08593883638693</tilt>
						<heading>-67.20874050854356</heading>
					</LookAt>
					<Style>
						<IconStyle>
							<heading>90</heading>
							<Icon>
								<href>http://maps.google.com/mapfiles/kml/pal4/icon28.png</href>
							</Icon>
						</IconStyle>
						<BalloonStyle>
							<text><![CDATA[<p>Visit ACTHPA website for <a href="http://www.acthpa.org/index.php?option=com_content&task=view&id=19&Itemid=28">detailed information</a>.</p>]]></text>
							<textColor>ff000000</textColor>
							<displayMode>default</displayMode>
						</BalloonStyle>
					</Style>
					<Point>
						<coordinates>149.1075388996813,-35.48387880068218,0</coordinates>
					</Point>
				</Placemark>
				<Placemark>
					<name>Lanyon LZ</name>
					<LookAt>
						<longitude>149.0941273929265</longitude>
						<latitude>-35.47516210207224</latitude>
						<altitude>0</altitude>
						<range>2525.904997111458</range>
						<tilt>40.52139903971214</tilt>
						<heading>-67.20961831177085</heading>
					</LookAt>
					<styleUrl>#lz</styleUrl>
					<Polygon>
						<tessellate>1</tessellate>
						<outerBoundaryIs>
							<LinearRing id="khLinearRing665">
								<coordinates>
									149.1011262339124,-35.47538241872363,0 149.0993079276752,-35.47757920810617,0 149.0972383292896,-35.47872522747973,0 149.0955752703925,-35.47798095231132,0 149.0928336505961,-35.4768957697376,0 149.0903403586387,-35.47970194733793,0 149.0909913776281,-35.48170763967692,0 149.0946844802415,-35.48108008423136,0 149.0992576084783,-35.4798365840983,0 149.101886108557,-35.47888459933266,0 149.1026083358456,-35.47756839110816,0 149.1026396583214,-35.47699610317765,0 149.1011262339124,-35.47538241872363,0
								</coordinates>
							</LinearRing>
						</outerBoundaryIs>
					</Polygon>
				</Placemark>
			</Folder>
			<Folder>
				<name>Lake George</name>
				<open>1</open>
				<LookAt>
					<longitude>149.3627644512057</longitude>
					<latitude>-35.0704343682225</latitude>
					<altitude>0</altitude>
					<range>11893.01728494598</range>
					<tilt>56.60045112854251</tilt>
					<heading>-63.74291168457112</heading>
				</LookAt>
				<Placemark>
					<name>Retrieve</name>
					<LookAt>
						<longitude>149.3733244902823</longitude>
						<latitude>-35.09549468734343</latitude>
						<altitude>0</altitude>
						<range>4082.841758226812</range>
						<tilt>45.5584919737058</tilt>
						<heading>-48.63484202315743</heading>
					</LookAt>
					<styleUrl>#retrieve</styleUrl>
					<LineString>
						<tessellate>1</tessellate>
						<coordinates>
							149.3793278983798,-35.10039635264733,0 149.3791788186964,-35.10021058110615,0 149.3789014137676,-35.10007359575517,0 149.3786510421645,-35.09994077463709,0 149.3783669043615,-35.09982572779566,0 149.3781039395408,-35.09973737671139,0 149.3778012528584,-35.09968971489268,0 149.3774713356354,-35.09963775984016,0 149.3771417082372,-35.09958585432193,0 149.3768561184573,-35.09958732734969,0 149.3765490872426,-35.09956215318292,0 149.3762582478945,-35.09970333618146,0 149.3759745677377,-35.09982147482631,0 149.3756925186682,-35.09993892999696,0 149.3754224673901,-35.10001142691472,0 149.3751651545805,-35.10015356432353,0 149.3748722971137,-35.10033438152404,0 149.3746126564309,-35.10049619860777,0 149.3743517009448,-35.1005444491801,0 149.3741011135101,-35.10054935120611,0 149.373780494245,-35.10049822907914,0 149.373518347712,-35.10043403094868,0 149.3732658618908,-35.10032656271656,0 149.3729724511074,-35.10027981348434,0 149.372683954975,-35.10021144912728,0 149.3723029335036,-35.10006111211214,0 149.3720549629589,-35.09993192089795,0 149.3717937934546,-35.09973314727479,0 149.3715187620798,-35.09959948301927,0 149.3713146012045,-35.09952206436823,0 149.3710525806058,-35.09932275042844,0 149.3709322334945,-35.0991003773079,0 149.3708115760591,-35.09887741847162,0 149.3707484498042,-35.09864023831123,0 149.3707119121359,-35.09840652404389,0 149.3707513560127,-35.09820691016424,0 149.3708851625441,-35.09809032730093,0 149.3711223161482,-35.0978744745811,0 149.3713244728804,-35.09769832282635,0 149.3714282685372,-35.0974597053347,0 149.3715279058895,-35.09724273265396,0 149.3716561439674,-35.0970025729692,0 149.3717536569227,-35.09678006335095,0 149.3719513503703,-35.09661856215304,0 149.3721999934523,-35.09648741115872,0 149.3724999370985,-35.09638685386847,0 149.3727646263208,-35.09632874151517,0 149.3730350417508,-35.09624691662372,0 149.3731927691913,-35.09602707575876,0 149.3730428390252,-35.09578708399991,0 149.3732330659606,-35.0956930797644,0 149.373648367891,-35.0957510822261,0 149.3739487020413,-35.09581724438238,0 149.3741611884406,-35.09589625872999,0
						</coordinates>
					</LineString>
				</Placemark>
				<Placemark>
					<name>Geary&apos;s Gap Launch</name>
					<LookAt>
						<longitude>149.4059070844386</longitude>
						<latitude>-35.09063401280301</latitude>
						<altitude>0</altitude>
						<range>8042.851165990987</range>
						<tilt>60.05156446537321</tilt>
						<heading>77.71310420807542</heading>
					</LookAt>
					<Style>
						<IconStyle>
							<heading>270</heading>
							<Icon>
								<href>http://maps.google.com/mapfiles/kml/pal4/icon28.png</href>
							</Icon>
						</IconStyle>
						<BalloonStyle>
							<text><![CDATA[<p>Visit ACTHPA website for <a href="http://www.acthpa.org/index.php?option=com_content&task=view&id=20&Itemid=28">detailed information</a>.</p>]]></text>
							<textColor>ff000000</textColor>
							<displayMode>default</displayMode>
						</BalloonStyle>
					</Style>
					<Point>
						<coordinates>149.3740919332313,-35.09501519645946,0</coordinates>
					</Point>
				</Placemark>
				<Placemark>
					<name>Lake George LZ</name>
					<LookAt>
						<longitude>149.408402378732</longitude>
						<latitude>-35.06276645561151</latitude>
						<altitude>0</altitude>
						<range>19327.64341650626</range>
						<tilt>45.13380333361738</tilt>
						<heading>11.05292222486872</heading>
					</LookAt>
					<styleUrl>#lz</styleUrl>
					<Polygon>
						<tessellate>1</tessellate>
						<outerBoundaryIs>
							<LinearRing id="khLinearRing919">
								<coordinates>
									149.3763795385747,-35.08409124699809,0 149.3799960084598,-35.10291814711093,0 149.403879679328,-35.0978675202737,0 149.3970015307278,-35.0839892710369,0 149.3763795385747,-35.08409124699809,0
								</coordinates>
							</LinearRing>
						</outerBoundaryIs>
					</Polygon>
				</Placemark>
			</Folder>
			<Folder>
				<name>Collector</name>
				<open>1</open>
				<LookAt>
					<longitude>149.3936681040336</longitude>
					<latitude>-34.97226165112511</latitude>
					<altitude>0</altitude>
					<range>5178.346964736736</range>
					<tilt>28.94152355499942</tilt>
					<heading>97.240932019086</heading>
				</LookAt>
				<Placemark>
					<name>Retrieve</name>
					<LookAt>
						<longitude>149.3980141694331</longitude>
						<latitude>-34.95346635233614</latitude>
						<altitude>0</altitude>
						<range>6461.855136605522</range>
						<tilt>26.63614354242225</tilt>
						<heading>0.001195591592401814</heading>
					</LookAt>
					<styleUrl>#retrieve</styleUrl>
					<LineString>
						<tessellate>1</tessellate>
						<coordinates>
							149.387749274848,-34.97269052197454,0 149.3886383638446,-34.97288225132635,0 149.3906720706486,-34.97336540374208,0 149.3919430527562,-34.97365450302838,0 149.3933345978091,-34.97373321109731,0 149.3947131952609,-34.97329608311505,0 149.3949384590014,-34.97225684061012,0 149.395800910944,-34.97141398467298,0 149.3967925272271,-34.97067241789813,0 149.3979104976476,-34.96992849281931,0 149.3989024418639,-34.96928792653078,0 149.4000216042988,-34.96864637216986,0 149.4008786638583,-34.96759647714036,0 149.4016174393933,-34.96685897576201,0 149.4028630227769,-34.96621550932449,0 149.4038548074847,-34.96547366113231,0 149.4043396552238,-34.96463743922593,0 149.4050680183283,-34.963485883762,0 149.4054157861283,-34.96234067504287,0 149.4056402014294,-34.96130133338917,0 149.405991149385,-34.96025984000603,0 149.4064681593567,-34.95921615953972,0 149.4069445776756,-34.95817259818712,0 149.4070460709801,-34.95723920658863,0 149.4075231495685,-34.95619569331395,0 149.4077425227683,-34.95494975266044,0 149.40834836476,-34.95400758699845,0 149.4093364565396,-34.9531619142639,0 149.4101981092099,-34.95231852806555,0 149.4111777400295,-34.95116251386767,0 149.4119019939192,-34.94990760907957,0 149.4122558981787,-34.94896978974553,0 149.4127333727471,-34.94792620273418,0 149.4133289098245,-34.94667484634124,0 149.4140522070283,-34.94552549679305,0 149.414904554829,-34.94447742405374,0 149.415501258438,-34.94333093751629,0 149.4162301235371,-34.94238883924499,0 149.4169557264387,-34.94144892818436,0 149.4175565737096,-34.9406157496434,0 149.418399779076,-34.93957447620606,0 149.4190006062009,-34.93874179585824,0 149.4194989702723,-34.93768448932616,0 149.4202497076745,-34.93662161992584,0 149.4211016838469,-34.93536334177951,0 149.4219551251998,-34.93420937122058,0 149.4221810746041,-34.9331696529058,0 149.4224071968242,-34.93212973264006,0 149.4228855466936,-34.93108530685599,0 149.4232280460559,-34.92983977886833,0 149.4231992326796,-34.92880659128277,0 149.4231697778869,-34.92766810437351,0 149.4231349668606,-34.92632255610614,0 149.4231077169981,-34.92528793427202,0 149.422216585598,-34.92509950149455,0 149.4205726191059,-34.92513328347271,0 149.4193046381344,-34.92505687341659,0 149.4179104208311,-34.92487665930871,0 149.4168919175778,-34.92458627248691,0 149.4154888574542,-34.92409707604365,0 149.4140923813825,-34.92381351717559,0 149.412941532262,-34.92342788399436,0 149.4116615493834,-34.92294267692211,0 149.4107710382727,-34.92275650558573,0 149.4092402804538,-34.92227587940182,0 149.4079647293761,-34.92200305093519,0 149.4062651478507,-34.92194576529435,0 149.4047103796174,-34.92208362466119,0 149.403293168152,-34.92220926457402,0 149.4017796519621,-34.92227926034014,0 149.4005345777433,-34.92273765993939,0 149.4004314821255,-34.92377751871916,0 149.3995753459199,-34.92462828577985,0 149.3987141750482,-34.92527590061397,0 149.3976079157549,-34.92602949138639,0 149.3962565682577,-34.92666464533484,0 149.3954127170117,-34.92758706667746,0 149.3949439397963,-34.92860679652116,0 149.3945930166807,-34.92965488438774,0 149.393734952533,-34.93041893074526,0 149.3924973610993,-34.93089253811356,0 149.3913930398953,-34.93143665420055,0 149.3906743514807,-34.93235514847775,0 149.3905781369448,-34.93336161049108,0 149.3902276849917,-34.93417844722701,0 149.3897607100727,-34.9353091417744,0 149.3895495246766,-34.93674604254957,0 149.3895753587049,-34.93777615064673,0 149.3894743215382,-34.93871175088739,0 149.3895054485311,-34.93994241999589,0 149.3895289995082,-34.940860976591,0 149.3895641354796,-34.94217164145984,0 149.3892221122524,-34.94329625446001,0 149.3882591285327,-34.94432319504588,0 149.3875403661105,-34.9452431762634,0 149.3868241533165,-34.94627018772832,0 149.3858595810916,-34.94729820691683,0 149.3848960631087,-34.94833285965645,0 149.3840517670892,-34.94916303541739,0 149.383208966068,-34.95009105880762,0 149.3826141797818,-34.95101556758947,0 149.3821461279844,-34.95203959468656,0 149.3812955754553,-34.95266350556279,0 149.3805767972261,-34.9535896409211,0 149.3798631695025,-34.95471858189221,0 149.3791466240764,-34.95574600521784,0 149.3784242415578,-34.95657041344524,0 149.3777071978959,-34.9575979543739,0 149.3772379896136,-34.95872252936301,0 149.3771333682493,-34.95984121949189,0 149.3772800964896,-34.96075347205639,0 149.3773067228953,-34.96166743807757,0 149.376980240124,-34.96309365975265,0 149.3772236145886,-34.9629882973874,0
						</coordinates>
					</LineString>
				</Placemark>
				<Placemark>
					<name>Collector Launch</name>
					<LookAt>
						<longitude>149.392660907517</longitude>
						<latitude>-34.96228193746827</latitude>
						<altitude>0</altitude>
						<range>5177.964979711617</range>
						<tilt>55.11113291270532</tilt>
						<heading>97.23777804659328</heading>
					</LookAt>
					<Style>
						<IconStyle>
							<heading>270</heading>
							<Icon>
								<href>http://maps.google.com/mapfiles/kml/pal4/icon28.png</href>
							</Icon>
						</IconStyle>
						<BalloonStyle>
							<text><![CDATA[<p>Visit ACTHPA website for <a href="http://www.acthpa.org/index.php?option=com_content&task=view&id=26&Itemid=28">detailed information</a>.</p>]]></text>
							<textColor>ff000000</textColor>
							<displayMode>default</displayMode>
						</BalloonStyle>
					</Style>
					<Point>
						<coordinates>149.3783316890587,-34.96374065683868,0</coordinates>
					</Point>
				</Placemark>
				<Placemark>
					<name>Collector LZ</name>
					<LookAt>
						<longitude>149.3936681040336</longitude>
						<latitude>-34.97226165112511</latitude>
						<altitude>0</altitude>
						<range>5178.346964736736</range>
						<tilt>28.94152355499942</tilt>
						<heading>97.240932019086</heading>
					</LookAt>
					<styleUrl>#lz</styleUrl>
					<Polygon>
						<tessellate>1</tessellate>
						<outerBoundaryIs>
							<LinearRing>
								<coordinates>
									149.3820020654039,-34.96481092561865,0 149.3815294757881,-34.96595354608932,0 149.3811796752293,-34.96699092071638,0 149.3808258657656,-34.96792640766322,0 149.3801088039546,-34.96938330224881,0 149.3790272927365,-34.97051267312401,0 149.3786822295872,-34.97143636775593,0 149.3783474899513,-34.97255841348213,0 149.3781326500892,-34.973577579194,0 149.3786568516645,-34.97481394403932,0 149.3798871258876,-34.97494131585999,0 149.3813889650545,-34.97547648030425,0 149.382654800456,-34.97566274484352,0 149.3839096087071,-34.97543735573932,0 149.3850444464461,-34.97541972810686,0 149.3865578254406,-34.97539869357875,0 149.3880723433786,-34.97537388538333,0 149.3889315200795,-34.97442816563996,0 149.3891487839396,-34.97308053307314,0 149.3892452349241,-34.9719415475282,0 149.3897232569795,-34.97089940191138,0 149.3897016233009,-34.97007239578415,0 149.389668862294,-34.96882970622109,0 149.3900177075641,-34.96768474691955,0 149.3899850365851,-34.96644297086718,0 149.3894529471858,-34.96541757901568,0 149.3893077731161,-34.96469596845145,0 149.3820020654039,-34.96481092561865,0
								</coordinates>
							</LinearRing>
						</outerBoundaryIs>
					</Polygon>
				</Placemark>
			</Folder>
			<Folder>
				<name>Pig Hill</name>
				<open>1</open>
				<LookAt>
					<longitude>148.8994460582009</longitude>
					<latitude>-35.22735892255855</latitude>
					<altitude>0</altitude>
					<range>3619.891697196458</range>
					<tilt>64.93534485332722</tilt>
					<heading>-145.763081134455</heading>
				</LookAt>
				<Placemark>
					<name>Retrieve</name>
					<LookAt>
						<longitude>148.9000354370022</longitude>
						<latitude>-35.23351595601093</latitude>
						<altitude>0</altitude>
						<range>3387.109125363626</range>
						<tilt>31.30795817946003</tilt>
						<heading>-69.30383979832236</heading>
					</LookAt>
					<styleUrl>#retrieve</styleUrl>
					<LineString>
						<tessellate>1</tessellate>
						<coordinates>
							148.9121886582233,-35.22365718596605,0 148.913057199409,-35.22716890180901,0 148.9127215141324,-35.23033862964113,0 148.912209194895,-35.23331000180107,0 148.9127809140824,-35.23626120601701,0 148.9124037069553,-35.2395970665441,0 148.9121513603033,-35.24006042796248,0 148.9120645267496,-35.2406303043536,0 148.9116022472862,-35.24102032983316,0 148.9114370246987,-35.24154389147794,0 148.9115247854867,-35.24198203834367,0 148.9097268153577,-35.24425462670845,0 148.9088467663944,-35.24525986249467,0 148.9081850413363,-35.2470694069624,0 148.907868915275,-35.24823741401994,0 148.9072752650981,-35.24761930410087,0 148.9066959347227,-35.24711205678067,0 148.9062773569316,-35.24598410555973,0 148.9058449894523,-35.24479157976116,0 148.9052551000444,-35.24385948422055,0 148.9044534658495,-35.24291653645679,0 148.9040939914709,-35.24137630863626,0 148.9031358885911,-35.24032492687481,0 148.9027691974054,-35.23946339697231,0 148.9019351721026,-35.23865208004953,0 148.901740694487,-35.23714412169825,0 148.9015997299252,-35.23600132724303,0 148.9014152538042,-35.23494458212021,0 148.9006843823557,-35.23404991880534,0 148.8998039469507,-35.23346338975211,0 148.8983877920276,-35.23280834522686,0 148.8975716849749,-35.23226588459422,0 148.895932431731,-35.23214171663413,0 148.8952504953405,-35.2312901983111,0 148.8945369163074,-35.2310253805512,0 148.8942794103492,-35.23045677670837,0 148.8940212480609,-35.23033764257241,0 148.893739810197,-35.23024452346448,0 148.8934823130066,-35.23013044866753,0 148.8932157117625,-35.22997046648754,0 148.8929101506647,-35.2299104864533,0 148.8926378525338,-35.23001231679751,0 148.8924478061844,-35.23022090910068,0 148.8922204008219,-35.23038649398954,0 148.8919177607845,-35.23032600542206,0 148.8916160437096,-35.23026498231253,0 148.8912886202103,-35.23020481687681,0 148.8910148700124,-35.23011435621041,0 148.8907350718876,-35.22997575454732,0 148.890506061682,-35.22980984901268,0 148.8903803015884,-35.22958537023003,0 148.8902565446866,-35.22935999434069,0 148.8900521686924,-35.22916937670561,0 148.8900402469322,-35.22909910995099,0 148.8894741146017,-35.22788329822644,0 148.8888289189782,-35.22730450724291,0 148.8880921639594,-35.22711743670389,0 148.8878024484003,-35.22713104594302,0 148.8875213278276,-35.22700409610879,0 148.8874670955715,-35.22680247253796,0 148.8874417816284,-35.22657518741007,0 148.8872465337617,-35.22641541739212,0 148.8870740738308,-35.22620726652826,0 148.8868477465572,-35.22609635869118,0 148.8865406333983,-35.22604078834412,0 148.8862296766347,-35.22593995004259,0 148.8859906494165,-35.22578293019129,0 148.8857202606875,-35.22572376382103,0 148.8854294043362,-35.22569094497845,0 148.8852610465576,-35.22554991257172,0 148.8865540839451,-35.22561822769855,0 148.8876240008578,-35.22579246519343,0 148.8882731822208,-35.22518048971752,0 148.8889089341802,-35.22384120547569,0 148.8891349688389,-35.22264595921682,0 148.8893514655181,-35.22196783232844,0 148.890089849452,-35.22126984372497,0 148.8907446961434,-35.22069322263368,0 148.8908334832343,-35.21997071780427,0 148.8917026786198,-35.21968531161686,0 148.8927075124341,-35.21945710557921,0 148.8933688578202,-35.21951369771295,0 148.8938567150859,-35.21952522782974,0 148.8943010608268,-35.21972920295023,0 148.894815133357,-35.22001355054548,0 148.8950190063986,-35.22034960664173,0 148.8952023553891,-35.22065873408111,0 148.8957336796363,-35.22084394719511,0 148.8959929694689,-35.22082110086405,0 148.8960862357936,-35.22085908953935,0
						</coordinates>
					</LineString>
				</Placemark>
				<Placemark>
					<name>Pig Hill Launch</name>
					<LookAt id="khLookAt825">
						<longitude>148.9085325884917</longitude>
						<latitude>-35.21936939825513</latitude>
						<altitude>0</altitude>
						<range>2792.773420151023</range>
						<tilt>47.1561938844002</tilt>
						<heading>81.1527048074343</heading>
					</LookAt>
					<Style>
						<IconStyle>
							<heading>260</heading>
							<Icon>
								<href>http://maps.google.com/mapfiles/kml/pal4/icon28.png</href>
							</Icon>
						</IconStyle>
						<BalloonStyle>
							<text><![CDATA[<p>Visit ACTHPA website for <a href="http://www.acthpa.org/index.php?option=com_content&task=view&id=17&Itemid=28">detailed information</a>.</p>]]></text>
							<textColor>ff000000</textColor>
							<displayMode>default</displayMode>
						</BalloonStyle>
					</Style>
					<Point>
						<coordinates>148.896549,-35.220767,0</coordinates>
					</Point>
				</Placemark>
				<Placemark>
					<name>Pig Hill LZ</name>
					<LookAt>
						<longitude>148.9137549163765</longitude>
						<latitude>-35.22312415692601</latitude>
						<altitude>0</altitude>
						<range>1261.664097563193</range>
						<tilt>36.94890577963779</tilt>
						<heading>81.151136074284</heading>
					</LookAt>
					<styleUrl>#lz</styleUrl>
					<Polygon>
						<tessellate>1</tessellate>
						<outerBoundaryIs>
							<LinearRing>
								<coordinates>
									148.9122448053377,-35.22173395862379,0 148.9130320377009,-35.22590701889827,0 148.9154954910647,-35.22468402673669,0 148.9155889960317,-35.22393090569344,0 148.9173037779024,-35.22244048463943,0 148.9143508437863,-35.22180805963075,0 148.9122448053377,-35.22173395862379,0
								</coordinates>
							</LinearRing>
						</outerBoundaryIs>
					</Polygon>
				</Placemark>
			</Folder>
			<Folder>
				<name>Spring Hill</name>
				<open>1</open>
				<LookAt>
					<longitude>149.0824355318811</longitude>
					<latitude>-35.0901562011996</latitude>
					<altitude>0</altitude>
					<range>2374.064860897056</range>
					<tilt>58.49482025546008</tilt>
					<heading>109.8788866361156</heading>
				</LookAt>
				<Placemark>
					<name>Retrive</name>
					<LookAt>
						<longitude>149.0794630221518</longitude>
						<latitude>-35.08807176878674</latitude>
						<altitude>0</altitude>
						<range>1239.600581085403</range>
						<tilt>56.72800003381096</tilt>
						<heading>156.7716965282738</heading>
					</LookAt>
					<styleUrl>#retrieve</styleUrl>
					<LineString>
						<tessellate>1</tessellate>
						<coordinates>
							149.0768289211633,-35.08580259490577,0 149.0773451699079,-35.08608050319074,0 149.0776756525412,-35.08617157553144,0 149.0779842046089,-35.08624461316484,0 149.078265739295,-35.08631609710206,0 149.0784654123065,-35.08642846917336,0 149.0787348904711,-35.08645736107739,0 149.0789441246308,-35.08653327134358,0 149.0792692405087,-35.08661641374206,0 149.0794621554305,-35.08670842358825,0 149.079408529471,-35.08689221151074,0 149.0791386873814,-35.08707245074032,0 149.0788062491176,-35.08742048048356,0 149.0791509669144,-35.08752413505864,0 149.0794719924868,-35.08759733365331,0 149.0797196025125,-35.08763931984189,0 149.0799781439081,-35.08768962127839,0 149.0802598918508,-35.08775855715964,0 149.0806119961384,-35.08798326072928,0 149.0807374532677,-35.08819461954089,0 149.0807357126222,-35.08842027166273,0 149.0807343283238,-35.08862514509959,0 149.0807335022115,-35.08885059761739,0 149.0807573947675,-35.08903488625263,0 149.0807798785292,-35.08923810323761,0 149.0809542520187,-35.08940579260852,0 149.0812303861595,-35.08941526927191,0 149.0813334949109,-35.08921793684882,0 149.0815351386875,-35.08908489449951,0 149.0817837092179,-35.08907466934905,0 149.0820308857404,-35.0890646100413,0 149.0822782973389,-35.08895493744636,0 149.0824505975356,-35.08884055808472,0 149.0827188978513,-35.08881262042608,0 149.0829379292262,-35.08874229987131,0 149.0831571215891,-35.08861109025707,0 149.0833518408591,-35.08847855752737,0 149.0835462630768,-35.08834622600317,0 149.0837630382219,-35.08825638152457,0 149.0839792980441,-35.08816582636689,0 149.0841720936175,-35.0880536989659,0 149.0843873599346,-35.08796353316608,0 149.0846254198824,-35.08787498312137,0 149.0848600853812,-35.0878479290949,0 149.0850737349534,-35.0877575774555,0 149.0852436888233,-35.0876033695796,0 149.0854362329802,-35.08750761715525,0 149.0856459781176,-35.08738548211402,0 149.08585785317,-35.08738990730318,0 149.0861293350407,-35.08730273940624,0 149.0863481979103,-35.08722328428488,0 149.0864788608483,-35.08733844017696,0 149.0866630069469,-35.08743745778347,0 149.0866927583602,-35.08764571508125,0 149.08679718879,-35.08783019345036,0 149.0869512592225,-35.08797374362153,0 149.0871052560313,-35.08811625186871,0 149.0872576167262,-35.08827780065171,0 149.0874363610744,-35.08844387508629,0 149.087538763475,-35.08860970656008,0 149.087741342761,-35.08882781882574,0 149.0876739156264,-35.08895965868998,0 149.0877162930641,-35.0890943248668,0 149.085620618186,-35.09174765737107,0 149.0850095914932,-35.09280973276533,0 149.0845635415536,-35.09387786376217,0 149.0837716203595,-35.09428198432369,0 149.0835380206542,-35.09460680342248,0 149.0837577790164,-35.09483220608371,0
						</coordinates>
					</LineString>
				</Placemark>
				<Placemark>
					<name>Spring Hill Launch</name>
					<LookAt>
						<longitude>149.082756893903</longitude>
						<latitude>-35.09388180541352</latitude>
						<altitude>0</altitude>
						<range>1077.450107966074</range>
						<tilt>58.29701870815485</tilt>
						<heading>-48.47763742958652</heading>
					</LookAt>
					<Style>
						<IconStyle>
							<heading>90</heading>
							<Icon>
								<href>http://maps.google.com/mapfiles/kml/pal4/icon28.png</href>
							</Icon>
						</IconStyle>
						<BalloonStyle>
							<text><![CDATA[<p>Visit ACTHPA website for <a href="http://www.acthpa.org/index.php?option=com_content&task=view&id=16&Itemid=28">detailed information</a>.</p>]]></text>
							<textColor>ff000000</textColor>
							<displayMode>default</displayMode>
						</BalloonStyle>
					</Style>
					<Point>
						<coordinates>149.0833552998324,-35.09479006182739,0</coordinates>
					</Point>
				</Placemark>
				<Placemark>
					<name>Spring Hill LZ</name>
					<LookAt>
						<longitude>149.0790454547262</longitude>
						<latitude>-35.08613532506656</latitude>
						<altitude>0</altitude>
						<range>686.7735614811072</range>
						<tilt>29.37878475354877</tilt>
						<heading>-48.48031554800386</heading>
					</LookAt>
					<styleUrl>#lz</styleUrl>
					<Polygon>
						<tessellate>1</tessellate>
						<outerBoundaryIs>
							<LinearRing>
								<coordinates>
									149.0768679477764,-35.08591718278768,0 149.0765450577497,-35.08644603378129,0 149.0787261044894,-35.08747123852591,0 149.0794788533997,-35.08676279066326,0 149.0768679477764,-35.08591718278768,0
								</coordinates>
							</LinearRing>
						</outerBoundaryIs>
					</Polygon>
				</Placemark>
			</Folder>
		</Folder>
	</Document>
</kml>
