Source

Ochs / pip-log.txt

Full commit
Downloading/unpacking BeautifulSoup==3.1.0
  Getting page http://pypi.python.org/simple/BeautifulSoup
  URLs to search for versions for BeautifulSoup==3.1.0:
  * http://pypi.python.org/simple/BeautifulSoup/3.1.0
  * http://pypi.python.org/simple/BeautifulSoup/
  Getting page http://pypi.python.org/simple/BeautifulSoup/3.1.0
  Getting page http://pypi.python.org/simple/BeautifulSoup/
  Could not fetch URL http://pypi.python.org/simple/BeautifulSoup/3.1.0: HTTP Error 404: Not Found
  Will skip URL http://pypi.python.org/simple/BeautifulSoup/3.1.0 when looking for download links for BeautifulSoup==3.1.0
  Getting page http://www.crummy.com/software/BeautifulSoup/
  Getting page http://www.crummy.com/software/BeautifulSoup/download/
  Analyzing links from page http://pypi.python.org/simple/BeautifulSoup/
    Skipping link http://www.crummy.com/software/BeautifulSoup/ (from http://pypi.python.org/simple/BeautifulSoup/); not a file
    Skipping link http://www.crummy.com/software/BeautifulSoup/download/ (from http://pypi.python.org/simple/BeautifulSoup/); not a file
  Analyzing links from page http://www.crummy.com/software/BeautifulSoup/
    Skipping link mailto:leonardr@segfault.org (from http://www.crummy.com/software/BeautifulSoup/); unknown archive format: .org
    Found link http://www.crummy.com/software/BeautifulSoup/download/3.x/BeautifulSoup-3.0.8.tar.gz (from http://www.crummy.com/software/BeautifulSoup/), version: 3.0.8
    Skipping link http://www.awaretek.com/python/index.html (from http://www.crummy.com/software/BeautifulSoup/); unknown archive format: .html
    Skipping link http://www.crummy.com/software/BeautifulSoup/#Download (from http://www.crummy.com/software/BeautifulSoup/); not a file
    Skipping link http://www.crummy.com/software/BeautifulSoup/documentation.html (from http://www.crummy.com/software/BeautifulSoup/); unknown archive format: .html
    Skipping link https://code.launchpad.net/beautifulsoup (from http://www.crummy.com/software/BeautifulSoup/); not a file
    Skipping link http://www.crummy.com/software/BeautifulSoup/CHANGELOG.html (from http://www.crummy.com/software/BeautifulSoup/); unknown archive format: .html
    Skipping link http://www.crummy.com/software/BeautifulSoup/AUTHORS.html (from http://www.crummy.com/software/BeautifulSoup/); unknown archive format: .html
    Skipping link http://groups.google.com/group/beautifulsoup (from http://www.crummy.com/software/BeautifulSoup/); not a file
    Skipping link http://www.crummy.com/software/BeautifulSoup/3.1-problems.html (from http://www.crummy.com/software/BeautifulSoup/); unknown archive format: .html
    Skipping link http://www.crummy.com/software/BeautifulSoup/download/3.x (from http://www.crummy.com/software/BeautifulSoup/); unknown archive format: .x
    Could not parse version from link: http://www.crummy.com/software/BeautifulSoup/download/BeautifulSoup.tar.gz (from http://www.crummy.com/software/BeautifulSoup/)
    Skipping link http://www.crummy.com/software/BeautifulSoup/download/BeautifulSoup.tar.gz (from http://www.crummy.com/software/BeautifulSoup/); wrong project name (not beautifulsoup)
    Skipping link http://www.crummy.com/software/BeautifulSoup/download/1.x/ (from http://www.crummy.com/software/BeautifulSoup/); unknown archive format: .x
    Skipping link http://www.crummy.com/software/BeautifulSoup/download/2.x/ (from http://www.crummy.com/software/BeautifulSoup/); unknown archive format: .x
    Skipping link https://launchpad.net/beautifulsoup (from http://www.crummy.com/software/BeautifulSoup/); not a file
    Skipping link http://www.crummy.com/source/software/BeautifulSoup/index.bhtml (from http://www.crummy.com/software/BeautifulSoup/); unknown archive format: .bhtml
    Skipping link http://www.crummy.com/self/ (from http://www.crummy.com/software/BeautifulSoup/); not a file
    Skipping link http://www.crummy.com/self/contact.html (from http://www.crummy.com/software/BeautifulSoup/); unknown archive format: .html
    Skipping link http://creativecommons.org/licenses/by-sa/2.0/ (from http://www.crummy.com/software/BeautifulSoup/); unknown archive format: .0
    Skipping link http://www.crummy.com/ (from http://www.crummy.com/software/BeautifulSoup/); not a file
    Skipping link http://www.crummy.com/software/ (from http://www.crummy.com/software/BeautifulSoup/); not a file
  Analyzing links from page http://www.crummy.com/software/BeautifulSoup/download/
    Skipping link http://www.crummy.com/software/BeautifulSoup/download/?C=N;O=D (from http://www.crummy.com/software/BeautifulSoup/download/); not a file
    Skipping link http://www.crummy.com/software/BeautifulSoup/download/?C=M;O=A (from http://www.crummy.com/software/BeautifulSoup/download/); not a file
    Skipping link http://www.crummy.com/software/BeautifulSoup/download/?C=S;O=A (from http://www.crummy.com/software/BeautifulSoup/download/); not a file
    Skipping link http://www.crummy.com/software/BeautifulSoup/download/?C=D;O=A (from http://www.crummy.com/software/BeautifulSoup/download/); not a file
    Skipping link http://www.crummy.com/software/BeautifulSoup/download/3.x/ (from http://www.crummy.com/software/BeautifulSoup/download/); unknown archive format: .x
    Found link http://www.crummy.com/software/BeautifulSoup/download/BeautifulSoup-3.1.0.1.tar.gz (from http://www.crummy.com/software/BeautifulSoup/download/), version: 3.1.0.1
    Could not parse version from link: http://www.crummy.com/software/BeautifulSoup/download/BeautifulSoup.tar.gz (from http://www.crummy.com/software/BeautifulSoup/download/)
    Skipping link http://www.crummy.com/software/BeautifulSoup/download/BeautifulSoup.tar.gz (from http://www.crummy.com/software/BeautifulSoup/download/); wrong project name (not beautifulsoup)
  Ignoring link http://www.crummy.com/software/BeautifulSoup/download/3.x/BeautifulSoup-3.0.8.tar.gz (from http://www.crummy.com/software/BeautifulSoup/), version 3.0.8 doesn't match ==3.1.0
  Ignoring link http://www.crummy.com/software/BeautifulSoup/download/BeautifulSoup-3.1.0.1.tar.gz (from http://www.crummy.com/software/BeautifulSoup/download/), version 3.1.0.1 doesn't match ==3.1.0
  Could not find a version that satisfies the requirement BeautifulSoup==3.1.0 (from versions: )
No distributions matching the version for BeautifulSoup==3.1.0
Exception information:
Traceback (most recent call last):
  File "/home/jbaird/.virtualenvs/ochs/lib/python2.6/site-packages/pip-0.6.1-py2.6.egg/pip.py", line 482, in main
    self.run(options, args)
  File "/home/jbaird/.virtualenvs/ochs/lib/python2.6/site-packages/pip-0.6.1-py2.6.egg/pip.py", line 675, in run
    requirement_set.install_files(finder, force_root_egg_info=self.bundle)
  File "/home/jbaird/.virtualenvs/ochs/lib/python2.6/site-packages/pip-0.6.1-py2.6.egg/pip.py", line 2422, in install_files
    url = finder.find_requirement(req_to_install, upgrade=self.upgrade)
  File "/home/jbaird/.virtualenvs/ochs/lib/python2.6/site-packages/pip-0.6.1-py2.6.egg/pip.py", line 1515, in find_requirement
    raise DistributionNotFound('No distributions matching the version for %s' % req)
DistributionNotFound: No distributions matching the version for BeautifulSoup==3.1.0
------------------------------------------------------------
/home/jbaird/.virtualenvs/ochs/bin/pip run on Fri Jan  8 05:47:58 2010
Downloading/unpacking BeautifulSoup
  Getting page http://pypi.python.org/simple/BeautifulSoup
  URLs to search for versions for BeautifulSoup:
  * http://pypi.python.org/simple/BeautifulSoup/
  Getting page http://pypi.python.org/simple/BeautifulSoup/
  Getting page http://www.crummy.com/software/BeautifulSoup/
  Getting page http://www.crummy.com/software/BeautifulSoup/download/
  Analyzing links from page http://pypi.python.org/simple/BeautifulSoup/
    Skipping link http://www.crummy.com/software/BeautifulSoup/ (from http://pypi.python.org/simple/BeautifulSoup/); not a file
    Skipping link http://www.crummy.com/software/BeautifulSoup/download/ (from http://pypi.python.org/simple/BeautifulSoup/); not a file
  Analyzing links from page http://www.crummy.com/software/BeautifulSoup/
    Skipping link mailto:leonardr@segfault.org (from http://www.crummy.com/software/BeautifulSoup/); unknown archive format: .org
    Found link http://www.crummy.com/software/BeautifulSoup/download/3.x/BeautifulSoup-3.0.8.tar.gz (from http://www.crummy.com/software/BeautifulSoup/), version: 3.0.8
    Skipping link http://www.awaretek.com/python/index.html (from http://www.crummy.com/software/BeautifulSoup/); unknown archive format: .html
    Skipping link http://www.crummy.com/software/BeautifulSoup/#Download (from http://www.crummy.com/software/BeautifulSoup/); not a file
    Skipping link http://www.crummy.com/software/BeautifulSoup/documentation.html (from http://www.crummy.com/software/BeautifulSoup/); unknown archive format: .html
    Skipping link https://code.launchpad.net/beautifulsoup (from http://www.crummy.com/software/BeautifulSoup/); not a file
    Skipping link http://www.crummy.com/software/BeautifulSoup/CHANGELOG.html (from http://www.crummy.com/software/BeautifulSoup/); unknown archive format: .html
    Skipping link http://www.crummy.com/software/BeautifulSoup/AUTHORS.html (from http://www.crummy.com/software/BeautifulSoup/); unknown archive format: .html
    Skipping link http://groups.google.com/group/beautifulsoup (from http://www.crummy.com/software/BeautifulSoup/); not a file
    Skipping link http://www.crummy.com/software/BeautifulSoup/3.1-problems.html (from http://www.crummy.com/software/BeautifulSoup/); unknown archive format: .html
    Skipping link http://www.crummy.com/software/BeautifulSoup/download/3.x (from http://www.crummy.com/software/BeautifulSoup/); unknown archive format: .x
    Could not parse version from link: http://www.crummy.com/software/BeautifulSoup/download/BeautifulSoup.tar.gz (from http://www.crummy.com/software/BeautifulSoup/)
    Skipping link http://www.crummy.com/software/BeautifulSoup/download/BeautifulSoup.tar.gz (from http://www.crummy.com/software/BeautifulSoup/); wrong project name (not beautifulsoup)
    Skipping link http://www.crummy.com/software/BeautifulSoup/download/1.x/ (from http://www.crummy.com/software/BeautifulSoup/); unknown archive format: .x
    Skipping link http://www.crummy.com/software/BeautifulSoup/download/2.x/ (from http://www.crummy.com/software/BeautifulSoup/); unknown archive format: .x
    Skipping link https://launchpad.net/beautifulsoup (from http://www.crummy.com/software/BeautifulSoup/); not a file
    Skipping link http://www.crummy.com/source/software/BeautifulSoup/index.bhtml (from http://www.crummy.com/software/BeautifulSoup/); unknown archive format: .bhtml
    Skipping link http://www.crummy.com/self/ (from http://www.crummy.com/software/BeautifulSoup/); not a file
    Skipping link http://www.crummy.com/self/contact.html (from http://www.crummy.com/software/BeautifulSoup/); unknown archive format: .html
    Skipping link http://creativecommons.org/licenses/by-sa/2.0/ (from http://www.crummy.com/software/BeautifulSoup/); unknown archive format: .0
    Skipping link http://www.crummy.com/ (from http://www.crummy.com/software/BeautifulSoup/); not a file
    Skipping link http://www.crummy.com/software/ (from http://www.crummy.com/software/BeautifulSoup/); not a file
  Analyzing links from page http://www.crummy.com/software/BeautifulSoup/download/
    Skipping link http://www.crummy.com/software/BeautifulSoup/download/?C=N;O=D (from http://www.crummy.com/software/BeautifulSoup/download/); not a file
    Skipping link http://www.crummy.com/software/BeautifulSoup/download/?C=M;O=A (from http://www.crummy.com/software/BeautifulSoup/download/); not a file
    Skipping link http://www.crummy.com/software/BeautifulSoup/download/?C=S;O=A (from http://www.crummy.com/software/BeautifulSoup/download/); not a file
    Skipping link http://www.crummy.com/software/BeautifulSoup/download/?C=D;O=A (from http://www.crummy.com/software/BeautifulSoup/download/); not a file
    Skipping link http://www.crummy.com/software/BeautifulSoup/download/3.x/ (from http://www.crummy.com/software/BeautifulSoup/download/); unknown archive format: .x
    Found link http://www.crummy.com/software/BeautifulSoup/download/BeautifulSoup-3.1.0.1.tar.gz (from http://www.crummy.com/software/BeautifulSoup/download/), version: 3.1.0.1
    Could not parse version from link: http://www.crummy.com/software/BeautifulSoup/download/BeautifulSoup.tar.gz (from http://www.crummy.com/software/BeautifulSoup/download/)
    Skipping link http://www.crummy.com/software/BeautifulSoup/download/BeautifulSoup.tar.gz (from http://www.crummy.com/software/BeautifulSoup/download/); wrong project name (not beautifulsoup)
  Using version 3.1.0.1 (newest of versions: 3.1.0.1, 3.0.8)
  Downloading from URL http://www.crummy.com/software/BeautifulSoup/download/BeautifulSoup-3.1.0.1.tar.gz (from http://www.crummy.com/software/BeautifulSoup/download/)
  Running setup.py egg_info for package BeautifulSoup
    running egg_info
    creating pip-egg-info/BeautifulSoup.egg-info
    writing pip-egg-info/BeautifulSoup.egg-info/PKG-INFO
    writing top-level names to pip-egg-info/BeautifulSoup.egg-info/top_level.txt
    writing dependency_links to pip-egg-info/BeautifulSoup.egg-info/dependency_links.txt
    writing manifest file 'pip-egg-info/BeautifulSoup.egg-info/SOURCES.txt'
    warning: manifest_maker: standard file '-c' not found
    reading manifest file 'pip-egg-info/BeautifulSoup.egg-info/SOURCES.txt'
    writing manifest file 'pip-egg-info/BeautifulSoup.egg-info/SOURCES.txt'
Installing collected packages: BeautifulSoup
  Running setup.py install for BeautifulSoup
    Running command /home/jbaird/.virtualenvs/ochs/bin/python -c "import setuptools; __file__='/home/jbaird/.virtualenvs/ochs/build/BeautifulSoup/setup.py'; execfile('/home/jbaird/.virtualenvs/ochs/build/BeautifulSoup/setup.py')" install --single-version-externally-managed --record /tmp/pip-OqFtii-record/install-record.txt --install-headers /home/jbaird/.virtualenvs/ochs/lib/include
    running install
    running build
    running build_py
    creating build
    creating build/lib.linux-x86_64-2.6
    copying BeautifulSoup.py -> build/lib.linux-x86_64-2.6
    copying BeautifulSoupTests.py -> build/lib.linux-x86_64-2.6
    running build_scripts
    creating build/scripts-2.6
    copying testall.sh -> build/scripts-2.6
    copying to3.sh -> build/scripts-2.6
    changing mode of build/scripts-2.6/testall.sh from 644 to 755
    changing mode of build/scripts-2.6/to3.sh from 644 to 755
    running install_lib
    copying build/lib.linux-x86_64-2.6/BeautifulSoupTests.py -> /home/jbaird/.virtualenvs/ochs/lib/python2.6/site-packages
    copying build/lib.linux-x86_64-2.6/BeautifulSoup.py -> /home/jbaird/.virtualenvs/ochs/lib/python2.6/site-packages
    byte-compiling /home/jbaird/.virtualenvs/ochs/lib/python2.6/site-packages/BeautifulSoupTests.py to BeautifulSoupTests.pyc
    byte-compiling /home/jbaird/.virtualenvs/ochs/lib/python2.6/site-packages/BeautifulSoup.py to BeautifulSoup.pyc
    running install_egg_info
    running egg_info
    creating BeautifulSoup.egg-info
    writing BeautifulSoup.egg-info/PKG-INFO
    writing top-level names to BeautifulSoup.egg-info/top_level.txt
    writing dependency_links to BeautifulSoup.egg-info/dependency_links.txt
    writing manifest file 'BeautifulSoup.egg-info/SOURCES.txt'
    warning: manifest_maker: standard file '-c' not found
    reading manifest file 'BeautifulSoup.egg-info/SOURCES.txt'
    writing manifest file 'BeautifulSoup.egg-info/SOURCES.txt'
    Copying BeautifulSoup.egg-info to /home/jbaird/.virtualenvs/ochs/lib/python2.6/site-packages/BeautifulSoup-3.1.0.1-py2.6.egg-info
    running install_scripts
    copying build/scripts-2.6/testall.sh -> /home/jbaird/.virtualenvs/ochs/bin
    copying build/scripts-2.6/to3.sh -> /home/jbaird/.virtualenvs/ochs/bin
    changing mode of /home/jbaird/.virtualenvs/ochs/bin/testall.sh to 755
    changing mode of /home/jbaird/.virtualenvs/ochs/bin/to3.sh to 755
    writing list of installed files to '/tmp/pip-OqFtii-record/install-record.txt'
Exception:
Traceback (most recent call last):
  File "/home/jbaird/.virtualenvs/ochs/lib/python2.6/site-packages/pip-0.6.1-py2.6.egg/pip.py", line 482, in main
    self.run(options, args)
  File "/home/jbaird/.virtualenvs/ochs/lib/python2.6/site-packages/pip-0.6.1-py2.6.egg/pip.py", line 677, in run
    requirement_set.install(install_options)
  File "/home/jbaird/.virtualenvs/ochs/lib/python2.6/site-packages/pip-0.6.1-py2.6.egg/pip.py", line 2749, in install
    requirement.install(install_options)
  File "/home/jbaird/.virtualenvs/ochs/lib/python2.6/site-packages/pip-0.6.1-py2.6.egg/pip.py", line 2140, in install
    cwd=self.source_dir, filter_stdout=self._filter_install, show_stdout=False)
  File "/home/jbaird/.virtualenvs/ochs/lib/python2.6/site-packages/pip-0.6.1-py2.6.egg/pip.py", line 4329, in call_subprocess
    line = stdout.readline()
KeyboardInterrupt
------------------------------------------------------------
/home/jbaird/.virtualenvs/ochs/bin/pip run on Fri Jan  8 07:04:50 2010
Downloading/unpacking Imaging
  Getting page http://pypi.python.org/simple/Imaging
  Could not fetch URL http://pypi.python.org/simple/Imaging: HTTP Error 404: Not Found
  Will skip URL http://pypi.python.org/simple/Imaging when looking for download links for Imaging
  Getting page http://pypi.python.org/simple/
  URLs to search for versions for Imaging:
  * http://pypi.python.org/simple/Imaging/
  Getting page http://pypi.python.org/simple/Imaging/
  Could not fetch URL http://pypi.python.org/simple/Imaging/: HTTP Error 404: Not Found
  Will skip URL http://pypi.python.org/simple/Imaging/ when looking for download links for Imaging
  Could not find any downloads that satisfy the requirement Imaging
No distributions at all found for Imaging
Exception information:
Traceback (most recent call last):
  File "/home/jbaird/.virtualenvs/ochs/lib/python2.6/site-packages/pip-0.6.1-py2.6.egg/pip.py", line 482, in main
    self.run(options, args)
  File "/home/jbaird/.virtualenvs/ochs/lib/python2.6/site-packages/pip-0.6.1-py2.6.egg/pip.py", line 675, in run
    requirement_set.install_files(finder, force_root_egg_info=self.bundle)
  File "/home/jbaird/.virtualenvs/ochs/lib/python2.6/site-packages/pip-0.6.1-py2.6.egg/pip.py", line 2422, in install_files
    url = finder.find_requirement(req_to_install, upgrade=self.upgrade)
  File "/home/jbaird/.virtualenvs/ochs/lib/python2.6/site-packages/pip-0.6.1-py2.6.egg/pip.py", line 1485, in find_requirement
    raise DistributionNotFound('No distributions at all found for %s' % req)
DistributionNotFound: No distributions at all found for Imaging