Source

SCons / test / Errors / non-executable-file.py

#!/usr/bin/env python
#
# __COPYRIGHT__
#
# Permission is hereby granted, free of charge, to any person obtaining
# a copy of this software and associated documentation files (the
# "Software"), to deal in the Software without restriction, including
# without limitation the rights to use, copy, modify, merge, publish,
# distribute, sublicense, and/or sell copies of the Software, and to
# permit persons to whom the Software is furnished to do so, subject to
# the following conditions:
#
# The above copyright notice and this permission notice shall be included
# in all copies or substantial portions of the Software.
#
# THE SOFTWARE IS PROVIDED "AS IS", WITHOUT WARRANTY OF ANY
# KIND, EXPRESS OR IMPLIED, INCLUDING BUT NOT LIMITED TO THE
# WARRANTIES OF MERCHANTABILITY, FITNESS FOR A PARTICULAR PURPOSE AND
# NONINFRINGEMENT. IN NO EVENT SHALL THE AUTHORS OR COPYRIGHT HOLDERS BE
# LIABLE FOR ANY CLAIM, DAMAGES OR OTHER LIABILITY, WHETHER IN AN ACTION
# OF CONTRACT, TORT OR OTHERWISE, ARISING FROM, OUT OF OR IN CONNECTION
# WITH THE SOFTWARE OR THE USE OR OTHER DEALINGS IN THE SOFTWARE.
#

__revision__ = "__FILE__ __REVISION__ __DATE__ __DEVELOPER__"

import os
import sys

import TestSCons

test = TestSCons.TestSCons()

not_executable = test.workpath("not_executable")

test.write(not_executable, "\n")

test.write("f1.in", "\n")

bad_command = """\
Bad command or file name
"""

unrecognized = """\
'%s' is not recognized as an internal or external command,
operable program or batch file.
scons: *** [%s] Error 1
"""

unspecified = """\
The name specified is not recognized as an
internal or external command, operable program or batch file.
scons: *** [%s] Error 1
"""

cannot_execute = """\
%s: cannot execute
scons: *** [%s] Error %s
"""

Permission_denied = """\
%s: Permission denied
scons: *** [%s] Error %s
"""

permission_denied = """\
%s: permission denied
scons: *** [%s] Error %s
"""

test.write('SConstruct', r"""
bld = Builder(action = '%s $SOURCES $TARGET')
env = Environment(BUILDERS = { 'bld': bld })
env.bld(target = 'f1', source = 'f1.in')
""" % not_executable.replace('\\', '\\\\'))

test.run(arguments='.',
         stdout = test.wrap_stdout("%s f1.in f1\n" % not_executable, error=1),
         stderr = None,
         status = 2)

test.description_set("Incorrect STDERR:\n%s\n" % test.stderr())
if os.name == 'nt':
    errs = [
        bad_command,
        unrecognized % (not_executable, 'f1'),
        unspecified % 'f1'
    ]
    test.fail_test(not test.stderr() in errs)
elif sys.platform.find('sunos') != -1:
    errs = [
        cannot_execute % ('sh: %s' % not_executable, 'f1', 1),
    ]
    test.fail_test(not test.stderr() in errs)
else:
    errs = [
        cannot_execute % (not_executable, 'f1', 126),
        Permission_denied % (not_executable, 'f1', 126),
        permission_denied % (not_executable, 'f1', 126),
    ]
    test.must_contain_any_line(test.stderr(), errs)

test.pass_test()

# Local Variables:
# tab-width:4
# indent-tabs-mode:nil
# End:
# vim: set expandtab tabstop=4 shiftwidth=4:
Tip: Filter by directory path e.g. /media app.js to search for public/media/app.js.
Tip: Use camelCasing e.g. ProjME to search for ProjectModifiedEvent.java.
Tip: Filter by extension type e.g. /repo .js to search for all .js files in the /repo directory.
Tip: Separate your search with spaces e.g. /ssh pom.xml to search for src/ssh/pom.xml.
Tip: Use ↑ and ↓ arrow keys to navigate and return to view the file.
Tip: You can also navigate files with Ctrl+j (next) and Ctrl+k (previous) and view the file with Ctrl+o.
Tip: You can also navigate files with Alt+j (next) and Alt+k (previous) and view the file with Alt+o.